module mayerkv/otus-ma-lesson-6

go 1.16

require (
	github.com/gin-gonic/gin v1.7.2
	github.com/golang-migrate/migrate/v4 v4.14.1
	github.com/jackc/pgconn v1.9.0
	github.com/jackc/pgx/v4 v4.11.0
	github.com/jmoiron/sqlx v1.3.4
	go.uber.org/dig v1.11.0
	github.com/go-playground/validator/v10 v10.4.1
)
