{
	"info": {
		"_postman_id": "fd79f67a-bbd6-4fca-bd92-d27c6ba46153",
		"name": "otus-lesson-12-homework",
		"schema": "https://schema.getpostman.com/json/collection/v2.1.0/collection.json"
	},
	"item": [
		{
			"name": "регистрация пользователя 1",
			"event": [
				{
					"listen": "prerequest",
					"script": {
						"exec": [
							"pm.cookies.clear();",
							"",
							"pm.collectionVariables.set('firstUserLogin', pm.variables.replaceIn('{{$randomEmail}}'));",
							"pm.collectionVariables.set('firstUserPassword', pm.variables.replaceIn('{{$randomPassword}}'));",
							"pm.collectionVariables.set('firstUserName', pm.variables.replaceIn('{{$randomFirstName}}'));",
							"",
							""
						],
						"type": "text/javascript"
					}
				},
				{
					"listen": "test",
					"script": {
						"exec": [
							"pm.test('status must be 302', () => {",
							"    pm.response.to.have.status(302);",
							"})",
							"",
							"pm.test('header location must be /auth/sign-in', () => {",
							"    pm.expect(pm.response.headers.get('location')).to.eql('/auth/sign-in');",
							"});"
						],
						"type": "text/javascript"
					}
				}
			],
			"protocolProfileBehavior": {
				"followRedirects": false
			},
			"request": {
				"method": "POST",
				"header": [],
				"body": {
					"mode": "urlencoded",
					"urlencoded": [
						{
							"key": "login",
							"value": "{{firstUserLogin}}",
							"type": "text"
						},
						{
							"key": "password",
							"value": "{{firstUserPassword}}",
							"type": "text"
						},
						{
							"key": "retry_password",
							"value": "{{firstUserPassword}}",
							"type": "text"
						},
						{
							"key": "name",
							"value": "{{firstUserName}}",
							"type": "text"
						},
						{
							"key": "surname",
							"value": "{{firstUserName}}",
							"type": "text"
						}
					]
				},
				"url": {
					"raw": "{{baseUrl}}/auth/sign-up",
					"host": [
						"{{baseUrl}}"
					],
					"path": [
						"auth",
						"sign-up"
					]
				}
			},
			"response": []
		},
		{
			"name": "проверка, что изменение и получение профиля пользователя недоступно без логина",
			"event": [
				{
					"listen": "test",
					"script": {
						"exec": [
							"pm.test('status must be 401', () => {",
							"    pm.response.to.have.status(401);",
							"})",
							""
						],
						"type": "text/javascript"
					}
				}
			],
			"request": {
				"method": "GET",
				"header": [],
				"url": {
					"raw": "{{baseUrl}}/users/{{firstUserId}}/profile",
					"host": [
						"{{baseUrl}}"
					],
					"path": [
						"users",
						"{{firstUserId}}",
						"profile"
					]
				}
			},
			"response": []
		},
		{
			"name": "вход пользователя 1",
			"event": [
				{
					"listen": "test",
					"script": {
						"exec": [
							"pm.test('status code is 302', () => {",
							"    pm.response.to.have.status(302);",
							"});",
							"",
							"pm.test('location is /', () => {",
							"    pm.expect(pm.response.headers.get('location')).to.eql('/');",
							"});",
							"",
							"pm.test('has cookie access-token', () => {",
							"    pm.expect(pm.cookies.has('access-token')).to.be.true;",
							"});",
							"",
							"pm.test('has cookie refresh-token', () => {",
							"    pm.expect(pm.cookies.has('refresh-token')).to.be.true;",
							"});"
						],
						"type": "text/javascript"
					}
				}
			],
			"protocolProfileBehavior": {
				"followRedirects": false
			},
			"request": {
				"method": "POST",
				"header": [],
				"body": {
					"mode": "urlencoded",
					"urlencoded": [
						{
							"key": "login",
							"value": "{{firstUserLogin}}",
							"type": "text"
						},
						{
							"key": "password",
							"value": "{{firstUserPassword}}",
							"type": "text"
						}
					]
				},
				"url": {
					"raw": "{{baseUrl}}/auth/sign-in",
					"host": [
						"{{baseUrl}}"
					],
					"path": [
						"auth",
						"sign-in"
					]
				}
			},
			"response": []
		},
		{
			"name": "проверка регистрации пользователь 1",
			"event": [
				{
					"listen": "test",
					"script": {
						"exec": [
							"pm.test('response has header x-user-id', () => {",
							"    pm.response.to.have.header('x-user-id');",
							"});",
							"",
							"pm.test('response has header x-auth-token', () => {",
							"    pm.response.to.have.header('x-auth-token');",
							"});",
							"",
							"pm.test('response has header x-username', () => {",
							"    pm.response.to.have.header('x-username');",
							"});",
							"",
							"pm.test('heder x-username must be equal first user login', () => {",
							"    const header = pm.response.headers.get('x-username');",
							"",
							"    pm.expect(header).to.be.eql(pm.collectionVariables.get('firstUserLogin'));",
							"});",
							"",
							"pm.collectionVariables.set('firstUserId', pm.response.headers.get('x-user-id'));"
						],
						"type": "text/javascript"
					}
				}
			],
			"request": {
				"method": "GET",
				"header": [],
				"url": {
					"raw": "{{baseUrl}}/auth/check",
					"host": [
						"{{baseUrl}}"
					],
					"path": [
						"auth",
						"check"
					]
				}
			},
			"response": []
		},
		{
			"name": "изменение профиля пользователя 1",
			"event": [
				{
					"listen": "prerequest",
					"script": {
						"exec": [
							"pm.collectionVariables.set('firstUserNewName', pm.variables.replaceIn('{{$randomFirstName}}'));"
						],
						"type": "text/javascript"
					}
				},
				{
					"listen": "test",
					"script": {
						"exec": [
							"pm.test('response status 200', () => {",
							"    pm.response.to.have.status(200);",
							"});"
						],
						"type": "text/javascript"
					}
				}
			],
			"request": {
				"method": "PATCH",
				"header": [],
				"body": {
					"mode": "raw",
					"raw": "{\n    \"name\": \"{{firstUserNewName}}\",\n    \"surname\": \"{{firstUserNewName}}\"\n}",
					"options": {
						"raw": {
							"language": "json"
						}
					}
				},
				"url": {
					"raw": "{{baseUrl}}/users/{{firstUserId}}/profile",
					"host": [
						"{{baseUrl}}"
					],
					"path": [
						"users",
						"{{firstUserId}}",
						"profile"
					]
				}
			},
			"response": []
		},
		{
			"name": "проверка, что профиль поменялся",
			"event": [
				{
					"listen": "prerequest",
					"script": {
						"exec": [
							""
						],
						"type": "text/javascript"
					}
				},
				{
					"listen": "test",
					"script": {
						"exec": [
							"pm.test('check new username', () => {",
							"    var jsonData = pm.response.json();",
							"",
							"    pm.expect(jsonData.Name).to.eql(pm.collectionVariables.get('firstUserNewName'));",
							"    pm.expect(jsonData.Surname).to.eql(pm.collectionVariables.get('firstUserNewName'));",
							"});"
						],
						"type": "text/javascript"
					}
				}
			],
			"request": {
				"method": "GET",
				"header": [],
				"url": {
					"raw": "{{baseUrl}}/users/{{firstUserId}}/profile",
					"host": [
						"{{baseUrl}}"
					],
					"path": [
						"users",
						"{{firstUserId}}",
						"profile"
					]
				}
			},
			"response": []
		},
		{
			"name": "регистрация пользователя 2",
			"event": [
				{
					"listen": "prerequest",
					"script": {
						"exec": [
							"pm.cookies.clear();",
							"",
							"pm.collectionVariables.set('secondUserLogin', pm.variables.replaceIn('{{$randomEmail}}'));",
							"pm.collectionVariables.set('secondUserPassword', pm.variables.replaceIn('{{$randomPassword}}'));",
							"pm.collectionVariables.set('secondUserName', pm.variables.replaceIn('{{$randomFirstName}}'));",
							"",
							""
						],
						"type": "text/javascript"
					}
				},
				{
					"listen": "test",
					"script": {
						"exec": [
							"pm.test('status must be 302', () => {",
							"    pm.response.to.have.status(302);",
							"})",
							"",
							"pm.test('header location must be /auth/sign-in', () => {",
							"    pm.expect(pm.response.headers.get('location')).to.eql('/auth/sign-in');",
							"});"
						],
						"type": "text/javascript"
					}
				}
			],
			"protocolProfileBehavior": {
				"followRedirects": false
			},
			"request": {
				"method": "POST",
				"header": [],
				"body": {
					"mode": "urlencoded",
					"urlencoded": [
						{
							"key": "login",
							"value": "{{secondUserLogin}}",
							"type": "text"
						},
						{
							"key": "password",
							"value": "{{secondUserPassword}}",
							"type": "text"
						},
						{
							"key": "retry_password",
							"value": "{{secondUserPassword}}",
							"type": "text"
						},
						{
							"key": "name",
							"value": "{{secondUserName}}",
							"type": "text"
						},
						{
							"key": "surname",
							"value": "{{secondUserName}}",
							"type": "text"
						}
					]
				},
				"url": {
					"raw": "{{baseUrl}}/auth/sign-up",
					"host": [
						"{{baseUrl}}"
					],
					"path": [
						"auth",
						"sign-up"
					]
				}
			},
			"response": []
		},
		{
			"name": "вход пользователя 2",
			"event": [
				{
					"listen": "test",
					"script": {
						"exec": [
							"pm.test('status code is 302', () => {",
							"    pm.response.to.have.status(302);",
							"});",
							"",
							"pm.test('location is /', () => {",
							"    pm.expect(pm.response.headers.get('location')).to.eql('/');",
							"});",
							"",
							"pm.test('has cookie access-token', () => {",
							"    pm.expect(pm.cookies.has('access-token')).to.be.true;",
							"});",
							"",
							"pm.test('has cookie refresh-token', () => {",
							"    pm.expect(pm.cookies.has('refresh-token')).to.be.true;",
							"});"
						],
						"type": "text/javascript"
					}
				}
			],
			"protocolProfileBehavior": {
				"followRedirects": false
			},
			"request": {
				"method": "POST",
				"header": [],
				"body": {
					"mode": "urlencoded",
					"urlencoded": [
						{
							"key": "login",
							"value": "{{secondUserLogin}}",
							"type": "text"
						},
						{
							"key": "password",
							"value": "{{secondUserPassword}}",
							"type": "text"
						}
					]
				},
				"url": {
					"raw": "{{baseUrl}}/auth/sign-in",
					"host": [
						"{{baseUrl}}"
					],
					"path": [
						"auth",
						"sign-in"
					]
				}
			},
			"response": []
		},
		{
			"name": "проверка, что пользователь2 не имеет доступа на чтение и редактирование профиля пользователя1",
			"event": [
				{
					"listen": "test",
					"script": {
						"exec": [
							"pm.test('response code must be 403', () => {",
							"    pm.response.to.have.status(403);",
							"})"
						],
						"type": "text/javascript"
					}
				}
			],
			"request": {
				"method": "GET",
				"header": [],
				"url": {
					"raw": "{{baseUrl}}/users/{{firstUserId}}/profile",
					"host": [
						"{{baseUrl}}"
					],
					"path": [
						"users",
						"{{firstUserId}}",
						"profile"
					]
				}
			},
			"response": []
		}
	],
	"event": [
		{
			"listen": "prerequest",
			"script": {
				"type": "text/javascript",
				"exec": [
					""
				]
			}
		},
		{
			"listen": "test",
			"script": {
				"type": "text/javascript",
				"exec": [
					""
				]
			}
		}
	],
	"variable": [
		{
			"key": "baseUrl",
			"value": "arch.homework"
		},
		{
			"key": "firstUserId",
			"value": ""
		},
		{
			"key": "firstUserLogin",
			"value": ""
		},
		{
			"key": "firstUserPassword",
			"value": ""
		},
		{
			"key": "firstUserName",
			"value": ""
		},
		{
			"key": "secondUserId",
			"value": ""
		},
		{
			"key": "secondUserLogin",
			"value": ""
		},
		{
			"key": "secondUserPassword",
			"value": ""
		},
		{
			"key": "secondUserName",
			"value": ""
		},
		{
			"key": "firstUserNewName",
			"value": ""
		}
	]
}