module auth

go 1.16

require (
	github.com/gin-gonic/gin v1.7.4
	github.com/golang-jwt/jwt v3.2.2+incompatible
	github.com/google/uuid v1.3.0
	golang.org/x/crypto v0.0.0-20210817164053-32db794688a5
)
