^C:\USERS\KICJLIN\SOURCE\REPOS\HOMEWORK13.4\DEBUG\HOMEWORK13.4.OBJ
/OUT:"C:\USERS\KICJLIN\SOURCE\REPOS\HOMEWORK13.4\DEBUG\HOMEWORK13.4.EXE" /INCREMENTAL /NOLOGO KERNEL32.LIB USER32.LIB GDI32.LIB WINSPOOL.LIB COMDLG32.LIB ADVAPI32.LIB SHELL32.LIB OLE32.LIB OLEAUT32.LIB UUID.LIB ODBC32.LIB ODBCCP32.LIB /MANIFEST /MANIFESTUAC:"level='asInvoker' uiAccess='false'" /manifest:embed /DEBUG:FASTLINK /PDB:"C:\USERS\KICJLIN\SOURCE\REPOS\HOMEWORK13.4\DEBUG\HOMEWORK13.4.PDB" /SUBSYSTEM:CONSOLE /TLBID:1 /DYNAMICBASE /NXCOMPAT /IMPLIB:"C:\USERS\KICJLIN\SOURCE\REPOS\HOMEWORK13.4\DEBUG\HOMEWORK13.4.LIB" /MACHINE:X86 DEBUG\HOMEWORK13.4.OBJ
^C:\USERS\KICJLIN\SOURCE\REPOS\HOMEWORK13.4\DEBUG\HELPERS.OBJ|C:\USERS\KICJLIN\SOURCE\REPOS\HOMEWORK13.4\DEBUG\HOMEWORK13.4.OBJ
/OUT:"C:\USERS\KICJLIN\SOURCE\REPOS\HOMEWORK13.4\DEBUG\HOMEWORK13.4.EXE" /INCREMENTAL /NOLOGO KERNEL32.LIB USER32.LIB GDI32.LIB WINSPOOL.LIB COMDLG32.LIB ADVAPI32.LIB SHELL32.LIB OLE32.LIB OLEAUT32.LIB UUID.LIB ODBC32.LIB ODBCCP32.LIB /MANIFEST /MANIFESTUAC:"level='asInvoker' uiAccess='false'" /manifest:embed /DEBUG:FASTLINK /PDB:"C:\USERS\KICJLIN\SOURCE\REPOS\HOMEWORK13.4\DEBUG\HOMEWORK13.4.PDB" /SUBSYSTEM:CONSOLE /TLBID:1 /DYNAMICBASE /NXCOMPAT /IMPLIB:"C:\USERS\KICJLIN\SOURCE\REPOS\HOMEWORK13.4\DEBUG\HOMEWORK13.4.LIB" /MACHINE:X86 DEBUG\HELPERS.OBJ
DEBUG\HOMEWORK13.4.OBJ
