^C:\USERS\KICJLIN\SOURCE\REPOS\HELLOWORLD\DEBUG\HELLOWORLD.OBJ
C:\USERS\KICJLIN\SOURCE\REPOS\HELLOWORLD\DEBUG\HELLOWORLD.EXE
C:\USERS\KICJLIN\SOURCE\REPOS\HELLOWORLD\DEBUG\HELLOWORLD.ILK
C:\USERS\KICJLIN\SOURCE\REPOS\HELLOWORLD\DEBUG\HELLOWORLD.PDB
