﻿{
  "profiles": {
    "Post.Query.Api": {
      "commandName": "Project",
      "dotnetRunMessages": true,
      "launchBrowser": true,
      "launchUrl": "swagger",
      "applicationUrl": "https://localhost:7039;http://localhost:5039",
      "environmentVariables": {
        "ASPNETCORE_ENVIRONMENT": "Development",
        "KAFKA_TOPIC": "SocialMediaPostEvents"
      }
    }
  }
}
