%YAML 1.1
%TAG !u! tag:unity3d.com,2011:
--- !u!29 &1
OcclusionCullingSettings:
  m_ObjectHideFlags: 0
  serializedVersion: 2
  m_OcclusionBakeSettings:
    smallestOccluder: 5
    smallestHole: 0.25
    backfaceThreshold: 100
  m_SceneGUID: 00000000000000000000000000000000
  m_OcclusionCullingData: {fileID: 0}
--- !u!104 &2
RenderSettings:
  m_ObjectHideFlags: 0
  serializedVersion: 8
  m_Fog: 0
  m_FogColor: {r: 0.5, g: 0.5, b: 0.5, a: 1}
  m_FogMode: 3
  m_FogDensity: 0.01
  m_LinearFogStart: 0
  m_LinearFogEnd: 300
  m_AmbientSkyColor: {r: 0.212, g: 0.227, b: 0.259, a: 1}
  m_AmbientEquatorColor: {r: 0.114, g: 0.125, b: 0.133, a: 1}
  m_AmbientGroundColor: {r: 0.047, g: 0.043, b: 0.035, a: 1}
  m_AmbientIntensity: 1
  m_AmbientMode: 0
  m_SubtractiveShadowColor: {r: 0.42, g: 0.478, b: 0.627, a: 1}
  m_SkyboxMaterial: {fileID: 10304, guid: 0000000000000000f000000000000000, type: 0}
  m_HaloStrength: 0.5
  m_FlareStrength: 1
  m_FlareFadeSpeed: 3
  m_HaloTexture: {fileID: 0}
  m_SpotCookie: {fileID: 10001, guid: 0000000000000000e000000000000000, type: 0}
  m_DefaultReflectionMode: 0
  m_DefaultReflectionResolution: 128
  m_ReflectionBounces: 1
  m_ReflectionIntensity: 1
  m_CustomReflection: {fileID: 0}
  m_Sun: {fileID: 0}
  m_IndirectSpecularColor: {r: 0.44657844, g: 0.49641222, b: 0.57481694, a: 1}
--- !u!157 &3
LightmapSettings:
  m_ObjectHideFlags: 0
  serializedVersion: 11
  m_GIWorkflowMode: 0
  m_GISettings:
    serializedVersion: 2
    m_BounceScale: 1
    m_IndirectOutputScale: 1
    m_AlbedoBoost: 1
    m_TemporalCoherenceThreshold: 1
    m_EnvironmentLightingMode: 0
    m_EnableBakedLightmaps: 1
    m_EnableRealtimeLightmaps: 1
  m_LightmapEditorSettings:
    serializedVersion: 9
    m_Resolution: 2
    m_BakeResolution: 40
    m_TextureWidth: 1024
    m_TextureHeight: 1024
    m_AO: 0
    m_AOMaxDistance: 1
    m_CompAOExponent: 1
    m_CompAOExponentDirect: 0
    m_Padding: 2
    m_LightmapParameters: {fileID: 0}
    m_LightmapsBakeMode: 1
    m_TextureCompression: 1
    m_FinalGather: 0
    m_FinalGatherFiltering: 1
    m_FinalGatherRayCount: 256
    m_ReflectionCompression: 2
    m_MixedBakeMode: 2
    m_BakeBackend: 0
    m_PVRSampling: 1
    m_PVRDirectSampleCount: 32
    m_PVRSampleCount: 500
    m_PVRBounces: 2
    m_PVRFilterTypeDirect: 0
    m_PVRFilterTypeIndirect: 0
    m_PVRFilterTypeAO: 0
    m_PVRFilteringMode: 1
    m_PVRCulling: 1
    m_PVRFilteringGaussRadiusDirect: 1
    m_PVRFilteringGaussRadiusIndirect: 5
    m_PVRFilteringGaussRadiusAO: 2
    m_PVRFilteringAtrousPositionSigmaDirect: 0.5
    m_PVRFilteringAtrousPositionSigmaIndirect: 2
    m_PVRFilteringAtrousPositionSigmaAO: 1
    m_ShowResolutionOverlay: 1
  m_LightingDataAsset: {fileID: 0}
  m_UseShadowmask: 1
--- !u!196 &4
NavMeshSettings:
  serializedVersion: 2
  m_ObjectHideFlags: 0
  m_BuildSettings:
    serializedVersion: 2
    agentTypeID: 0
    agentRadius: 0.5
    agentHeight: 2
    agentSlope: 45
    agentClimb: 0.4
    ledgeDropHeight: 0
    maxJumpAcrossDistance: 0
    minRegionArea: 2
    manualCellSize: 0
    cellSize: 0.16666667
    manualTileSize: 0
    tileSize: 256
    accuratePlacement: 0
    debug:
      m_Flags: 0
  m_NavMeshData: {fileID: 0}
--- !u!1001 &187144041
Prefab:
  m_ObjectHideFlags: 0
  serializedVersion: 2
  m_Modification:
    m_TransformParent: {fileID: 0}
    m_Modifications:
    - target: {fileID: 4256117904252770, guid: 5f6f77700adeccc40aed772e55ab8509, type: 2}
      propertyPath: m_LocalPosition.x
      value: -5.603
      objectReference: {fileID: 0}
    - target: {fileID: 4256117904252770, guid: 5f6f77700adeccc40aed772e55ab8509, type: 2}
      propertyPath: m_LocalPosition.y
      value: 0.377
      objectReference: {fileID: 0}
    - target: {fileID: 4256117904252770, guid: 5f6f77700adeccc40aed772e55ab8509, type: 2}
      propertyPath: m_LocalPosition.z
      value: 0.542
      objectReference: {fileID: 0}
    - target: {fileID: 4256117904252770, guid: 5f6f77700adeccc40aed772e55ab8509, type: 2}
      propertyPath: m_LocalRotation.x
      value: -0
      objectReference: {fileID: 0}
    - target: {fileID: 4256117904252770, guid: 5f6f77700adeccc40aed772e55ab8509, type: 2}
      propertyPath: m_LocalRotation.y
      value: 0.63717866
      objectReference: {fileID: 0}
    - target: {fileID: 4256117904252770, guid: 5f6f77700adeccc40aed772e55ab8509, type: 2}
      propertyPath: m_LocalRotation.z
      value: -0
      objectReference: {fileID: 0}
    - target: {fileID: 4256117904252770, guid: 5f6f77700adeccc40aed772e55ab8509, type: 2}
      propertyPath: m_LocalRotation.w
      value: 0.77071613
      objectReference: {fileID: 0}
    - target: {fileID: 4256117904252770, guid: 5f6f77700adeccc40aed772e55ab8509, type: 2}
      propertyPath: m_RootOrder
      value: 13
      objectReference: {fileID: 0}
    - target: {fileID: 1910429656918250, guid: 5f6f77700adeccc40aed772e55ab8509, type: 2}
      propertyPath: m_Name
      value: HalfPipeDown90 (1)
      objectReference: {fileID: 0}
    - target: {fileID: 4256117904252770, guid: 5f6f77700adeccc40aed772e55ab8509, type: 2}
      propertyPath: m_LocalEulerAnglesHint.y
      value: 79.164
      objectReference: {fileID: 0}
    m_RemovedComponents: []
  m_ParentPrefab: {fileID: 100100000, guid: 5f6f77700adeccc40aed772e55ab8509, type: 2}
  m_IsPrefabParent: 0
--- !u!1001 &277165255
Prefab:
  m_ObjectHideFlags: 0
  serializedVersion: 2
  m_Modification:
    m_TransformParent: {fileID: 0}
    m_Modifications:
    - target: {fileID: 4578351028415372, guid: ca9f1bade6f3139448ab8248f558a474, type: 2}
      propertyPath: m_LocalPosition.x
      value: 1.4488068
      objectReference: {fileID: 0}
    - target: {fileID: 4578351028415372, guid: ca9f1bade6f3139448ab8248f558a474, type: 2}
      propertyPath: m_LocalPosition.y
      value: 0.3
      objectReference: {fileID: 0}
    - target: {fileID: 4578351028415372, guid: ca9f1bade6f3139448ab8248f558a474, type: 2}
      propertyPath: m_LocalPosition.z
      value: -6.0920296
      objectReference: {fileID: 0}
    - target: {fileID: 4578351028415372, guid: ca9f1bade6f3139448ab8248f558a474, type: 2}
      propertyPath: m_LocalRotation.x
      value: -0.7071068
      objectReference: {fileID: 0}
    - target: {fileID: 4578351028415372, guid: ca9f1bade6f3139448ab8248f558a474, type: 2}
      propertyPath: m_LocalRotation.y
      value: 0
      objectReference: {fileID: 0}
    - target: {fileID: 4578351028415372, guid: ca9f1bade6f3139448ab8248f558a474, type: 2}
      propertyPath: m_LocalRotation.z
      value: 0
      objectReference: {fileID: 0}
    - target: {fileID: 4578351028415372, guid: ca9f1bade6f3139448ab8248f558a474, type: 2}
      propertyPath: m_LocalRotation.w
      value: 0.7071068
      objectReference: {fileID: 0}
    - target: {fileID: 4578351028415372, guid: ca9f1bade6f3139448ab8248f558a474, type: 2}
      propertyPath: m_RootOrder
      value: 5
      objectReference: {fileID: 0}
    m_RemovedComponents: []
  m_ParentPrefab: {fileID: 100100000, guid: ca9f1bade6f3139448ab8248f558a474, type: 2}
  m_IsPrefabParent: 0
--- !u!1001 &473080506
Prefab:
  m_ObjectHideFlags: 0
  serializedVersion: 2
  m_Modification:
    m_TransformParent: {fileID: 0}
    m_Modifications:
    - target: {fileID: 4398592930439006, guid: c7544695b8098c940b483b80df4b7f80, type: 2}
      propertyPath: m_LocalPosition.x
      value: 9.856486
      objectReference: {fileID: 0}
    - target: {fileID: 4398592930439006, guid: c7544695b8098c940b483b80df4b7f80, type: 2}
      propertyPath: m_LocalPosition.y
      value: 3.6844838
      objectReference: {fileID: 0}
    - target: {fileID: 4398592930439006, guid: c7544695b8098c940b483b80df4b7f80, type: 2}
      propertyPath: m_LocalPosition.z
      value: 12.737446
      objectReference: {fileID: 0}
    - target: {fileID: 4398592930439006, guid: c7544695b8098c940b483b80df4b7f80, type: 2}
      propertyPath: m_LocalRotation.x
      value: 0.000000016787727
      objectReference: {fileID: 0}
    - target: {fileID: 4398592930439006, guid: c7544695b8098c940b483b80df4b7f80, type: 2}
      propertyPath: m_LocalRotation.y
      value: 0.6403098
      objectReference: {fileID: 0}
    - target: {fileID: 4398592930439006, guid: c7544695b8098c940b483b80df4b7f80, type: 2}
      propertyPath: m_LocalRotation.z
      value: 0.0000000139944145
      objectReference: {fileID: 0}
    - target: {fileID: 4398592930439006, guid: c7544695b8098c940b483b80df4b7f80, type: 2}
      propertyPath: m_LocalRotation.w
      value: 0.7681168
      objectReference: {fileID: 0}
    - target: {fileID: 4398592930439006, guid: c7544695b8098c940b483b80df4b7f80, type: 2}
      propertyPath: m_RootOrder
      value: 1
      objectReference: {fileID: 0}
    - target: {fileID: 1421323820621492, guid: c7544695b8098c940b483b80df4b7f80, type: 2}
      propertyPath: m_Name
      value: Cannon_Silver (3)
      objectReference: {fileID: 0}
    m_RemovedComponents: []
  m_ParentPrefab: {fileID: 100100000, guid: c7544695b8098c940b483b80df4b7f80, type: 2}
  m_IsPrefabParent: 0
--- !u!1001 &477318238
Prefab:
  m_ObjectHideFlags: 0
  serializedVersion: 2
  m_Modification:
    m_TransformParent: {fileID: 0}
    m_Modifications:
    - target: {fileID: 4398592930439006, guid: c7544695b8098c940b483b80df4b7f80, type: 2}
      propertyPath: m_LocalPosition.x
      value: 0.5210768
      objectReference: {fileID: 0}
    - target: {fileID: 4398592930439006, guid: c7544695b8098c940b483b80df4b7f80, type: 2}
      propertyPath: m_LocalPosition.y
      value: 2.5470111
      objectReference: {fileID: 0}
    - target: {fileID: 4398592930439006, guid: c7544695b8098c940b483b80df4b7f80, type: 2}
      propertyPath: m_LocalPosition.z
      value: 11.937542
      objectReference: {fileID: 0}
    - target: {fileID: 4398592930439006, guid: c7544695b8098c940b483b80df4b7f80, type: 2}
      propertyPath: m_LocalRotation.x
      value: 0.000000016787727
      objectReference: {fileID: 0}
    - target: {fileID: 4398592930439006, guid: c7544695b8098c940b483b80df4b7f80, type: 2}
      propertyPath: m_LocalRotation.y
      value: 0.6403098
      objectReference: {fileID: 0}
    - target: {fileID: 4398592930439006, guid: c7544695b8098c940b483b80df4b7f80, type: 2}
      propertyPath: m_LocalRotation.z
      value: 0.0000000139944145
      objectReference: {fileID: 0}
    - target: {fileID: 4398592930439006, guid: c7544695b8098c940b483b80df4b7f80, type: 2}
      propertyPath: m_LocalRotation.w
      value: 0.7681168
      objectReference: {fileID: 0}
    - target: {fileID: 4398592930439006, guid: c7544695b8098c940b483b80df4b7f80, type: 2}
      propertyPath: m_RootOrder
      value: 3
      objectReference: {fileID: 0}
    - target: {fileID: 1421323820621492, guid: c7544695b8098c940b483b80df4b7f80, type: 2}
      propertyPath: m_Name
      value: Cannon_Silver (1)
      objectReference: {fileID: 0}
    m_RemovedComponents: []
  m_ParentPrefab: {fileID: 100100000, guid: c7544695b8098c940b483b80df4b7f80, type: 2}
  m_IsPrefabParent: 0
--- !u!1 &615110839 stripped
GameObject:
  m_PrefabParentObject: {fileID: 1444917807988026, guid: f231b0be12a35e84090f969b022450d3,
    type: 2}
  m_PrefabInternal: {fileID: 2133968193}
--- !u!45 &615110848
Skybox:
  m_ObjectHideFlags: 0
  m_PrefabParentObject: {fileID: 0}
  m_PrefabInternal: {fileID: 0}
  m_GameObject: {fileID: 615110839}
  m_Enabled: 1
  m_CustomSkybox: {fileID: 2100000, guid: c2e7693e598d70b49b162ceebf2a05c1, type: 2}
--- !u!1001 &815990473
Prefab:
  m_ObjectHideFlags: 0
  serializedVersion: 2
  m_Modification:
    m_TransformParent: {fileID: 0}
    m_Modifications:
    - target: {fileID: 4798690457618692, guid: 2121bd85243394d40b002691399598fd, type: 2}
      propertyPath: m_LocalPosition.x
      value: -2.45
      objectReference: {fileID: 0}
    - target: {fileID: 4798690457618692, guid: 2121bd85243394d40b002691399598fd, type: 2}
      propertyPath: m_LocalPosition.y
      value: 3.18
      objectReference: {fileID: 0}
    - target: {fileID: 4798690457618692, guid: 2121bd85243394d40b002691399598fd, type: 2}
      propertyPath: m_LocalPosition.z
      value: 7.29
      objectReference: {fileID: 0}
    - target: {fileID: 4798690457618692, guid: 2121bd85243394d40b002691399598fd, type: 2}
      propertyPath: m_LocalRotation.x
      value: -0
      objectReference: {fileID: 0}
    - target: {fileID: 4798690457618692, guid: 2121bd85243394d40b002691399598fd, type: 2}
      propertyPath: m_LocalRotation.y
      value: 0.68857175
      objectReference: {fileID: 0}
    - target: {fileID: 4798690457618692, guid: 2121bd85243394d40b002691399598fd, type: 2}
      propertyPath: m_LocalRotation.z
      value: -0
      objectReference: {fileID: 0}
    - target: {fileID: 4798690457618692, guid: 2121bd85243394d40b002691399598fd, type: 2}
      propertyPath: m_LocalRotation.w
      value: 0.7251683
      objectReference: {fileID: 0}
    - target: {fileID: 4798690457618692, guid: 2121bd85243394d40b002691399598fd, type: 2}
      propertyPath: m_RootOrder
      value: 10
      objectReference: {fileID: 0}
    - target: {fileID: 1789360542065798, guid: 2121bd85243394d40b002691399598fd, type: 2}
      propertyPath: m_Name
      value: Turnstile (1)
      objectReference: {fileID: 0}
    - target: {fileID: 59990767522894420, guid: 2121bd85243394d40b002691399598fd,
        type: 2}
      propertyPath: m_ConnectedAnchor.x
      value: -2.45
      objectReference: {fileID: 0}
    - target: {fileID: 59990767522894420, guid: 2121bd85243394d40b002691399598fd,
        type: 2}
      propertyPath: m_ConnectedAnchor.z
      value: 7.29
      objectReference: {fileID: 0}
    m_RemovedComponents: []
  m_ParentPrefab: {fileID: 100100000, guid: 2121bd85243394d40b002691399598fd, type: 2}
  m_IsPrefabParent: 0
--- !u!1001 &893655463
Prefab:
  m_ObjectHideFlags: 0
  serializedVersion: 2
  m_Modification:
    m_TransformParent: {fileID: 0}
    m_Modifications:
    - target: {fileID: 4256117904252770, guid: 5f6f77700adeccc40aed772e55ab8509, type: 2}
      propertyPath: m_LocalPosition.x
      value: -3.06
      objectReference: {fileID: 0}
    - target: {fileID: 4256117904252770, guid: 5f6f77700adeccc40aed772e55ab8509, type: 2}
      propertyPath: m_LocalPosition.y
      value: 1.94
      objectReference: {fileID: 0}
    - target: {fileID: 4256117904252770, guid: 5f6f77700adeccc40aed772e55ab8509, type: 2}
      propertyPath: m_LocalPosition.z
      value: 5.75
      objectReference: {fileID: 0}
    - target: {fileID: 4256117904252770, guid: 5f6f77700adeccc40aed772e55ab8509, type: 2}
      propertyPath: m_LocalRotation.x
      value: -0
      objectReference: {fileID: 0}
    - target: {fileID: 4256117904252770, guid: 5f6f77700adeccc40aed772e55ab8509, type: 2}
      propertyPath: m_LocalRotation.y
      value: 0.9860036
      objectReference: {fileID: 0}
    - target: {fileID: 4256117904252770, guid: 5f6f77700adeccc40aed772e55ab8509, type: 2}
      propertyPath: m_LocalRotation.z
      value: -0
      objectReference: {fileID: 0}
    - target: {fileID: 4256117904252770, guid: 5f6f77700adeccc40aed772e55ab8509, type: 2}
      propertyPath: m_LocalRotation.w
      value: 0.16672431
      objectReference: {fileID: 0}
    - target: {fileID: 4256117904252770, guid: 5f6f77700adeccc40aed772e55ab8509, type: 2}
      propertyPath: m_RootOrder
      value: 8
      objectReference: {fileID: 0}
    m_RemovedComponents: []
  m_ParentPrefab: {fileID: 100100000, guid: 5f6f77700adeccc40aed772e55ab8509, type: 2}
  m_IsPrefabParent: 0
--- !u!1001 &1135253205
Prefab:
  m_ObjectHideFlags: 0
  serializedVersion: 2
  m_Modification:
    m_TransformParent: {fileID: 0}
    m_Modifications:
    - target: {fileID: 4330880141073244, guid: f8d3aad2ba03ee542be1aa232ee3bc1c, type: 2}
      propertyPath: m_LocalPosition.x
      value: 0
      objectReference: {fileID: 0}
    - target: {fileID: 4330880141073244, guid: f8d3aad2ba03ee542be1aa232ee3bc1c, type: 2}
      propertyPath: m_LocalPosition.y
      value: 0
      objectReference: {fileID: 0}
    - target: {fileID: 4330880141073244, guid: f8d3aad2ba03ee542be1aa232ee3bc1c, type: 2}
      propertyPath: m_LocalPosition.z
      value: 0
      objectReference: {fileID: 0}
    - target: {fileID: 4330880141073244, guid: f8d3aad2ba03ee542be1aa232ee3bc1c, type: 2}
      propertyPath: m_LocalRotation.x
      value: 0
      objectReference: {fileID: 0}
    - target: {fileID: 4330880141073244, guid: f8d3aad2ba03ee542be1aa232ee3bc1c, type: 2}
      propertyPath: m_LocalRotation.y
      value: 0
      objectReference: {fileID: 0}
    - target: {fileID: 4330880141073244, guid: f8d3aad2ba03ee542be1aa232ee3bc1c, type: 2}
      propertyPath: m_LocalRotation.z
      value: 0
      objectReference: {fileID: 0}
    - target: {fileID: 4330880141073244, guid: f8d3aad2ba03ee542be1aa232ee3bc1c, type: 2}
      propertyPath: m_LocalRotation.w
      value: 1
      objectReference: {fileID: 0}
    - target: {fileID: 4330880141073244, guid: f8d3aad2ba03ee542be1aa232ee3bc1c, type: 2}
      propertyPath: m_RootOrder
      value: 15
      objectReference: {fileID: 0}
    m_RemovedComponents: []
  m_ParentPrefab: {fileID: 100100000, guid: f8d3aad2ba03ee542be1aa232ee3bc1c, type: 2}
  m_IsPrefabParent: 0
--- !u!1 &1160715204
GameObject:
  m_ObjectHideFlags: 0
  m_PrefabParentObject: {fileID: 0}
  m_PrefabInternal: {fileID: 0}
  serializedVersion: 5
  m_Component:
  - component: {fileID: 1160715206}
  - component: {fileID: 1160715205}
  m_Layer: 0
  m_Name: Directional Light
  m_TagString: Untagged
  m_Icon: {fileID: 0}
  m_NavMeshLayer: 0
  m_StaticEditorFlags: 0
  m_IsActive: 1
--- !u!108 &1160715205
Light:
  m_ObjectHideFlags: 0
  m_PrefabParentObject: {fileID: 0}
  m_PrefabInternal: {fileID: 0}
  m_GameObject: {fileID: 1160715204}
  m_Enabled: 1
  serializedVersion: 8
  m_Type: 1
  m_Color: {r: 1, g: 0.95686275, b: 0.8392157, a: 1}
  m_Intensity: 0.65
  m_Range: 10
  m_SpotAngle: 30
  m_CookieSize: 10
  m_Shadows:
    m_Type: 2
    m_Resolution: -1
    m_CustomResolution: -1
    m_Strength: 1
    m_Bias: 0.05
    m_NormalBias: 0.4
    m_NearPlane: 0.2
  m_Cookie: {fileID: 0}
  m_DrawHalo: 0
  m_Flare: {fileID: 0}
  m_RenderMode: 0
  m_CullingMask:
    serializedVersion: 2
    m_Bits: 4294967295
  m_Lightmapping: 4
  m_AreaSize: {x: 1, y: 1}
  m_BounceIntensity: 1
  m_ColorTemperature: 6570
  m_UseColorTemperature: 0
  m_ShadowRadius: 0
  m_ShadowAngle: 0
--- !u!4 &1160715206
Transform:
  m_ObjectHideFlags: 0
  m_PrefabParentObject: {fileID: 0}
  m_PrefabInternal: {fileID: 0}
  m_GameObject: {fileID: 1160715204}
  m_LocalRotation: {x: 0.40821788, y: -0.23456968, z: 0.10938163, w: 0.8754261}
  m_LocalPosition: {x: 0, y: 3, z: 0}
  m_LocalScale: {x: 1, y: 1, z: 1}
  m_Children: []
  m_Father: {fileID: 0}
  m_RootOrder: 9
  m_LocalEulerAnglesHint: {x: 50, y: -30, z: 0}
--- !u!1001 &1167244582
Prefab:
  m_ObjectHideFlags: 0
  serializedVersion: 2
  m_Modification:
    m_TransformParent: {fileID: 0}
    m_Modifications:
    - target: {fileID: 114519698114975782, guid: f181fdf947f01244abe9f279bb49e411,
        type: 2}
      propertyPath: Emitters.Array.size
      value: 0
      objectReference: {fileID: 0}
    - target: {fileID: 4054333502418040, guid: f181fdf947f01244abe9f279bb49e411, type: 2}
      propertyPath: m_LocalPosition.x
      value: 4.38
      objectReference: {fileID: 0}
    - target: {fileID: 4054333502418040, guid: f181fdf947f01244abe9f279bb49e411, type: 2}
      propertyPath: m_LocalPosition.y
      value: 2.53
      objectReference: {fileID: 0}
    - target: {fileID: 4054333502418040, guid: f181fdf947f01244abe9f279bb49e411, type: 2}
      propertyPath: m_LocalPosition.z
      value: 11.48
      objectReference: {fileID: 0}
    - target: {fileID: 4054333502418040, guid: f181fdf947f01244abe9f279bb49e411, type: 2}
      propertyPath: m_LocalRotation.x
      value: 0
      objectReference: {fileID: 0}
    - target: {fileID: 4054333502418040, guid: f181fdf947f01244abe9f279bb49e411, type: 2}
      propertyPath: m_LocalRotation.y
      value: 0
      objectReference: {fileID: 0}
    - target: {fileID: 4054333502418040, guid: f181fdf947f01244abe9f279bb49e411, type: 2}
      propertyPath: m_LocalRotation.z
      value: 0
      objectReference: {fileID: 0}
    - target: {fileID: 4054333502418040, guid: f181fdf947f01244abe9f279bb49e411, type: 2}
      propertyPath: m_LocalRotation.w
      value: 1
      objectReference: {fileID: 0}
    - target: {fileID: 4054333502418040, guid: f181fdf947f01244abe9f279bb49e411, type: 2}
      propertyPath: m_RootOrder
      value: 14
      objectReference: {fileID: 0}
    - target: {fileID: 114519698114975782, guid: f181fdf947f01244abe9f279bb49e411,
        type: 2}
      propertyPath: Emitters.Array.data[0]
      value: 
      objectReference: {fileID: 0}
    m_RemovedComponents: []
  m_ParentPrefab: {fileID: 100100000, guid: f181fdf947f01244abe9f279bb49e411, type: 2}
  m_IsPrefabParent: 0
--- !u!1001 &1255436373
Prefab:
  m_ObjectHideFlags: 0
  serializedVersion: 2
  m_Modification:
    m_TransformParent: {fileID: 0}
    m_Modifications:
    - target: {fileID: 4518946097315602, guid: 89e7a0625d597a54185fbd723bf4e606, type: 2}
      propertyPath: m_LocalPosition.x
      value: 6.243
      objectReference: {fileID: 0}
    - target: {fileID: 4518946097315602, guid: 89e7a0625d597a54185fbd723bf4e606, type: 2}
      propertyPath: m_LocalPosition.y
      value: 4.17
      objectReference: {fileID: 0}
    - target: {fileID: 4518946097315602, guid: 89e7a0625d597a54185fbd723bf4e606, type: 2}
      propertyPath: m_LocalPosition.z
      value: 11.558
      objectReference: {fileID: 0}
    - target: {fileID: 4518946097315602, guid: 89e7a0625d597a54185fbd723bf4e606, type: 2}
      propertyPath: m_LocalRotation.x
      value: 0
      objectReference: {fileID: 0}
    - target: {fileID: 4518946097315602, guid: 89e7a0625d597a54185fbd723bf4e606, type: 2}
      propertyPath: m_LocalRotation.y
      value: 0
      objectReference: {fileID: 0}
    - target: {fileID: 4518946097315602, guid: 89e7a0625d597a54185fbd723bf4e606, type: 2}
      propertyPath: m_LocalRotation.z
      value: 0
      objectReference: {fileID: 0}
    - target: {fileID: 4518946097315602, guid: 89e7a0625d597a54185fbd723bf4e606, type: 2}
      propertyPath: m_LocalRotation.w
      value: 1
      objectReference: {fileID: 0}
    - target: {fileID: 4518946097315602, guid: 89e7a0625d597a54185fbd723bf4e606, type: 2}
      propertyPath: m_RootOrder
      value: 11
      objectReference: {fileID: 0}
    m_RemovedComponents: []
  m_ParentPrefab: {fileID: 100100000, guid: 89e7a0625d597a54185fbd723bf4e606, type: 2}
  m_IsPrefabParent: 0
--- !u!1001 &1392693423
Prefab:
  m_ObjectHideFlags: 0
  serializedVersion: 2
  m_Modification:
    m_TransformParent: {fileID: 0}
    m_Modifications:
    - target: {fileID: 4518946097315602, guid: 89e7a0625d597a54185fbd723bf4e606, type: 2}
      propertyPath: m_LocalPosition.x
      value: -3.152
      objectReference: {fileID: 0}
    - target: {fileID: 4518946097315602, guid: 89e7a0625d597a54185fbd723bf4e606, type: 2}
      propertyPath: m_LocalPosition.y
      value: 3.029
      objectReference: {fileID: 0}
    - target: {fileID: 4518946097315602, guid: 89e7a0625d597a54185fbd723bf4e606, type: 2}
      propertyPath: m_LocalPosition.z
      value: 5.714
      objectReference: {fileID: 0}
    - target: {fileID: 4518946097315602, guid: 89e7a0625d597a54185fbd723bf4e606, type: 2}
      propertyPath: m_LocalRotation.x
      value: 0
      objectReference: {fileID: 0}
    - target: {fileID: 4518946097315602, guid: 89e7a0625d597a54185fbd723bf4e606, type: 2}
      propertyPath: m_LocalRotation.y
      value: 0
      objectReference: {fileID: 0}
    - target: {fileID: 4518946097315602, guid: 89e7a0625d597a54185fbd723bf4e606, type: 2}
      propertyPath: m_LocalRotation.z
      value: 0
      objectReference: {fileID: 0}
    - target: {fileID: 4518946097315602, guid: 89e7a0625d597a54185fbd723bf4e606, type: 2}
      propertyPath: m_LocalRotation.w
      value: 1
      objectReference: {fileID: 0}
    - target: {fileID: 4518946097315602, guid: 89e7a0625d597a54185fbd723bf4e606, type: 2}
      propertyPath: m_RootOrder
      value: 12
      objectReference: {fileID: 0}
    - target: {fileID: 1319423804764026, guid: 89e7a0625d597a54185fbd723bf4e606, type: 2}
      propertyPath: m_Name
      value: Sphere (1)
      objectReference: {fileID: 0}
    m_RemovedComponents: []
  m_ParentPrefab: {fileID: 100100000, guid: 89e7a0625d597a54185fbd723bf4e606, type: 2}
  m_IsPrefabParent: 0
--- !u!1001 &1462775463
Prefab:
  m_ObjectHideFlags: 0
  serializedVersion: 2
  m_Modification:
    m_TransformParent: {fileID: 0}
    m_Modifications:
    - target: {fileID: 4798690457618692, guid: 2121bd85243394d40b002691399598fd, type: 2}
      propertyPath: m_LocalPosition.x
      value: -3.29
      objectReference: {fileID: 0}
    - target: {fileID: 4798690457618692, guid: 2121bd85243394d40b002691399598fd, type: 2}
      propertyPath: m_LocalPosition.y
      value: 3.18
      objectReference: {fileID: 0}
    - target: {fileID: 4798690457618692, guid: 2121bd85243394d40b002691399598fd, type: 2}
      propertyPath: m_LocalPosition.z
      value: 10.21
      objectReference: {fileID: 0}
    - target: {fileID: 4798690457618692, guid: 2121bd85243394d40b002691399598fd, type: 2}
      propertyPath: m_LocalRotation.x
      value: -0
      objectReference: {fileID: 0}
    - target: {fileID: 4798690457618692, guid: 2121bd85243394d40b002691399598fd, type: 2}
      propertyPath: m_LocalRotation.y
      value: 0.68857175
      objectReference: {fileID: 0}
    - target: {fileID: 4798690457618692, guid: 2121bd85243394d40b002691399598fd, type: 2}
      propertyPath: m_LocalRotation.z
      value: -0
      objectReference: {fileID: 0}
    - target: {fileID: 4798690457618692, guid: 2121bd85243394d40b002691399598fd, type: 2}
      propertyPath: m_LocalRotation.w
      value: 0.7251683
      objectReference: {fileID: 0}
    - target: {fileID: 4798690457618692, guid: 2121bd85243394d40b002691399598fd, type: 2}
      propertyPath: m_RootOrder
      value: 7
      objectReference: {fileID: 0}
    m_RemovedComponents: []
  m_ParentPrefab: {fileID: 100100000, guid: 2121bd85243394d40b002691399598fd, type: 2}
  m_IsPrefabParent: 0
--- !u!1001 &1544806732
Prefab:
  m_ObjectHideFlags: 0
  serializedVersion: 2
  m_Modification:
    m_TransformParent: {fileID: 0}
    m_Modifications:
    - target: {fileID: 4398592930439006, guid: c7544695b8098c940b483b80df4b7f80, type: 2}
      propertyPath: m_LocalPosition.x
      value: 2.185513
      objectReference: {fileID: 0}
    - target: {fileID: 4398592930439006, guid: c7544695b8098c940b483b80df4b7f80, type: 2}
      propertyPath: m_LocalPosition.y
      value: 2.547011
      objectReference: {fileID: 0}
    - target: {fileID: 4398592930439006, guid: c7544695b8098c940b483b80df4b7f80, type: 2}
      propertyPath: m_LocalPosition.z
      value: 13.063162
      objectReference: {fileID: 0}
    - target: {fileID: 4398592930439006, guid: c7544695b8098c940b483b80df4b7f80, type: 2}
      propertyPath: m_LocalRotation.x
      value: 0.000000016787727
      objectReference: {fileID: 0}
    - target: {fileID: 4398592930439006, guid: c7544695b8098c940b483b80df4b7f80, type: 2}
      propertyPath: m_LocalRotation.y
      value: 0.6403098
      objectReference: {fileID: 0}
    - target: {fileID: 4398592930439006, guid: c7544695b8098c940b483b80df4b7f80, type: 2}
      propertyPath: m_LocalRotation.z
      value: 0.0000000139944145
      objectReference: {fileID: 0}
    - target: {fileID: 4398592930439006, guid: c7544695b8098c940b483b80df4b7f80, type: 2}
      propertyPath: m_LocalRotation.w
      value: 0.7681168
      objectReference: {fileID: 0}
    - target: {fileID: 4398592930439006, guid: c7544695b8098c940b483b80df4b7f80, type: 2}
      propertyPath: m_RootOrder
      value: 2
      objectReference: {fileID: 0}
    - target: {fileID: 1421323820621492, guid: c7544695b8098c940b483b80df4b7f80, type: 2}
      propertyPath: m_Name
      value: Cannon_Silver (2)
      objectReference: {fileID: 0}
    m_RemovedComponents: []
  m_ParentPrefab: {fileID: 100100000, guid: c7544695b8098c940b483b80df4b7f80, type: 2}
  m_IsPrefabParent: 0
--- !u!1001 &1719998540
Prefab:
  m_ObjectHideFlags: 0
  serializedVersion: 2
  m_Modification:
    m_TransformParent: {fileID: 0}
    m_Modifications:
    - target: {fileID: 4398592930439006, guid: c7544695b8098c940b483b80df4b7f80, type: 2}
      propertyPath: m_LocalPosition.x
      value: -1.206398
      objectReference: {fileID: 0}
    - target: {fileID: 4398592930439006, guid: c7544695b8098c940b483b80df4b7f80, type: 2}
      propertyPath: m_LocalPosition.y
      value: 2.547011
      objectReference: {fileID: 0}
    - target: {fileID: 4398592930439006, guid: c7544695b8098c940b483b80df4b7f80, type: 2}
      propertyPath: m_LocalPosition.z
      value: 11.797148
      objectReference: {fileID: 0}
    - target: {fileID: 4398592930439006, guid: c7544695b8098c940b483b80df4b7f80, type: 2}
      propertyPath: m_LocalRotation.x
      value: 0.000000016787727
      objectReference: {fileID: 0}
    - target: {fileID: 4398592930439006, guid: c7544695b8098c940b483b80df4b7f80, type: 2}
      propertyPath: m_LocalRotation.y
      value: 0.6403098
      objectReference: {fileID: 0}
    - target: {fileID: 4398592930439006, guid: c7544695b8098c940b483b80df4b7f80, type: 2}
      propertyPath: m_LocalRotation.z
      value: 0.0000000139944145
      objectReference: {fileID: 0}
    - target: {fileID: 4398592930439006, guid: c7544695b8098c940b483b80df4b7f80, type: 2}
      propertyPath: m_LocalRotation.w
      value: 0.7681168
      objectReference: {fileID: 0}
    - target: {fileID: 4398592930439006, guid: c7544695b8098c940b483b80df4b7f80, type: 2}
      propertyPath: m_RootOrder
      value: 4
      objectReference: {fileID: 0}
    m_RemovedComponents: []
  m_ParentPrefab: {fileID: 100100000, guid: c7544695b8098c940b483b80df4b7f80, type: 2}
  m_IsPrefabParent: 0
--- !u!1001 &1813569076
Prefab:
  m_ObjectHideFlags: 0
  serializedVersion: 2
  m_Modification:
    m_TransformParent: {fileID: 0}
    m_Modifications:
    - target: {fileID: 224876055117194892, guid: 840abe8fcf586084bb7aff3edb131ca3,
        type: 2}
      propertyPath: m_LocalPosition.x
      value: 0
      objectReference: {fileID: 0}
    - target: {fileID: 224876055117194892, guid: 840abe8fcf586084bb7aff3edb131ca3,
        type: 2}
      propertyPath: m_LocalPosition.y
      value: 0
      objectReference: {fileID: 0}
    - target: {fileID: 224876055117194892, guid: 840abe8fcf586084bb7aff3edb131ca3,
        type: 2}
      propertyPath: m_LocalPosition.z
      value: 0
      objectReference: {fileID: 0}
    - target: {fileID: 224876055117194892, guid: 840abe8fcf586084bb7aff3edb131ca3,
        type: 2}
      propertyPath: m_LocalRotation.x
      value: 0
      objectReference: {fileID: 0}
    - target: {fileID: 224876055117194892, guid: 840abe8fcf586084bb7aff3edb131ca3,
        type: 2}
      propertyPath: m_LocalRotation.y
      value: 0
      objectReference: {fileID: 0}
    - target: {fileID: 224876055117194892, guid: 840abe8fcf586084bb7aff3edb131ca3,
        type: 2}
      propertyPath: m_LocalRotation.z
      value: 0
      objectReference: {fileID: 0}
    - target: {fileID: 224876055117194892, guid: 840abe8fcf586084bb7aff3edb131ca3,
        type: 2}
      propertyPath: m_LocalRotation.w
      value: 1
      objectReference: {fileID: 0}
    - target: {fileID: 224876055117194892, guid: 840abe8fcf586084bb7aff3edb131ca3,
        type: 2}
      propertyPath: m_RootOrder
      value: 6
      objectReference: {fileID: 0}
    - target: {fileID: 224876055117194892, guid: 840abe8fcf586084bb7aff3edb131ca3,
        type: 2}
      propertyPath: m_AnchoredPosition.x
      value: 0
      objectReference: {fileID: 0}
    - target: {fileID: 224876055117194892, guid: 840abe8fcf586084bb7aff3edb131ca3,
        type: 2}
      propertyPath: m_AnchoredPosition.y
      value: 0
      objectReference: {fileID: 0}
    - target: {fileID: 224876055117194892, guid: 840abe8fcf586084bb7aff3edb131ca3,
        type: 2}
      propertyPath: m_SizeDelta.x
      value: 0
      objectReference: {fileID: 0}
    - target: {fileID: 224876055117194892, guid: 840abe8fcf586084bb7aff3edb131ca3,
        type: 2}
      propertyPath: m_SizeDelta.y
      value: 0
      objectReference: {fileID: 0}
    - target: {fileID: 224876055117194892, guid: 840abe8fcf586084bb7aff3edb131ca3,
        type: 2}
      propertyPath: m_AnchorMin.x
      value: 0
      objectReference: {fileID: 0}
    - target: {fileID: 224876055117194892, guid: 840abe8fcf586084bb7aff3edb131ca3,
        type: 2}
      propertyPath: m_AnchorMin.y
      value: 0
      objectReference: {fileID: 0}
    - target: {fileID: 224876055117194892, guid: 840abe8fcf586084bb7aff3edb131ca3,
        type: 2}
      propertyPath: m_AnchorMax.x
      value: 0
      objectReference: {fileID: 0}
    - target: {fileID: 224876055117194892, guid: 840abe8fcf586084bb7aff3edb131ca3,
        type: 2}
      propertyPath: m_AnchorMax.y
      value: 0
      objectReference: {fileID: 0}
    - target: {fileID: 224876055117194892, guid: 840abe8fcf586084bb7aff3edb131ca3,
        type: 2}
      propertyPath: m_Pivot.x
      value: 0
      objectReference: {fileID: 0}
    - target: {fileID: 224876055117194892, guid: 840abe8fcf586084bb7aff3edb131ca3,
        type: 2}
      propertyPath: m_Pivot.y
      value: 0
      objectReference: {fileID: 0}
    m_RemovedComponents: []
  m_ParentPrefab: {fileID: 100100000, guid: 840abe8fcf586084bb7aff3edb131ca3, type: 2}
  m_IsPrefabParent: 0
--- !u!1001 &2133968193
Prefab:
  m_ObjectHideFlags: 0
  serializedVersion: 2
  m_Modification:
    m_TransformParent: {fileID: 0}
    m_Modifications:
    - target: {fileID: 4575497560361188, guid: f231b0be12a35e84090f969b022450d3, type: 2}
      propertyPath: m_LocalPosition.x
      value: 0
      objectReference: {fileID: 0}
    - target: {fileID: 4575497560361188, guid: f231b0be12a35e84090f969b022450d3, type: 2}
      propertyPath: m_LocalPosition.y
      value: 1
      objectReference: {fileID: 0}
    - target: {fileID: 4575497560361188, guid: f231b0be12a35e84090f969b022450d3, type: 2}
      propertyPath: m_LocalPosition.z
      value: -10
      objectReference: {fileID: 0}
    - target: {fileID: 4575497560361188, guid: f231b0be12a35e84090f969b022450d3, type: 2}
      propertyPath: m_LocalRotation.x
      value: 0
      objectReference: {fileID: 0}
    - target: {fileID: 4575497560361188, guid: f231b0be12a35e84090f969b022450d3, type: 2}
      propertyPath: m_LocalRotation.y
      value: 0
      objectReference: {fileID: 0}
    - target: {fileID: 4575497560361188, guid: f231b0be12a35e84090f969b022450d3, type: 2}
      propertyPath: m_LocalRotation.z
      value: 0
      objectReference: {fileID: 0}
    - target: {fileID: 4575497560361188, guid: f231b0be12a35e84090f969b022450d3, type: 2}
      propertyPath: m_LocalRotation.w
      value: 1
      objectReference: {fileID: 0}
    - target: {fileID: 4575497560361188, guid: f231b0be12a35e84090f969b022450d3, type: 2}
      propertyPath: m_RootOrder
      value: 0
      objectReference: {fileID: 0}
    m_RemovedComponents: []
  m_ParentPrefab: {fileID: 100100000, guid: f231b0be12a35e84090f969b022450d3, type: 2}
  m_IsPrefabParent: 0
