%YAML 1.1
%TAG !u! tag:unity3d.com,2011:
--- !u!29 &1
OcclusionCullingSettings:
  m_ObjectHideFlags: 0
  serializedVersion: 2
  m_OcclusionBakeSettings:
    smallestOccluder: 5
    smallestHole: 0.25
    backfaceThreshold: 100
  m_SceneGUID: 00000000000000000000000000000000
  m_OcclusionCullingData: {fileID: 0}
--- !u!104 &2
RenderSettings:
  m_ObjectHideFlags: 0
  serializedVersion: 8
  m_Fog: 0
  m_FogColor: {r: 0.5, g: 0.5, b: 0.5, a: 1}
  m_FogMode: 3
  m_FogDensity: 0.01
  m_LinearFogStart: 0
  m_LinearFogEnd: 300
  m_AmbientSkyColor: {r: 0.212, g: 0.227, b: 0.259, a: 1}
  m_AmbientEquatorColor: {r: 0.114, g: 0.125, b: 0.133, a: 1}
  m_AmbientGroundColor: {r: 0.047, g: 0.043, b: 0.035, a: 1}
  m_AmbientIntensity: 1
  m_AmbientMode: 0
  m_SubtractiveShadowColor: {r: 0.42, g: 0.478, b: 0.627, a: 1}
  m_SkyboxMaterial: {fileID: 10304, guid: 0000000000000000f000000000000000, type: 0}
  m_HaloStrength: 0.5
  m_FlareStrength: 1
  m_FlareFadeSpeed: 3
  m_HaloTexture: {fileID: 0}
  m_SpotCookie: {fileID: 10001, guid: 0000000000000000e000000000000000, type: 0}
  m_DefaultReflectionMode: 0
  m_DefaultReflectionResolution: 128
  m_ReflectionBounces: 1
  m_ReflectionIntensity: 1
  m_CustomReflection: {fileID: 0}
  m_Sun: {fileID: 0}
  m_IndirectSpecularColor: {r: 0.44657844, g: 0.49641222, b: 0.57481694, a: 1}
--- !u!157 &3
LightmapSettings:
  m_ObjectHideFlags: 0
  serializedVersion: 11
  m_GIWorkflowMode: 0
  m_GISettings:
    serializedVersion: 2
    m_BounceScale: 1
    m_IndirectOutputScale: 1
    m_AlbedoBoost: 1
    m_TemporalCoherenceThreshold: 1
    m_EnvironmentLightingMode: 0
    m_EnableBakedLightmaps: 1
    m_EnableRealtimeLightmaps: 1
  m_LightmapEditorSettings:
    serializedVersion: 9
    m_Resolution: 2
    m_BakeResolution: 40
    m_TextureWidth: 1024
    m_TextureHeight: 1024
    m_AO: 0
    m_AOMaxDistance: 1
    m_CompAOExponent: 1
    m_CompAOExponentDirect: 0
    m_Padding: 2
    m_LightmapParameters: {fileID: 0}
    m_LightmapsBakeMode: 1
    m_TextureCompression: 1
    m_FinalGather: 0
    m_FinalGatherFiltering: 1
    m_FinalGatherRayCount: 256
    m_ReflectionCompression: 2
    m_MixedBakeMode: 1
    m_BakeBackend: 0
    m_PVRSampling: 1
    m_PVRDirectSampleCount: 32
    m_PVRSampleCount: 500
    m_PVRBounces: 2
    m_PVRFilterTypeDirect: 0
    m_PVRFilterTypeIndirect: 0
    m_PVRFilterTypeAO: 0
    m_PVRFilteringMode: 0
    m_PVRCulling: 1
    m_PVRFilteringGaussRadiusDirect: 1
    m_PVRFilteringGaussRadiusIndirect: 5
    m_PVRFilteringGaussRadiusAO: 2
    m_PVRFilteringAtrousPositionSigmaDirect: 0.5
    m_PVRFilteringAtrousPositionSigmaIndirect: 2
    m_PVRFilteringAtrousPositionSigmaAO: 1
    m_ShowResolutionOverlay: 1
  m_LightingDataAsset: {fileID: 0}
  m_UseShadowmask: 0
--- !u!196 &4
NavMeshSettings:
  serializedVersion: 2
  m_ObjectHideFlags: 0
  m_BuildSettings:
    serializedVersion: 2
    agentTypeID: 0
    agentRadius: 0.5
    agentHeight: 2
    agentSlope: 45
    agentClimb: 0.4
    ledgeDropHeight: 0
    maxJumpAcrossDistance: 0
    minRegionArea: 2
    manualCellSize: 0
    cellSize: 0.16666667
    manualTileSize: 0
    tileSize: 256
    accuratePlacement: 0
    debug:
      m_Flags: 0
  m_NavMeshData: {fileID: 0}
--- !u!1 &337964089
GameObject:
  m_ObjectHideFlags: 0
  m_PrefabParentObject: {fileID: 1206511787925574, guid: 3b1e3e9155d404942bc65d9aa80120ba,
    type: 2}
  m_PrefabInternal: {fileID: 574090032}
  serializedVersion: 5
  m_Component:
  - component: {fileID: 337964093}
  - component: {fileID: 337964092}
  - component: {fileID: 337964091}
  - component: {fileID: 337964090}
  m_Layer: 0
  m_Name: ChickenBrown
  m_TagString: Untagged
  m_Icon: {fileID: 0}
  m_NavMeshLayer: 0
  m_StaticEditorFlags: 0
  m_IsActive: 1
--- !u!95 &337964090
Animator:
  serializedVersion: 3
  m_ObjectHideFlags: 0
  m_PrefabParentObject: {fileID: 95612955934908496, guid: 3b1e3e9155d404942bc65d9aa80120ba,
    type: 2}
  m_PrefabInternal: {fileID: 574090032}
  m_GameObject: {fileID: 337964089}
  m_Enabled: 1
  m_Avatar: {fileID: 9000000, guid: 7bad4e7c89be10a4083226108ffcab9d, type: 3}
  m_Controller: {fileID: 0}
  m_CullingMode: 0
  m_UpdateMode: 0
  m_ApplyRootMotion: 0
  m_LinearVelocityBlending: 0
  m_WarningMessage: 
  m_HasTransformHierarchy: 1
  m_AllowConstantClipSamplingOptimization: 1
--- !u!23 &337964091
MeshRenderer:
  m_ObjectHideFlags: 0
  m_PrefabParentObject: {fileID: 23918865209778262, guid: 3b1e3e9155d404942bc65d9aa80120ba,
    type: 2}
  m_PrefabInternal: {fileID: 574090032}
  m_GameObject: {fileID: 337964089}
  m_Enabled: 1
  m_CastShadows: 1
  m_ReceiveShadows: 1
  m_DynamicOccludee: 1
  m_MotionVectors: 1
  m_LightProbeUsage: 1
  m_ReflectionProbeUsage: 1
  m_Materials:
  - {fileID: 2100000, guid: b83d3bf75db8f704fb67e55cf64a537f, type: 2}
  m_StaticBatchInfo:
    firstSubMesh: 0
    subMeshCount: 0
  m_StaticBatchRoot: {fileID: 0}
  m_ProbeAnchor: {fileID: 0}
  m_LightProbeVolumeOverride: {fileID: 0}
  m_ScaleInLightmap: 1
  m_PreserveUVs: 0
  m_IgnoreNormalsForChartDetection: 0
  m_ImportantGI: 0
  m_StitchLightmapSeams: 0
  m_SelectedEditorRenderState: 3
  m_MinimumChartSize: 4
  m_AutoUVMaxDistance: 0.5
  m_AutoUVMaxAngle: 89
  m_LightmapParameters: {fileID: 0}
  m_SortingLayerID: 0
  m_SortingLayer: 0
  m_SortingOrder: 0
--- !u!33 &337964092
MeshFilter:
  m_ObjectHideFlags: 0
  m_PrefabParentObject: {fileID: 33953939693949920, guid: 3b1e3e9155d404942bc65d9aa80120ba,
    type: 2}
  m_PrefabInternal: {fileID: 574090032}
  m_GameObject: {fileID: 337964089}
  m_Mesh: {fileID: 4300000, guid: 7bad4e7c89be10a4083226108ffcab9d, type: 3}
--- !u!4 &337964093
Transform:
  m_ObjectHideFlags: 0
  m_PrefabParentObject: {fileID: 4309743995697292, guid: 3b1e3e9155d404942bc65d9aa80120ba,
    type: 2}
  m_PrefabInternal: {fileID: 574090032}
  m_GameObject: {fileID: 337964089}
  m_LocalRotation: {x: 0, y: -0, z: -0, w: 1}
  m_LocalPosition: {x: 1.6103033, y: 0, z: 0}
  m_LocalScale: {x: 1, y: 1, z: 1}
  m_Children: []
  m_Father: {fileID: 0}
  m_RootOrder: 5
  m_LocalEulerAnglesHint: {x: 0, y: 0, z: 0}
--- !u!1001 &442670900
Prefab:
  m_ObjectHideFlags: 0
  serializedVersion: 2
  m_Modification:
    m_TransformParent: {fileID: 0}
    m_Modifications:
    - target: {fileID: 4346093141753912, guid: 32026357c04e0e944835774b42e3c1b7, type: 2}
      propertyPath: m_LocalPosition.x
      value: -0.30744365
      objectReference: {fileID: 0}
    - target: {fileID: 4346093141753912, guid: 32026357c04e0e944835774b42e3c1b7, type: 2}
      propertyPath: m_LocalPosition.y
      value: 0
      objectReference: {fileID: 0}
    - target: {fileID: 4346093141753912, guid: 32026357c04e0e944835774b42e3c1b7, type: 2}
      propertyPath: m_LocalPosition.z
      value: 0
      objectReference: {fileID: 0}
    - target: {fileID: 4346093141753912, guid: 32026357c04e0e944835774b42e3c1b7, type: 2}
      propertyPath: m_LocalRotation.x
      value: 0
      objectReference: {fileID: 0}
    - target: {fileID: 4346093141753912, guid: 32026357c04e0e944835774b42e3c1b7, type: 2}
      propertyPath: m_LocalRotation.y
      value: -0
      objectReference: {fileID: 0}
    - target: {fileID: 4346093141753912, guid: 32026357c04e0e944835774b42e3c1b7, type: 2}
      propertyPath: m_LocalRotation.z
      value: -0
      objectReference: {fileID: 0}
    - target: {fileID: 4346093141753912, guid: 32026357c04e0e944835774b42e3c1b7, type: 2}
      propertyPath: m_LocalRotation.w
      value: 1
      objectReference: {fileID: 0}
    - target: {fileID: 4346093141753912, guid: 32026357c04e0e944835774b42e3c1b7, type: 2}
      propertyPath: m_RootOrder
      value: 3
      objectReference: {fileID: 0}
    m_RemovedComponents: []
  m_ParentPrefab: {fileID: 100100000, guid: 32026357c04e0e944835774b42e3c1b7, type: 2}
  m_RootGameObject: {fileID: 1054915895}
  m_IsPrefabParent: 0
--- !u!1001 &538597452
Prefab:
  m_ObjectHideFlags: 0
  serializedVersion: 2
  m_Modification:
    m_TransformParent: {fileID: 0}
    m_Modifications:
    - target: {fileID: 4589997030424458, guid: e82139b3bae6212439ea1e85ad29678b, type: 2}
      propertyPath: m_LocalPosition.x
      value: -2.092335
      objectReference: {fileID: 0}
    - target: {fileID: 4589997030424458, guid: e82139b3bae6212439ea1e85ad29678b, type: 2}
      propertyPath: m_LocalPosition.y
      value: 0
      objectReference: {fileID: 0}
    - target: {fileID: 4589997030424458, guid: e82139b3bae6212439ea1e85ad29678b, type: 2}
      propertyPath: m_LocalPosition.z
      value: 0
      objectReference: {fileID: 0}
    - target: {fileID: 4589997030424458, guid: e82139b3bae6212439ea1e85ad29678b, type: 2}
      propertyPath: m_LocalRotation.x
      value: 0
      objectReference: {fileID: 0}
    - target: {fileID: 4589997030424458, guid: e82139b3bae6212439ea1e85ad29678b, type: 2}
      propertyPath: m_LocalRotation.y
      value: -0
      objectReference: {fileID: 0}
    - target: {fileID: 4589997030424458, guid: e82139b3bae6212439ea1e85ad29678b, type: 2}
      propertyPath: m_LocalRotation.z
      value: -0
      objectReference: {fileID: 0}
    - target: {fileID: 4589997030424458, guid: e82139b3bae6212439ea1e85ad29678b, type: 2}
      propertyPath: m_LocalRotation.w
      value: 1
      objectReference: {fileID: 0}
    - target: {fileID: 4589997030424458, guid: e82139b3bae6212439ea1e85ad29678b, type: 2}
      propertyPath: m_RootOrder
      value: 1
      objectReference: {fileID: 0}
    m_RemovedComponents: []
  m_ParentPrefab: {fileID: 100100000, guid: e82139b3bae6212439ea1e85ad29678b, type: 2}
  m_RootGameObject: {fileID: 1935984567}
  m_IsPrefabParent: 0
--- !u!1001 &574090032
Prefab:
  m_ObjectHideFlags: 0
  serializedVersion: 2
  m_Modification:
    m_TransformParent: {fileID: 0}
    m_Modifications:
    - target: {fileID: 4309743995697292, guid: 3b1e3e9155d404942bc65d9aa80120ba, type: 2}
      propertyPath: m_LocalPosition.x
      value: 1.6103033
      objectReference: {fileID: 0}
    - target: {fileID: 4309743995697292, guid: 3b1e3e9155d404942bc65d9aa80120ba, type: 2}
      propertyPath: m_LocalPosition.y
      value: 0
      objectReference: {fileID: 0}
    - target: {fileID: 4309743995697292, guid: 3b1e3e9155d404942bc65d9aa80120ba, type: 2}
      propertyPath: m_LocalPosition.z
      value: 0
      objectReference: {fileID: 0}
    - target: {fileID: 4309743995697292, guid: 3b1e3e9155d404942bc65d9aa80120ba, type: 2}
      propertyPath: m_LocalRotation.x
      value: 0
      objectReference: {fileID: 0}
    - target: {fileID: 4309743995697292, guid: 3b1e3e9155d404942bc65d9aa80120ba, type: 2}
      propertyPath: m_LocalRotation.y
      value: -0
      objectReference: {fileID: 0}
    - target: {fileID: 4309743995697292, guid: 3b1e3e9155d404942bc65d9aa80120ba, type: 2}
      propertyPath: m_LocalRotation.z
      value: -0
      objectReference: {fileID: 0}
    - target: {fileID: 4309743995697292, guid: 3b1e3e9155d404942bc65d9aa80120ba, type: 2}
      propertyPath: m_LocalRotation.w
      value: 1
      objectReference: {fileID: 0}
    - target: {fileID: 4309743995697292, guid: 3b1e3e9155d404942bc65d9aa80120ba, type: 2}
      propertyPath: m_RootOrder
      value: 5
      objectReference: {fileID: 0}
    m_RemovedComponents: []
  m_ParentPrefab: {fileID: 100100000, guid: 3b1e3e9155d404942bc65d9aa80120ba, type: 2}
  m_RootGameObject: {fileID: 337964089}
  m_IsPrefabParent: 0
--- !u!1 &613473654
GameObject:
  m_ObjectHideFlags: 0
  m_PrefabParentObject: {fileID: 1666332355929024, guid: b6c8dd0a7a03f2c4ca7dba7c264267fd,
    type: 2}
  m_PrefabInternal: {fileID: 0}
  serializedVersion: 5
  m_Component:
  - component: {fileID: 613473656}
  - component: {fileID: 613473655}
  m_Layer: 0
  m_Name: Directional Light
  m_TagString: Untagged
  m_Icon: {fileID: 0}
  m_NavMeshLayer: 0
  m_StaticEditorFlags: 0
  m_IsActive: 1
--- !u!108 &613473655
Light:
  m_ObjectHideFlags: 0
  m_PrefabParentObject: {fileID: 108934954505301824, guid: b6c8dd0a7a03f2c4ca7dba7c264267fd,
    type: 2}
  m_PrefabInternal: {fileID: 0}
  m_GameObject: {fileID: 613473654}
  m_Enabled: 1
  serializedVersion: 8
  m_Type: 1
  m_Color: {r: 1, g: 0.95686275, b: 0.8392157, a: 1}
  m_Intensity: 1
  m_Range: 10
  m_SpotAngle: 30
  m_CookieSize: 10
  m_Shadows:
    m_Type: 2
    m_Resolution: -1
    m_CustomResolution: -1
    m_Strength: 1
    m_Bias: 0.05
    m_NormalBias: 0.4
    m_NearPlane: 0.2
  m_Cookie: {fileID: 0}
  m_DrawHalo: 0
  m_Flare: {fileID: 0}
  m_RenderMode: 0
  m_CullingMask:
    serializedVersion: 2
    m_Bits: 4294967295
  m_Lightmapping: 4
  m_AreaSize: {x: 1, y: 1}
  m_BounceIntensity: 1
  m_ColorTemperature: 6570
  m_UseColorTemperature: 0
  m_ShadowRadius: 0
  m_ShadowAngle: 0
--- !u!4 &613473656
Transform:
  m_ObjectHideFlags: 0
  m_PrefabParentObject: {fileID: 4978898444650904, guid: b6c8dd0a7a03f2c4ca7dba7c264267fd,
    type: 2}
  m_PrefabInternal: {fileID: 0}
  m_GameObject: {fileID: 613473654}
  m_LocalRotation: {x: 0.40821788, y: -0.23456968, z: 0.10938163, w: 0.8754261}
  m_LocalPosition: {x: 0, y: 3, z: 0}
  m_LocalScale: {x: 1, y: 1, z: 1}
  m_Children: []
  m_Father: {fileID: 0}
  m_RootOrder: 6
  m_LocalEulerAnglesHint: {x: 50, y: -30, z: 0}
--- !u!1001 &1038703274
Prefab:
  m_ObjectHideFlags: 0
  serializedVersion: 2
  m_Modification:
    m_TransformParent: {fileID: 0}
    m_Modifications:
    - target: {fileID: 4597376258575022, guid: de6abd774f85e18408346a3233418242, type: 2}
      propertyPath: m_LocalPosition.x
      value: -1.1854484
      objectReference: {fileID: 0}
    - target: {fileID: 4597376258575022, guid: de6abd774f85e18408346a3233418242, type: 2}
      propertyPath: m_LocalPosition.y
      value: 0
      objectReference: {fileID: 0}
    - target: {fileID: 4597376258575022, guid: de6abd774f85e18408346a3233418242, type: 2}
      propertyPath: m_LocalPosition.z
      value: 0
      objectReference: {fileID: 0}
    - target: {fileID: 4597376258575022, guid: de6abd774f85e18408346a3233418242, type: 2}
      propertyPath: m_LocalRotation.x
      value: 0
      objectReference: {fileID: 0}
    - target: {fileID: 4597376258575022, guid: de6abd774f85e18408346a3233418242, type: 2}
      propertyPath: m_LocalRotation.y
      value: -0
      objectReference: {fileID: 0}
    - target: {fileID: 4597376258575022, guid: de6abd774f85e18408346a3233418242, type: 2}
      propertyPath: m_LocalRotation.z
      value: -0
      objectReference: {fileID: 0}
    - target: {fileID: 4597376258575022, guid: de6abd774f85e18408346a3233418242, type: 2}
      propertyPath: m_LocalRotation.w
      value: 1
      objectReference: {fileID: 0}
    - target: {fileID: 4597376258575022, guid: de6abd774f85e18408346a3233418242, type: 2}
      propertyPath: m_RootOrder
      value: 2
      objectReference: {fileID: 0}
    m_RemovedComponents: []
  m_ParentPrefab: {fileID: 100100000, guid: de6abd774f85e18408346a3233418242, type: 2}
  m_RootGameObject: {fileID: 1074966184}
  m_IsPrefabParent: 0
--- !u!1 &1054915895
GameObject:
  m_ObjectHideFlags: 0
  m_PrefabParentObject: {fileID: 1522729216997060, guid: 32026357c04e0e944835774b42e3c1b7,
    type: 2}
  m_PrefabInternal: {fileID: 442670900}
  serializedVersion: 5
  m_Component:
  - component: {fileID: 1054915899}
  - component: {fileID: 1054915898}
  - component: {fileID: 1054915897}
  - component: {fileID: 1054915896}
  m_Layer: 0
  m_Name: DuckWhite
  m_TagString: Untagged
  m_Icon: {fileID: 0}
  m_NavMeshLayer: 0
  m_StaticEditorFlags: 0
  m_IsActive: 1
--- !u!95 &1054915896
Animator:
  serializedVersion: 3
  m_ObjectHideFlags: 0
  m_PrefabParentObject: {fileID: 95010028461246732, guid: 32026357c04e0e944835774b42e3c1b7,
    type: 2}
  m_PrefabInternal: {fileID: 442670900}
  m_GameObject: {fileID: 1054915895}
  m_Enabled: 1
  m_Avatar: {fileID: 9000000, guid: 82d0b33fd2ad44744aa557711150e99e, type: 3}
  m_Controller: {fileID: 0}
  m_CullingMode: 0
  m_UpdateMode: 0
  m_ApplyRootMotion: 0
  m_LinearVelocityBlending: 0
  m_WarningMessage: 
  m_HasTransformHierarchy: 1
  m_AllowConstantClipSamplingOptimization: 1
--- !u!23 &1054915897
MeshRenderer:
  m_ObjectHideFlags: 0
  m_PrefabParentObject: {fileID: 23139075055340906, guid: 32026357c04e0e944835774b42e3c1b7,
    type: 2}
  m_PrefabInternal: {fileID: 442670900}
  m_GameObject: {fileID: 1054915895}
  m_Enabled: 1
  m_CastShadows: 1
  m_ReceiveShadows: 1
  m_DynamicOccludee: 1
  m_MotionVectors: 1
  m_LightProbeUsage: 1
  m_ReflectionProbeUsage: 1
  m_Materials:
  - {fileID: 2100000, guid: b83d3bf75db8f704fb67e55cf64a537f, type: 2}
  m_StaticBatchInfo:
    firstSubMesh: 0
    subMeshCount: 0
  m_StaticBatchRoot: {fileID: 0}
  m_ProbeAnchor: {fileID: 0}
  m_LightProbeVolumeOverride: {fileID: 0}
  m_ScaleInLightmap: 1
  m_PreserveUVs: 0
  m_IgnoreNormalsForChartDetection: 0
  m_ImportantGI: 0
  m_StitchLightmapSeams: 0
  m_SelectedEditorRenderState: 3
  m_MinimumChartSize: 4
  m_AutoUVMaxDistance: 0.5
  m_AutoUVMaxAngle: 89
  m_LightmapParameters: {fileID: 0}
  m_SortingLayerID: 0
  m_SortingLayer: 0
  m_SortingOrder: 0
--- !u!33 &1054915898
MeshFilter:
  m_ObjectHideFlags: 0
  m_PrefabParentObject: {fileID: 33440821710586252, guid: 32026357c04e0e944835774b42e3c1b7,
    type: 2}
  m_PrefabInternal: {fileID: 442670900}
  m_GameObject: {fileID: 1054915895}
  m_Mesh: {fileID: 4300000, guid: 82d0b33fd2ad44744aa557711150e99e, type: 3}
--- !u!4 &1054915899
Transform:
  m_ObjectHideFlags: 0
  m_PrefabParentObject: {fileID: 4346093141753912, guid: 32026357c04e0e944835774b42e3c1b7,
    type: 2}
  m_PrefabInternal: {fileID: 442670900}
  m_GameObject: {fileID: 1054915895}
  m_LocalRotation: {x: 0, y: -0, z: -0, w: 1}
  m_LocalPosition: {x: -0.30744365, y: 0, z: 0}
  m_LocalScale: {x: 1, y: 1, z: 1}
  m_Children: []
  m_Father: {fileID: 0}
  m_RootOrder: 3
  m_LocalEulerAnglesHint: {x: 0, y: 0, z: 0}
--- !u!1 &1074966184
GameObject:
  m_ObjectHideFlags: 0
  m_PrefabParentObject: {fileID: 1055064919166404, guid: de6abd774f85e18408346a3233418242,
    type: 2}
  m_PrefabInternal: {fileID: 1038703274}
  serializedVersion: 5
  m_Component:
  - component: {fileID: 1074966188}
  - component: {fileID: 1074966187}
  - component: {fileID: 1074966186}
  - component: {fileID: 1074966185}
  m_Layer: 0
  m_Name: Pig
  m_TagString: Untagged
  m_Icon: {fileID: 0}
  m_NavMeshLayer: 0
  m_StaticEditorFlags: 0
  m_IsActive: 1
--- !u!95 &1074966185
Animator:
  serializedVersion: 3
  m_ObjectHideFlags: 0
  m_PrefabParentObject: {fileID: 95620480914910300, guid: de6abd774f85e18408346a3233418242,
    type: 2}
  m_PrefabInternal: {fileID: 1038703274}
  m_GameObject: {fileID: 1074966184}
  m_Enabled: 1
  m_Avatar: {fileID: 9000000, guid: 0b54733d5329ad34db9d1e5fe04739e6, type: 3}
  m_Controller: {fileID: 0}
  m_CullingMode: 0
  m_UpdateMode: 0
  m_ApplyRootMotion: 0
  m_LinearVelocityBlending: 0
  m_WarningMessage: 
  m_HasTransformHierarchy: 1
  m_AllowConstantClipSamplingOptimization: 1
--- !u!23 &1074966186
MeshRenderer:
  m_ObjectHideFlags: 0
  m_PrefabParentObject: {fileID: 23092161146695012, guid: de6abd774f85e18408346a3233418242,
    type: 2}
  m_PrefabInternal: {fileID: 1038703274}
  m_GameObject: {fileID: 1074966184}
  m_Enabled: 1
  m_CastShadows: 1
  m_ReceiveShadows: 1
  m_DynamicOccludee: 1
  m_MotionVectors: 1
  m_LightProbeUsage: 1
  m_ReflectionProbeUsage: 1
  m_Materials:
  - {fileID: 2100000, guid: b83d3bf75db8f704fb67e55cf64a537f, type: 2}
  m_StaticBatchInfo:
    firstSubMesh: 0
    subMeshCount: 0
  m_StaticBatchRoot: {fileID: 0}
  m_ProbeAnchor: {fileID: 0}
  m_LightProbeVolumeOverride: {fileID: 0}
  m_ScaleInLightmap: 1
  m_PreserveUVs: 0
  m_IgnoreNormalsForChartDetection: 0
  m_ImportantGI: 0
  m_StitchLightmapSeams: 0
  m_SelectedEditorRenderState: 3
  m_MinimumChartSize: 4
  m_AutoUVMaxDistance: 0.5
  m_AutoUVMaxAngle: 89
  m_LightmapParameters: {fileID: 0}
  m_SortingLayerID: 0
  m_SortingLayer: 0
  m_SortingOrder: 0
--- !u!33 &1074966187
MeshFilter:
  m_ObjectHideFlags: 0
  m_PrefabParentObject: {fileID: 33105911236239328, guid: de6abd774f85e18408346a3233418242,
    type: 2}
  m_PrefabInternal: {fileID: 1038703274}
  m_GameObject: {fileID: 1074966184}
  m_Mesh: {fileID: 4300000, guid: 0b54733d5329ad34db9d1e5fe04739e6, type: 3}
--- !u!4 &1074966188
Transform:
  m_ObjectHideFlags: 0
  m_PrefabParentObject: {fileID: 4597376258575022, guid: de6abd774f85e18408346a3233418242,
    type: 2}
  m_PrefabInternal: {fileID: 1038703274}
  m_GameObject: {fileID: 1074966184}
  m_LocalRotation: {x: 0, y: -0, z: -0, w: 1}
  m_LocalPosition: {x: -1.1854484, y: 0, z: 0}
  m_LocalScale: {x: 1, y: 1, z: 1}
  m_Children: []
  m_Father: {fileID: 0}
  m_RootOrder: 2
  m_LocalEulerAnglesHint: {x: 0, y: 0, z: 0}
--- !u!1 &1314389717
GameObject:
  m_ObjectHideFlags: 0
  m_PrefabParentObject: {fileID: 0}
  m_PrefabInternal: {fileID: 0}
  serializedVersion: 5
  m_Component:
  - component: {fileID: 1314389722}
  - component: {fileID: 1314389721}
  - component: {fileID: 1314389720}
  - component: {fileID: 1314389719}
  - component: {fileID: 1314389718}
  m_Layer: 0
  m_Name: Main Camera
  m_TagString: MainCamera
  m_Icon: {fileID: 0}
  m_NavMeshLayer: 0
  m_StaticEditorFlags: 0
  m_IsActive: 1
--- !u!81 &1314389718
AudioListener:
  m_ObjectHideFlags: 0
  m_PrefabParentObject: {fileID: 0}
  m_PrefabInternal: {fileID: 0}
  m_GameObject: {fileID: 1314389717}
  m_Enabled: 1
--- !u!124 &1314389719
Behaviour:
  m_ObjectHideFlags: 0
  m_PrefabParentObject: {fileID: 0}
  m_PrefabInternal: {fileID: 0}
  m_GameObject: {fileID: 1314389717}
  m_Enabled: 1
--- !u!92 &1314389720
Behaviour:
  m_ObjectHideFlags: 0
  m_PrefabParentObject: {fileID: 0}
  m_PrefabInternal: {fileID: 0}
  m_GameObject: {fileID: 1314389717}
  m_Enabled: 1
--- !u!20 &1314389721
Camera:
  m_ObjectHideFlags: 0
  m_PrefabParentObject: {fileID: 0}
  m_PrefabInternal: {fileID: 0}
  m_GameObject: {fileID: 1314389717}
  m_Enabled: 1
  serializedVersion: 2
  m_ClearFlags: 1
  m_BackGroundColor: {r: 0.19215687, g: 0.3019608, b: 0.4745098, a: 0}
  m_NormalizedViewPortRect:
    serializedVersion: 2
    x: 0
    y: 0
    width: 1
    height: 1
  near clip plane: 0.3
  far clip plane: 1000
  field of view: 60
  orthographic: 1
  orthographic size: 5
  m_Depth: -1
  m_CullingMask:
    serializedVersion: 2
    m_Bits: 4294967295
  m_RenderingPath: -1
  m_TargetTexture: {fileID: 0}
  m_TargetDisplay: 0
  m_TargetEye: 3
  m_HDR: 0
  m_AllowMSAA: 1
  m_AllowDynamicResolution: 0
  m_ForceIntoRT: 0
  m_OcclusionCulling: 1
  m_StereoConvergence: 10
  m_StereoSeparation: 0.022
--- !u!4 &1314389722
Transform:
  m_ObjectHideFlags: 0
  m_PrefabParentObject: {fileID: 0}
  m_PrefabInternal: {fileID: 0}
  m_GameObject: {fileID: 1314389717}
  m_LocalRotation: {x: 0, y: 0, z: 0, w: 1}
  m_LocalPosition: {x: 0, y: 1, z: -10}
  m_LocalScale: {x: 1, y: 1, z: 1}
  m_Children: []
  m_Father: {fileID: 0}
  m_RootOrder: 0
  m_LocalEulerAnglesHint: {x: 0, y: 0, z: 0}
--- !u!1001 &1616263842
Prefab:
  m_ObjectHideFlags: 0
  serializedVersion: 2
  m_Modification:
    m_TransformParent: {fileID: 0}
    m_Modifications:
    - target: {fileID: 4054502789990554, guid: 9ec060093457ad84ca2733cb15c2c41e, type: 2}
      propertyPath: m_LocalPosition.x
      value: 0.6572062
      objectReference: {fileID: 0}
    - target: {fileID: 4054502789990554, guid: 9ec060093457ad84ca2733cb15c2c41e, type: 2}
      propertyPath: m_LocalPosition.y
      value: 0
      objectReference: {fileID: 0}
    - target: {fileID: 4054502789990554, guid: 9ec060093457ad84ca2733cb15c2c41e, type: 2}
      propertyPath: m_LocalPosition.z
      value: 0
      objectReference: {fileID: 0}
    - target: {fileID: 4054502789990554, guid: 9ec060093457ad84ca2733cb15c2c41e, type: 2}
      propertyPath: m_LocalRotation.x
      value: 0
      objectReference: {fileID: 0}
    - target: {fileID: 4054502789990554, guid: 9ec060093457ad84ca2733cb15c2c41e, type: 2}
      propertyPath: m_LocalRotation.y
      value: -0
      objectReference: {fileID: 0}
    - target: {fileID: 4054502789990554, guid: 9ec060093457ad84ca2733cb15c2c41e, type: 2}
      propertyPath: m_LocalRotation.z
      value: -0
      objectReference: {fileID: 0}
    - target: {fileID: 4054502789990554, guid: 9ec060093457ad84ca2733cb15c2c41e, type: 2}
      propertyPath: m_LocalRotation.w
      value: 1
      objectReference: {fileID: 0}
    - target: {fileID: 4054502789990554, guid: 9ec060093457ad84ca2733cb15c2c41e, type: 2}
      propertyPath: m_RootOrder
      value: 4
      objectReference: {fileID: 0}
    m_RemovedComponents: []
  m_ParentPrefab: {fileID: 100100000, guid: 9ec060093457ad84ca2733cb15c2c41e, type: 2}
  m_RootGameObject: {fileID: 1747628268}
  m_IsPrefabParent: 0
--- !u!1 &1747628268
GameObject:
  m_ObjectHideFlags: 0
  m_PrefabParentObject: {fileID: 1287295899898638, guid: 9ec060093457ad84ca2733cb15c2c41e,
    type: 2}
  m_PrefabInternal: {fileID: 1616263842}
  serializedVersion: 5
  m_Component:
  - component: {fileID: 1747628272}
  - component: {fileID: 1747628271}
  - component: {fileID: 1747628270}
  - component: {fileID: 1747628269}
  m_Layer: 0
  m_Name: CowBlW
  m_TagString: Untagged
  m_Icon: {fileID: 0}
  m_NavMeshLayer: 0
  m_StaticEditorFlags: 0
  m_IsActive: 1
--- !u!95 &1747628269
Animator:
  serializedVersion: 3
  m_ObjectHideFlags: 0
  m_PrefabParentObject: {fileID: 95051569790832444, guid: 9ec060093457ad84ca2733cb15c2c41e,
    type: 2}
  m_PrefabInternal: {fileID: 1616263842}
  m_GameObject: {fileID: 1747628268}
  m_Enabled: 1
  m_Avatar: {fileID: 9000000, guid: 33bee4529afa2d740bfcc71a4c9f1f2c, type: 3}
  m_Controller: {fileID: 0}
  m_CullingMode: 0
  m_UpdateMode: 0
  m_ApplyRootMotion: 0
  m_LinearVelocityBlending: 0
  m_WarningMessage: 
  m_HasTransformHierarchy: 1
  m_AllowConstantClipSamplingOptimization: 1
--- !u!23 &1747628270
MeshRenderer:
  m_ObjectHideFlags: 0
  m_PrefabParentObject: {fileID: 23019307580939166, guid: 9ec060093457ad84ca2733cb15c2c41e,
    type: 2}
  m_PrefabInternal: {fileID: 1616263842}
  m_GameObject: {fileID: 1747628268}
  m_Enabled: 1
  m_CastShadows: 1
  m_ReceiveShadows: 1
  m_DynamicOccludee: 1
  m_MotionVectors: 1
  m_LightProbeUsage: 1
  m_ReflectionProbeUsage: 1
  m_Materials:
  - {fileID: 2100000, guid: b83d3bf75db8f704fb67e55cf64a537f, type: 2}
  m_StaticBatchInfo:
    firstSubMesh: 0
    subMeshCount: 0
  m_StaticBatchRoot: {fileID: 0}
  m_ProbeAnchor: {fileID: 0}
  m_LightProbeVolumeOverride: {fileID: 0}
  m_ScaleInLightmap: 1
  m_PreserveUVs: 0
  m_IgnoreNormalsForChartDetection: 0
  m_ImportantGI: 0
  m_StitchLightmapSeams: 0
  m_SelectedEditorRenderState: 3
  m_MinimumChartSize: 4
  m_AutoUVMaxDistance: 0.5
  m_AutoUVMaxAngle: 89
  m_LightmapParameters: {fileID: 0}
  m_SortingLayerID: 0
  m_SortingLayer: 0
  m_SortingOrder: 0
--- !u!33 &1747628271
MeshFilter:
  m_ObjectHideFlags: 0
  m_PrefabParentObject: {fileID: 33764712685770862, guid: 9ec060093457ad84ca2733cb15c2c41e,
    type: 2}
  m_PrefabInternal: {fileID: 1616263842}
  m_GameObject: {fileID: 1747628268}
  m_Mesh: {fileID: 4300000, guid: 33bee4529afa2d740bfcc71a4c9f1f2c, type: 3}
--- !u!4 &1747628272
Transform:
  m_ObjectHideFlags: 0
  m_PrefabParentObject: {fileID: 4054502789990554, guid: 9ec060093457ad84ca2733cb15c2c41e,
    type: 2}
  m_PrefabInternal: {fileID: 1616263842}
  m_GameObject: {fileID: 1747628268}
  m_LocalRotation: {x: 0, y: -0, z: -0, w: 1}
  m_LocalPosition: {x: 0.6572062, y: 0, z: 0}
  m_LocalScale: {x: 1, y: 1, z: 1}
  m_Children: []
  m_Father: {fileID: 0}
  m_RootOrder: 4
  m_LocalEulerAnglesHint: {x: 0, y: 0, z: 0}
--- !u!1 &1935984567
GameObject:
  m_ObjectHideFlags: 0
  m_PrefabParentObject: {fileID: 1965851562501010, guid: e82139b3bae6212439ea1e85ad29678b,
    type: 2}
  m_PrefabInternal: {fileID: 538597452}
  serializedVersion: 5
  m_Component:
  - component: {fileID: 1935984571}
  - component: {fileID: 1935984570}
  - component: {fileID: 1935984569}
  - component: {fileID: 1935984568}
  m_Layer: 0
  m_Name: SheepWhite
  m_TagString: Untagged
  m_Icon: {fileID: 0}
  m_NavMeshLayer: 0
  m_StaticEditorFlags: 0
  m_IsActive: 1
--- !u!95 &1935984568
Animator:
  serializedVersion: 3
  m_ObjectHideFlags: 0
  m_PrefabParentObject: {fileID: 95907328181767374, guid: e82139b3bae6212439ea1e85ad29678b,
    type: 2}
  m_PrefabInternal: {fileID: 538597452}
  m_GameObject: {fileID: 1935984567}
  m_Enabled: 1
  m_Avatar: {fileID: 9000000, guid: 5d8504897ce36db4ea5e50f018657780, type: 3}
  m_Controller: {fileID: 0}
  m_CullingMode: 0
  m_UpdateMode: 0
  m_ApplyRootMotion: 0
  m_LinearVelocityBlending: 0
  m_WarningMessage: 
  m_HasTransformHierarchy: 1
  m_AllowConstantClipSamplingOptimization: 1
--- !u!23 &1935984569
MeshRenderer:
  m_ObjectHideFlags: 0
  m_PrefabParentObject: {fileID: 23361667934628092, guid: e82139b3bae6212439ea1e85ad29678b,
    type: 2}
  m_PrefabInternal: {fileID: 538597452}
  m_GameObject: {fileID: 1935984567}
  m_Enabled: 1
  m_CastShadows: 1
  m_ReceiveShadows: 1
  m_DynamicOccludee: 1
  m_MotionVectors: 1
  m_LightProbeUsage: 1
  m_ReflectionProbeUsage: 1
  m_Materials:
  - {fileID: 2100000, guid: b83d3bf75db8f704fb67e55cf64a537f, type: 2}
  m_StaticBatchInfo:
    firstSubMesh: 0
    subMeshCount: 0
  m_StaticBatchRoot: {fileID: 0}
  m_ProbeAnchor: {fileID: 0}
  m_LightProbeVolumeOverride: {fileID: 0}
  m_ScaleInLightmap: 1
  m_PreserveUVs: 0
  m_IgnoreNormalsForChartDetection: 0
  m_ImportantGI: 0
  m_StitchLightmapSeams: 0
  m_SelectedEditorRenderState: 3
  m_MinimumChartSize: 4
  m_AutoUVMaxDistance: 0.5
  m_AutoUVMaxAngle: 89
  m_LightmapParameters: {fileID: 0}
  m_SortingLayerID: 0
  m_SortingLayer: 0
  m_SortingOrder: 0
--- !u!33 &1935984570
MeshFilter:
  m_ObjectHideFlags: 0
  m_PrefabParentObject: {fileID: 33343957155313214, guid: e82139b3bae6212439ea1e85ad29678b,
    type: 2}
  m_PrefabInternal: {fileID: 538597452}
  m_GameObject: {fileID: 1935984567}
  m_Mesh: {fileID: 4300000, guid: 5d8504897ce36db4ea5e50f018657780, type: 3}
--- !u!4 &1935984571
Transform:
  m_ObjectHideFlags: 0
  m_PrefabParentObject: {fileID: 4589997030424458, guid: e82139b3bae6212439ea1e85ad29678b,
    type: 2}
  m_PrefabInternal: {fileID: 538597452}
  m_GameObject: {fileID: 1935984567}
  m_LocalRotation: {x: 0, y: -0, z: -0, w: 1}
  m_LocalPosition: {x: -2.092335, y: 0, z: 0}
  m_LocalScale: {x: 1, y: 1, z: 1}
  m_Children: []
  m_Father: {fileID: 0}
  m_RootOrder: 1
  m_LocalEulerAnglesHint: {x: 0, y: 0, z: 0}
