{
  extends: ["config:base", ":gitSignOff"],
  enabled: true,
  timezone: "America/New_York",
  dependencyDashboard: true,
  dependencyDashboardTitle: "Renovate Dashboard",
  // "gitAuthor": "Anthony Rabbito <hello@anthonyrabbito.com>",
  // "commitBody": "Signed-off-by: Anthony Rabbito <hello@anthonyrabbito.com>",
  // Do not notify on closed unmerged PRs
  suppressNotifications: ["prIgnoreNotification"],
  // Do not rebase PRs
  rebaseWhen: "conflicted",
  assignees: ["@anthr76"],
  reviewersFromCodeOwners: true,
  "dockerfile": {
    fileMatch: ["Container.+\\.sh$"],
  },
  regexManagers: [
    {
      fileMatch: ["Container.+\\.sh$"],
      "matchStringsStrategy": "any",
      matchStrings: [
        "export [A-Z]+_IMAGE=(?<currentValue>.*) # (?<datasource>.*?)/(?<depName>.*?)(\\&versioning=(?<versioning>.*?))?\\s",
      ],
      versioningTemplate: "{{#if versioning}}{{{versioning}}}{{else}}semver{{/if}}",
    },
    {
      fileMatch: ["Container.+\\.sh$"],
      matchStrings: [
        "export IMAGE=(?<depName>.*?):(?<currentValue>.*?)@(?<currentDigest>sha256:[a-f0-9]+)s",
      ],
      datasourceTemplate: "docker",
    },
  ],
}
