[
    {
        "tweet_id": "54691802283900928",
        "text": "Does anyone know of any charities that are taking children's clothing donations for Hurricane Sandy victims?  The. http://t.co/MMm1vdiw",
        "primary_geo": "1511 68th Ave, Philadelphia, PA 19126, USA",
        "type": "seeker",
        "potential_offers": [
            {
                "tweet_id": "54691802283900928",
                "text": "Now until Friday $1 from every Download will be donated to AmeriCares for Hurricane Relief Please share... http://t.co/2oZTNOuT",
                "primary_geo": "Frankfurt, Germany",
                "smiliarity_score_in_percentage": 60.36,
                "type": "supplier",
                "primary_latlng": [
                    50.1109221,
                    8.6821267
                ]
            },
            {
                "tweet_id": "54691802283900955",
                "text": "I want to donate blood to the hurricane victims but it hasn't been long enough since my last donation ?? #thestruggle",
                "primary_geo": "Frankfurt, Germany",
                "smiliarity_score_in_percentage": 67.73,
                "type": "supplier",
                "primary_latlng": [
                    50.1109221,
                    8.6821267
                ]
            },
            {
                "tweet_id": "54691802283900999",
                "text": "RT @juwlia1: Does anyone know of any community service organizations to help out the Hurricane Sandy victims? #replytweet",
                "primary_geo": "Mainz, Germany",
                "smiliarity_score_in_percentage": 80.88,
                "type": "supplier",
                "primary_latlng": [
                    49.9928617,
                    8.2472526
                ]
            }
        ],
        "primary_latlng": [
            40.05701649,
            -75.14310264
        ]
    },
    {
        "tweet_id": "54691802283900928",
        "text": "Donate to the Hurricane Sandy Relief  Drive today at Brandsmart in WPB until 7pm. http://t.co/fhuIjvRJ",
        "primary_geo": "Hamburg, Germany",
        "type": "seeker",
        "potential_offers": [
            {
                "tweet_id": "54691802283900928",
                "text": "Now until Friday $1 from every Download will be donated to AmeriCares for Hurricane Relief Please share... http://t.co/2oZTNOuT",
                "primary_geo": "Frankfurt, Germany",
                "smiliarity_score_in_percentage": 68.99,
                "type": "supplier",
                "primary_latlng": [
                    50.1109221,
                    8.6821267
                ]
            },
            {
                "tweet_id": "54691802283900933",
                "text": "Are they still collecting clothes at Intermediate Souuth to donate to the victims of Hurricane Sandy??",
                "primary_geo": "Berlin, Germany",
                "smiliarity_score_in_percentage": 70.51,
                "type": "supplier",
                "primary_latlng": [
                    52.52000659999999,
                    13.404954
                ]
            },
            {
                "tweet_id": "54691802283900955",
                "text": "I want to donate blood to the hurricane victims but it hasn't been long enough since my last donation ?? #thestruggle",
                "primary_geo": "Frankfurt, Germany",
                "smiliarity_score_in_percentage": 71.95,
                "type": "supplier",
                "primary_latlng": [
                    50.1109221,
                    8.6821267
                ]
            },
            {
                "tweet_id": "54691802283900999",
                "text": "RT @juwlia1: Does anyone know of any community service organizations to help out the Hurricane Sandy victims? #replytweet",
                "primary_geo": "Mainz, Germany",
                "smiliarity_score_in_percentage": 63.59,
                "type": "supplier",
                "primary_latlng": [
                    49.9928617,
                    8.2472526
                ]
            }
        ],
        "primary_latlng": [
            53.5510846,
            9.9936819
        ]
    },
    {
        "tweet_id": "54691802283900928",
        "text": "Hurricane Sandy Victims Need Food And  Medical Supplies; 5 Ways You Can Help: Hurricane Sandy continues to wreak ... http://t.co/zUTKv70z",
        "primary_geo": "Bangalore, India",
        "type": "seeker",
        "potential_offers": [
            {
                "tweet_id": "54691802283900933",
                "text": "Are they still collecting clothes at Intermediate Souuth to donate to the victims of Hurricane Sandy??",
                "primary_geo": "Berlin, Germany",
                "smiliarity_score_in_percentage": 65.9,
                "type": "supplier",
                "primary_latlng": [
                    52.52000659999999,
                    13.404954
                ]
            },
            {
                "tweet_id": "54691802283900955",
                "text": "I want to donate blood to the hurricane victims but it hasn't been long enough since my last donation ?? #thestruggle",
                "primary_geo": "Frankfurt, Germany",
                "smiliarity_score_in_percentage": 74.15,
                "type": "supplier",
                "primary_latlng": [
                    50.1109221,
                    8.6821267
                ]
            },
            {
                "tweet_id": "54691802283900999",
                "text": "RT @juwlia1: Does anyone know of any community service organizations to help out the Hurricane Sandy victims? #replytweet",
                "primary_geo": "Mainz, Germany",
                "smiliarity_score_in_percentage": 70.39,
                "type": "supplier",
                "primary_latlng": [
                    49.9928617,
                    8.2472526
                ]
            }
        ],
        "primary_latlng": [
            12.9715987,
            77.5945627
        ]
    },
    {
        "tweet_id": "54691802283900928",
        "text": "See how you can help with  Hurricane Sandy relief. http://t.co/l35zY5qy ",
        "primary_geo": "NewYork, United States",
        "type": "seeker",
        "potential_offers": [
            {
                "tweet_id": "54691802283900999",
                "text": "RT @juwlia1: Does anyone know of any community service organizations to help out the Hurricane Sandy victims? #replytweet",
                "primary_geo": "Mainz, Germany",
                "smiliarity_score_in_percentage": 68.98,
                "type": "supplier",
                "primary_latlng": [
                    49.9928617,
                    8.2472526
                ]
            }
        ],
        "primary_latlng": [
            40.7127753,
            -74.0059728
        ]
    },
    {
        "tweet_id": "54691802283900928",
        "text": "Another photo! 20 percent goes to  Red Cross for Hurricane Sandy Relief #sandynj The Wonder Bar in Asbury http://t.co/QsaXVwvZ via @Etsy ",
        "primary_geo": "Berlin, Germany",
        "type": "seeker",
        "potential_offers": [
            {
                "tweet_id": "54691802283900928",
                "text": "RT If someone you know needs shelter from #Sandy, text SHELTER + your zip to 43362 to find a safe place in your area. #Frankenstorm Pls RT!",
                "primary_geo": "Darmstadt, Germany",
                "smiliarity_score_in_percentage": 60.81,
                "type": "supplier",
                "primary_latlng": [
                    49.8728253,
                    8.6511929
                ]
            },
            {
                "tweet_id": "54691802283900928",
                "text": "Now until Friday $1 from every Download will be donated to AmeriCares for Hurricane Relief Please share... http://t.co/2oZTNOuT",
                "primary_geo": "Frankfurt, Germany",
                "smiliarity_score_in_percentage": 68.43,
                "type": "supplier",
                "primary_latlng": [
                    50.1109221,
                    8.6821267
                ]
            },
            {
                "tweet_id": "54691802283900955",
                "text": "I want to donate blood to the hurricane victims but it hasn't been long enough since my last donation ?? #thestruggle",
                "primary_geo": "Frankfurt, Germany",
                "smiliarity_score_in_percentage": 73.98,
                "type": "supplier",
                "primary_latlng": [
                    50.1109221,
                    8.6821267
                ]
            },
            {
                "tweet_id": "54691802283900999",
                "text": "RT @juwlia1: Does anyone know of any community service organizations to help out the Hurricane Sandy victims? #replytweet",
                "primary_geo": "Mainz, Germany",
                "smiliarity_score_in_percentage": 69.48,
                "type": "supplier",
                "primary_latlng": [
                    49.9928617,
                    8.2472526
                ]
            }
        ],
        "primary_latlng": [
            52.52000659999999,
            13.404954
        ]
    },
    {
        "tweet_id": "54691802283900928",
        "text": "RT @HurricaneSandyw: Every FOLLOWER who RETWEETS  this, we will donate 0.25 to the Hurricane Sandy Relief. PLEASE HELP!",
        "primary_geo": "Athens, Greece",
        "type": "seeker",
        "potential_offers": [
            {
                "tweet_id": "54691802283900928",
                "text": "Now until Friday $1 from every Download will be donated to AmeriCares for Hurricane Relief Please share... http://t.co/2oZTNOuT",
                "primary_geo": "Frankfurt, Germany",
                "smiliarity_score_in_percentage": 84.07,
                "type": "supplier",
                "primary_latlng": [
                    50.1109221,
                    8.6821267
                ]
            },
            {
                "tweet_id": "54691802283900933",
                "text": "Are they still collecting clothes at Intermediate Souuth to donate to the victims of Hurricane Sandy??",
                "primary_geo": "Berlin, Germany",
                "smiliarity_score_in_percentage": 66.01,
                "type": "supplier",
                "primary_latlng": [
                    52.52000659999999,
                    13.404954
                ]
            },
            {
                "tweet_id": "54691802283900955",
                "text": "I want to donate blood to the hurricane victims but it hasn't been long enough since my last donation ?? #thestruggle",
                "primary_geo": "Frankfurt, Germany",
                "smiliarity_score_in_percentage": 72.91,
                "type": "supplier",
                "primary_latlng": [
                    50.1109221,
                    8.6821267
                ]
            },
            {
                "tweet_id": "54691802283900999",
                "text": "RT @juwlia1: Does anyone know of any community service organizations to help out the Hurricane Sandy victims? #replytweet",
                "primary_geo": "Mainz, Germany",
                "smiliarity_score_in_percentage": 73.8,
                "type": "supplier",
                "primary_latlng": [
                    49.9928617,
                    8.2472526
                ]
            }
        ],
        "primary_latlng": [
            37.9838096,
            23.7275388
        ]
    },
    {
        "tweet_id": "54691802283900920",
        "text": "In case anyone was wondering how  to help out with the hurricane Sandy relief efforts, here's the link to donate.... http://t.co/BhJUnGIM",
        "primary_geo": "Hamburg, Germany",
        "type": "seeker",
        "potential_offers": [
            {
                "tweet_id": "54691802283900928",
                "text": "Now until Friday $1 from every Download will be donated to AmeriCares for Hurricane Relief Please share... http://t.co/2oZTNOuT",
                "primary_geo": "Frankfurt, Germany",
                "smiliarity_score_in_percentage": 70.31,
                "type": "supplier",
                "primary_latlng": [
                    50.1109221,
                    8.6821267
                ]
            },
            {
                "tweet_id": "54691802283900955",
                "text": "I want to donate blood to the hurricane victims but it hasn't been long enough since my last donation ?? #thestruggle",
                "primary_geo": "Frankfurt, Germany",
                "smiliarity_score_in_percentage": 71.75,
                "type": "supplier",
                "primary_latlng": [
                    50.1109221,
                    8.6821267
                ]
            },
            {
                "tweet_id": "54691802283900999",
                "text": "RT @juwlia1: Does anyone know of any community service organizations to help out the Hurricane Sandy victims? #replytweet",
                "primary_geo": "Mainz, Germany",
                "smiliarity_score_in_percentage": 81.77,
                "type": "supplier",
                "primary_latlng": [
                    49.9928617,
                    8.2472526
                ]
            }
        ],
        "primary_latlng": [
            53.5510846,
            9.9936819
        ]
    },
    {
        "tweet_id": "54691802283900966",
        "text": "if anyone knows about volunteer efforts for the current hurricane relief, please let me know.. I want to help #hurricanesandy",
        "primary_geo": "Stuttgart, Germany",
        "type": "seeker",
        "potential_offers": [
            {
                "tweet_id": "54691802283900928",
                "text": "RT If someone you know needs shelter from #Sandy, text SHELTER + your zip to 43362 to find a safe place in your area. #Frankenstorm Pls RT!",
                "primary_geo": "Darmstadt, Germany",
                "smiliarity_score_in_percentage": 61.18,
                "type": "supplier",
                "primary_latlng": [
                    49.8728253,
                    8.6511929
                ]
            },
            {
                "tweet_id": "54691802283900928",
                "text": "Now until Friday $1 from every Download will be donated to AmeriCares for Hurricane Relief Please share... http://t.co/2oZTNOuT",
                "primary_geo": "Frankfurt, Germany",
                "smiliarity_score_in_percentage": 66.82,
                "type": "supplier",
                "primary_latlng": [
                    50.1109221,
                    8.6821267
                ]
            },
            {
                "tweet_id": "54691802283900955",
                "text": "I want to donate blood to the hurricane victims but it hasn't been long enough since my last donation ?? #thestruggle",
                "primary_geo": "Frankfurt, Germany",
                "smiliarity_score_in_percentage": 74.79,
                "type": "supplier",
                "primary_latlng": [
                    50.1109221,
                    8.6821267
                ]
            },
            {
                "tweet_id": "54691802283900999",
                "text": "RT @juwlia1: Does anyone know of any community service organizations to help out the Hurricane Sandy victims? #replytweet",
                "primary_geo": "Mainz, Germany",
                "smiliarity_score_in_percentage": 78.35,
                "type": "supplier",
                "primary_latlng": [
                    49.9928617,
                    8.2472526
                ]
            }
        ],
        "primary_latlng": [
            48.7758459,
            9.1829321
        ]
    },
    {
        "tweet_id": "54691802283900977",
        "text": "Text REDCROSS to 90999 to make  a 10 donation to help those affected by hurricane Sandy. We did. (please RT)",
        "primary_geo": "Munich, Germany",
        "type": "seeker",
        "potential_offers": [
            {
                "tweet_id": "54691802283900928",
                "text": "RT If someone you know needs shelter from #Sandy, text SHELTER + your zip to 43362 to find a safe place in your area. #Frankenstorm Pls RT!",
                "primary_geo": "Darmstadt, Germany",
                "smiliarity_score_in_percentage": 63.54,
                "type": "supplier",
                "primary_latlng": [
                    49.8728253,
                    8.6511929
                ]
            },
            {
                "tweet_id": "54691802283900955",
                "text": "I want to donate blood to the hurricane victims but it hasn't been long enough since my last donation ?? #thestruggle",
                "primary_geo": "Frankfurt, Germany",
                "smiliarity_score_in_percentage": 73.79,
                "type": "supplier",
                "primary_latlng": [
                    50.1109221,
                    8.6821267
                ]
            },
            {
                "tweet_id": "54691802283900999",
                "text": "RT @juwlia1: Does anyone know of any community service organizations to help out the Hurricane Sandy victims? #replytweet",
                "primary_geo": "Mainz, Germany",
                "smiliarity_score_in_percentage": 64.31,
                "type": "supplier",
                "primary_latlng": [
                    49.9928617,
                    8.2472526
                ]
            }
        ],
        "primary_latlng": [
            48.1351253,
            11.5819805
        ]
    },
    {
        "tweet_id": "54691802283900988",
        "text": "Does anyone know of local shelters or places collecting clothes for hurricane victims?",
        "primary_geo": "Zurich, Switzerland",
        "type": "seeker",
        "potential_offers": [
            {
                "tweet_id": "54691802283900928",
                "text": "RT If someone you know needs shelter from #Sandy, text SHELTER + your zip to 43362 to find a safe place in your area. #Frankenstorm Pls RT!",
                "primary_geo": "Darmstadt, Germany",
                "smiliarity_score_in_percentage": 63.84,
                "type": "supplier",
                "primary_latlng": [
                    49.8728253,
                    8.6511929
                ]
            },
            {
                "tweet_id": "54691802283900928",
                "text": "Now until Friday $1 from every Download will be donated to AmeriCares for Hurricane Relief Please share... http://t.co/2oZTNOuT",
                "primary_geo": "Frankfurt, Germany",
                "smiliarity_score_in_percentage": 62.28,
                "type": "supplier",
                "primary_latlng": [
                    50.1109221,
                    8.6821267
                ]
            },
            {
                "tweet_id": "54691802283900955",
                "text": "I want to donate blood to the hurricane victims but it hasn't been long enough since my last donation ?? #thestruggle",
                "primary_geo": "Frankfurt, Germany",
                "smiliarity_score_in_percentage": 71.85,
                "type": "supplier",
                "primary_latlng": [
                    50.1109221,
                    8.6821267
                ]
            },
            {
                "tweet_id": "54691802283900999",
                "text": "RT @juwlia1: Does anyone know of any community service organizations to help out the Hurricane Sandy victims? #replytweet",
                "primary_geo": "Mainz, Germany",
                "smiliarity_score_in_percentage": 76.91,
                "type": "supplier",
                "primary_latlng": [
                    49.9928617,
                    8.2472526
                ]
            }
        ],
        "primary_latlng": [
            47.3768866,
            8.541694
        ]
    },
    {
        "tweet_id": "54691802283900800",
        "text": "I have to donate to hurricane sandy",
        "primary_geo": "Bangalore, India",
        "type": "seeker",
        "potential_offers": [
            {
                "tweet_id": "54691802283900928",
                "text": "Now until Friday $1 from every Download will be donated to AmeriCares for Hurricane Relief Please share... http://t.co/2oZTNOuT",
                "primary_geo": "Frankfurt, Germany",
                "smiliarity_score_in_percentage": 62.11,
                "type": "supplier",
                "primary_latlng": [
                    50.1109221,
                    8.6821267
                ]
            },
            {
                "tweet_id": "54691802283900933",
                "text": "Are they still collecting clothes at Intermediate Souuth to donate to the victims of Hurricane Sandy??",
                "primary_geo": "Berlin, Germany",
                "smiliarity_score_in_percentage": 71.53,
                "type": "supplier",
                "primary_latlng": [
                    52.52000659999999,
                    13.404954
                ]
            },
            {
                "tweet_id": "54691802283900955",
                "text": "I want to donate blood to the hurricane victims but it hasn't been long enough since my last donation ?? #thestruggle",
                "primary_geo": "Frankfurt, Germany",
                "smiliarity_score_in_percentage": 66.49,
                "type": "supplier",
                "primary_latlng": [
                    50.1109221,
                    8.6821267
                ]
            },
            {
                "tweet_id": "54691802283900999",
                "text": "RT @juwlia1: Does anyone know of any community service organizations to help out the Hurricane Sandy victims? #replytweet",
                "primary_geo": "Mainz, Germany",
                "smiliarity_score_in_percentage": 63.64,
                "type": "supplier",
                "primary_latlng": [
                    49.9928617,
                    8.2472526
                ]
            }
        ],
        "primary_latlng": [
            12.9715987,
            77.5945627
        ]
    },
    {
        "tweet_id": "54691802283900801",
        "text": "Everyone come out to the Doopie  Brothers event this Tuesday!!! 0.25 of the proceeds donated to the hurricane relief!! Dress to impress!",
        "primary_geo": "Delhi, India",
        "type": "seeker",
        "potential_offers": [],
        "primary_latlng": [
            28.7040592,
            77.10249019999999
        ]
    }
]