<svg width="624" height="623" viewBox="0 0 624 623" fill="none" xmlns="http://www.w3.org/2000/svg">
<g filter="url(#filter0_i_2567_38727)">
<path d="M312 31C348.836 31 385.311 38.2553 419.343 52.3518C453.375 66.4482 484.297 87.1097 510.343 113.157C536.39 139.203 557.052 170.125 571.148 204.157C585.245 238.189 592.5 274.664 592.5 311.5C592.5 348.336 585.245 384.811 571.148 418.843C557.052 452.875 536.39 483.797 510.343 509.844C484.297 535.89 453.374 556.552 419.343 570.648C385.311 584.745 348.836 592 312 592C275.164 592 238.689 584.745 204.657 570.648C170.625 556.552 139.703 535.89 113.656 509.843C87.6096 483.797 66.9482 452.874 52.8517 418.843C38.7553 384.811 31.5 348.336 31.5 311.5C31.5 274.664 38.7554 238.189 52.8518 204.157C66.9483 170.125 87.6098 139.203 113.657 113.156C139.704 87.1096 170.626 66.4481 204.657 52.3517C238.689 38.2553 275.164 31 312 31L312 31Z" stroke="#FBFBFB" stroke-width="61.403" stroke-linecap="round" stroke-linejoin="round"/>
</g>
<path d="M312 31C348.836 31 385.311 38.2553 419.343 52.3518C453.375 66.4482 484.297 87.1097 510.343 113.157C536.39 139.203 557.052 170.125 571.148 204.157C585.245 238.189 592.5 274.664 592.5 311.5C592.5 348.336 585.245 384.811 571.148 418.843C557.052 452.875 536.39 483.797 510.343 509.844C484.297 535.89 453.374 556.552 419.343 570.648C385.311 584.745 348.836 592 312 592C275.164 592 238.689 584.745 204.657 570.648C170.625 556.552 139.703 535.89 113.656 509.843C87.6096 483.797 66.9482 452.874 52.8517 418.843C38.7553 384.811 31.5 348.336 31.5 311.5C31.5 274.664 38.7554 238.189 52.8518 204.157C66.9483 170.125 87.6098 139.203 113.657 113.156C139.704 87.1096 170.626 66.4481 204.657 52.3517C238.689 38.2553 275.164 31 312 31L312 31Z" stroke="#1DBB9A" stroke-width="40.4701" stroke-linecap="round" stroke-linejoin="round"/>
<path d="M419.039 163.575L254.043 328.735L204.545 279.236" stroke="#1DBB9A" stroke-width="27.9104" stroke-linecap="round" stroke-linejoin="round"/>
<path d="M248.083 401.799H237.22L235.422 406.996H229.678L239.486 379.683H245.855L255.663 406.996H249.88L248.083 401.799ZM246.598 397.423L242.651 386.013L238.705 397.423H246.598ZM264.8 378.081V406.996H259.329V378.081H264.8ZM275.675 378.081V406.996H270.204V378.081H275.675ZM305.864 393.007C307.401 393.294 308.664 394.062 309.654 395.313C310.644 396.563 311.139 397.996 311.139 399.611C311.139 401.07 310.774 402.359 310.045 403.479C309.342 404.573 308.313 405.433 306.958 406.058C305.603 406.683 304.001 406.996 302.152 406.996H290.39V379.722H301.644C303.493 379.722 305.082 380.022 306.411 380.621C307.766 381.22 308.781 382.053 309.459 383.121C310.162 384.19 310.514 385.401 310.514 386.755C310.514 388.344 310.084 389.673 309.224 390.741C308.391 391.809 307.271 392.565 305.864 393.007ZM295.861 390.975H300.862C302.165 390.975 303.168 390.689 303.871 390.116C304.574 389.517 304.926 388.67 304.926 387.576C304.926 386.482 304.574 385.635 303.871 385.036C303.168 384.437 302.165 384.137 300.862 384.137H295.861V390.975ZM301.37 402.542C302.699 402.542 303.728 402.229 304.457 401.604C305.213 400.979 305.59 400.093 305.59 398.947C305.59 397.774 305.2 396.863 304.418 396.211C303.637 395.534 302.582 395.196 301.253 395.196H295.861V402.542H301.37ZM325.111 407.348C323.027 407.348 321.152 406.892 319.484 405.98C317.817 405.042 316.502 403.727 315.538 402.034C314.6 400.34 314.131 398.387 314.131 396.172C314.131 393.958 314.613 392.004 315.577 390.311C316.567 388.618 317.908 387.316 319.602 386.404C321.295 385.466 323.184 384.997 325.268 384.997C327.351 384.997 329.24 385.466 330.933 386.404C332.627 387.316 333.955 388.618 334.919 390.311C335.909 392.004 336.404 393.958 336.404 396.172C336.404 398.387 335.896 400.34 334.88 402.034C333.89 403.727 332.535 405.042 330.816 405.98C329.123 406.892 327.221 407.348 325.111 407.348ZM325.111 402.581C326.101 402.581 327.026 402.346 327.886 401.877C328.771 401.382 329.475 400.653 329.996 399.689C330.517 398.725 330.777 397.553 330.777 396.172C330.777 394.114 330.23 392.538 329.136 391.444C328.068 390.324 326.752 389.764 325.189 389.764C323.626 389.764 322.311 390.324 321.243 391.444C320.201 392.538 319.68 394.114 319.68 396.172C319.68 398.23 320.188 399.819 321.204 400.94C322.246 402.034 323.548 402.581 325.111 402.581ZM352.373 406.996L347.919 400.275L343.972 406.996H338.111L345.184 396.133L338.033 385.349H344.207L348.622 392.031L352.608 385.349H358.469L351.357 396.133L358.547 406.996H352.373ZM381.642 395.704C381.642 396.485 381.59 397.188 381.486 397.814H365.66C365.791 399.377 366.338 400.601 367.301 401.487C368.265 402.372 369.451 402.815 370.857 402.815C372.889 402.815 374.335 401.942 375.195 400.197H381.095C380.47 402.281 379.271 404 377.5 405.355C375.729 406.683 373.553 407.348 370.974 407.348C368.89 407.348 367.015 406.892 365.348 405.98C363.707 405.042 362.417 403.727 361.479 402.034C360.568 400.34 360.112 398.387 360.112 396.172C360.112 393.932 360.568 391.965 361.479 390.272C362.391 388.579 363.667 387.276 365.309 386.365C366.95 385.453 368.838 384.997 370.974 384.997C373.032 384.997 374.869 385.44 376.484 386.326C378.125 387.211 379.389 388.475 380.274 390.116C381.186 391.731 381.642 393.593 381.642 395.704ZM375.976 394.141C375.95 392.734 375.442 391.614 374.452 390.78C373.462 389.92 372.251 389.491 370.818 389.491C369.464 389.491 368.317 389.907 367.38 390.741C366.468 391.549 365.908 392.682 365.699 394.141H375.976ZM393.919 407.348C392.147 407.348 390.558 407.035 389.151 406.41C387.745 405.759 386.625 404.886 385.791 403.792C384.984 402.698 384.541 401.487 384.463 400.158H389.972C390.076 400.992 390.48 401.682 391.183 402.229C391.913 402.776 392.811 403.05 393.879 403.05C394.921 403.05 395.729 402.841 396.302 402.424C396.901 402.008 397.201 401.474 397.201 400.822C397.201 400.119 396.836 399.598 396.107 399.259C395.403 398.895 394.27 398.504 392.707 398.087C391.092 397.696 389.764 397.293 388.722 396.876C387.706 396.459 386.82 395.821 386.065 394.961C385.335 394.101 384.97 392.942 384.97 391.483C384.97 390.285 385.309 389.191 385.986 388.201C386.69 387.211 387.68 386.43 388.956 385.857C390.259 385.284 391.782 384.997 393.528 384.997C396.107 384.997 398.165 385.648 399.702 386.951C401.239 388.227 402.085 389.96 402.241 392.148H397.005C396.927 391.288 396.563 390.611 395.911 390.116C395.286 389.595 394.44 389.334 393.372 389.334C392.382 389.334 391.613 389.517 391.066 389.881C390.545 390.246 390.285 390.754 390.285 391.405C390.285 392.135 390.649 392.695 391.379 393.086C392.108 393.45 393.241 393.828 394.778 394.219C396.341 394.609 397.631 395.013 398.647 395.43C399.663 395.847 400.535 396.498 401.265 397.384C402.02 398.243 402.411 399.39 402.437 400.822C402.437 402.073 402.085 403.193 401.382 404.183C400.705 405.173 399.715 405.954 398.412 406.527C397.136 407.074 395.638 407.348 393.919 407.348ZM246.75 445.659H255.738V449.996H241.28V422.722H246.75V445.659ZM268.827 450.348C266.743 450.348 264.867 449.892 263.2 448.98C261.533 448.042 260.218 446.727 259.254 445.034C258.316 443.34 257.847 441.387 257.847 439.172C257.847 436.958 258.329 435.004 259.293 433.311C260.283 431.618 261.624 430.316 263.317 429.404C265.011 428.466 266.899 427.997 268.983 427.997C271.067 427.997 272.956 428.466 274.649 429.404C276.342 430.316 277.671 431.618 278.635 433.311C279.625 435.004 280.12 436.958 280.12 439.172C280.12 441.387 279.612 443.34 278.596 445.034C277.606 446.727 276.251 448.042 274.532 448.98C272.839 449.892 270.937 450.348 268.827 450.348ZM268.827 445.581C269.817 445.581 270.742 445.346 271.601 444.877C272.487 444.382 273.19 443.653 273.711 442.689C274.232 441.725 274.493 440.553 274.493 439.172C274.493 437.114 273.946 435.538 272.852 434.444C271.784 433.324 270.468 432.764 268.905 432.764C267.342 432.764 266.027 433.324 264.959 434.444C263.917 435.538 263.396 437.114 263.396 439.172C263.396 441.23 263.904 442.819 264.919 443.94C265.961 445.034 267.264 445.581 268.827 445.581ZM282.726 439.094C282.726 436.906 283.155 434.965 284.015 433.272C284.901 431.579 286.086 430.276 287.571 429.365C289.082 428.453 290.762 427.997 292.612 427.997C294.227 427.997 295.633 428.323 296.832 428.974C298.056 429.625 299.033 430.446 299.762 431.436V428.349H305.272V449.996H299.762V446.831C299.059 447.847 298.082 448.694 296.832 449.371C295.607 450.022 294.188 450.348 292.572 450.348C290.749 450.348 289.082 449.879 287.571 448.941C286.086 448.003 284.901 446.688 284.015 444.995C283.155 443.275 282.726 441.309 282.726 439.094ZM299.762 439.172C299.762 437.844 299.502 436.711 298.981 435.773C298.46 434.809 297.756 434.08 296.871 433.585C295.985 433.064 295.034 432.803 294.018 432.803C293.002 432.803 292.064 433.051 291.205 433.546C290.345 434.041 289.642 434.77 289.095 435.734C288.574 436.672 288.313 437.792 288.313 439.094C288.313 440.397 288.574 441.543 289.095 442.533C289.642 443.497 290.345 444.239 291.205 444.76C292.091 445.281 293.028 445.542 294.018 445.542C295.034 445.542 295.985 445.294 296.871 444.799C297.756 444.278 298.46 443.549 298.981 442.611C299.502 441.647 299.762 440.501 299.762 439.172ZM309.208 439.094C309.208 436.906 309.638 434.965 310.497 433.272C311.383 431.579 312.581 430.276 314.092 429.365C315.603 428.453 317.283 427.997 319.133 427.997C320.539 427.997 321.881 428.31 323.157 428.935C324.434 429.534 325.45 430.342 326.205 431.357V421.081H331.754V449.996H326.205V446.792C325.528 447.86 324.577 448.72 323.353 449.371C322.129 450.022 320.709 450.348 319.094 450.348C317.27 450.348 315.603 449.879 314.092 448.941C312.581 448.003 311.383 446.688 310.497 444.995C309.638 443.275 309.208 441.309 309.208 439.094ZM326.244 439.172C326.244 437.844 325.984 436.711 325.463 435.773C324.942 434.809 324.239 434.08 323.353 433.585C322.467 433.064 321.516 432.803 320.5 432.803C319.484 432.803 318.547 433.051 317.687 433.546C316.827 434.041 316.124 434.77 315.577 435.734C315.056 436.672 314.796 437.792 314.796 439.094C314.796 440.397 315.056 441.543 315.577 442.533C316.124 443.497 316.827 444.239 317.687 444.76C318.573 445.281 319.511 445.542 320.5 445.542C321.516 445.542 322.467 445.294 323.353 444.799C324.239 444.278 324.942 443.549 325.463 442.611C325.984 441.647 326.244 440.501 326.244 439.172ZM357.22 438.704C357.22 439.485 357.168 440.188 357.064 440.814H341.239C341.369 442.377 341.916 443.601 342.88 444.487C343.844 445.372 345.029 445.815 346.436 445.815C348.467 445.815 349.913 444.942 350.773 443.197H356.673C356.048 445.281 354.85 447 353.078 448.355C351.307 449.683 349.132 450.348 346.553 450.348C344.469 450.348 342.593 449.892 340.926 448.98C339.285 448.042 337.995 446.727 337.058 445.034C336.146 443.34 335.69 441.387 335.69 439.172C335.69 436.932 336.146 434.965 337.058 433.272C337.969 431.579 339.246 430.276 340.887 429.365C342.528 428.453 344.417 427.997 346.553 427.997C348.611 427.997 350.447 428.44 352.062 429.326C353.703 430.211 354.967 431.475 355.853 433.116C356.764 434.731 357.22 436.593 357.22 438.704ZM351.554 437.141C351.528 435.734 351.02 434.614 350.03 433.78C349.041 432.92 347.829 432.491 346.397 432.491C345.042 432.491 343.896 432.907 342.958 433.741C342.046 434.549 341.486 435.682 341.278 437.141H351.554ZM359.806 439.094C359.806 436.906 360.236 434.965 361.096 433.272C361.982 431.579 363.18 430.276 364.691 429.365C366.202 428.453 367.882 427.997 369.731 427.997C371.138 427.997 372.48 428.31 373.756 428.935C375.033 429.534 376.048 430.342 376.804 431.357V421.081H382.352V449.996H376.804V446.792C376.127 447.86 375.176 448.72 373.951 449.371C372.727 450.022 371.307 450.348 369.692 450.348C367.869 450.348 366.202 449.879 364.691 448.941C363.18 448.003 361.982 446.688 361.096 444.995C360.236 443.275 359.806 441.309 359.806 439.094ZM376.843 439.172C376.843 437.844 376.582 436.711 376.061 435.773C375.54 434.809 374.837 434.08 373.951 433.585C373.066 433.064 372.115 432.803 371.099 432.803C370.083 432.803 369.145 433.051 368.286 433.546C367.426 434.041 366.723 434.77 366.176 435.734C365.655 436.672 365.394 437.792 365.394 439.094C365.394 440.397 365.655 441.543 366.176 442.533C366.723 443.497 367.426 444.239 368.286 444.76C369.171 445.281 370.109 445.542 371.099 445.542C372.115 445.542 373.066 445.294 373.951 444.799C374.837 444.278 375.54 443.549 376.061 442.611C376.582 441.647 376.843 440.501 376.843 439.172Z" fill="#1DBB9A"/>
<defs>
<filter id="filter0_i_2567_38727" x="0.798828" y="0.29834" width="622.402" height="629.381" filterUnits="userSpaceOnUse" color-interpolation-filters="sRGB">
<feFlood flood-opacity="0" result="BackgroundImageFix"/>
<feBlend mode="normal" in="SourceGraphic" in2="BackgroundImageFix" result="shape"/>
<feColorMatrix in="SourceAlpha" type="matrix" values="0 0 0 0 0 0 0 0 0 0 0 0 0 0 0 0 0 0 127 0" result="hardAlpha"/>
<feOffset dy="6.97761"/>
<feGaussianBlur stdDeviation="9.76866"/>
<feComposite in2="hardAlpha" operator="arithmetic" k2="-1" k3="1"/>
<feColorMatrix type="matrix" values="0 0 0 0 0 0 0 0 0 0 0 0 0 0 0 0 0 0 0.06 0"/>
<feBlend mode="normal" in2="shape" result="effect1_innerShadow_2567_38727"/>
</filter>
</defs>
</svg>
