SSD1306_OLED.c:16:6:SSD1306_Command	32	static
SSD1306_OLED.c:21:6:SSD1306_Data	32	static
SSD1306_OLED.c:37:6:SSD1306_DrawPixel	16	static
SSD1306_OLED.c:56:6:SSD1306_Clear	16	static
SSD1306_OLED.c:70:6:SSD1306_Display	8	static
SSD1306_OLED.c:82:6:SSD1306_Init	16	static
