freertos.c:96:6:_putchar	16	static
freertos.c:116:6:MX_FREERTOS_Init	8	static
freertos.c:173:6:StartHeartbeatTask	16	static
freertos.c:192:6:StartBmp280Task	88	static
freertos.c:227:6:StartOledTask	80	static
