<?xml version="1.0" encoding="utf-8"?>
<!-- Generator: Adobe Illustrator 21.0.0, SVG Export Plug-In . SVG Version: 6.00 Build 0)  -->
<svg version="1.1" id="Layer_1" xmlns="http://www.w3.org/2000/svg" xmlns:xlink="http://www.w3.org/1999/xlink" x="0px" y="0px"
	 viewBox="0 0 612 792" style="enable-background:new 0 0 612 792;" xml:space="preserve">
<style type="text/css">
	.st0{fill:#3D5693;}
	.st1{fill:#DC5246;}
	.st2{fill:#FED150;}
	.st3{fill:#FED252;}
	.st4{fill:#FBFCFC;}
</style>
<g>
	<path class="st0" d="M183.6,397c-0.7,0.3,4.4-6.7,5.2-8.4c6.4-3.3,14-6.4,20.6-9.1c2.8-1.2,7.1-2.7,10-3.7c1.3-0.3,3.5-3.7,4.3-6.3
		c0.2-0.2-9.9,3.2-14.5,5c-6.6,2.6-13.4,5.8-20,8.6c-4.6,1.9-12.1,6.1-15.2,7.2c1.9-3,4.1-6.6,6-9.6c3.7-2,13.5-7,20.2-9.7
		c6.2-2.5,12.4-4.8,18.6-7.3c2.7-1.1,7.1-2.6,8.6-3.2c0.9-0.5,1.6-1,2.2-2c0.7-1,1.4-1.9,2.1-2.9c0.2-0.3,0.4-0.5,0-0.4
		c-3.9,0.9-7.6,2.2-11.3,3.5c-8.4,2.8-16.7,5.7-24.7,9.3c-4.8,2.1-9.5,4.3-14.2,6.5c-6.6,3.2-13.2,6.4-19.6,9.9
		c-0.1,0.1-0.3,0-0.6,0c1.2-2.9,2.4-5.8,3.6-8.6c2-4.8,4-9.7,6-14.5c1.1-2.7,2.3-5.4,3.3-8.1c0.2-0.4,0.5-0.7,0.9-0.9
		c4.9-2.5,38-16.7,41.6-18.1c9.3-3.6,18.8-6.6,28.3-9.5c7.6-2.3,15.2-4.6,22.8-6.8c2.4-0.7,4.9-1.4,7.5-1.3c1.5,0.1,2.7,0.8,3.4,2.1
		c0.9,1.6,1.2,3.3,0.7,5.2c-1,3.6-2.4,6.9-4,10.3c-5.3,11.6-10.7,23.2-16,34.8c-4.1,8.9-8.1,17.9-12.2,26.8
		c-2.7,5.9-5.4,11.7-8,17.7c-4.7,10.7-9.9,21.2-14.1,32.1c-1.7,4.4-3.7,8.6-5.5,13c-0.2,0.4-0.6,0.8-0.3,1.2
		c0.3,0.5,28.9-6.8,42.9-9.6c24.3-4.8,138.5-23.9,166.1-24.4c-48.3,10.2-148.5,34.6-160,37.6c-6.7,1.7-13.4,3.7-20.2,5.4
		c-5.8,1.4-29.6,8.2-35.7,10.3c-10.6,3.6-19.7,6.3-33,9.7c-1,0.2-5.2,0.8-5.9-0.9c-1-2.4-0.3-6.3,0.3-8.6c1.2-4.8,3.1-9.4,5.1-14
		c2-4.5,3.9-9,5.9-13.4c1.8-4.1,3.8-8.1,5.6-12.1c2.2-4.7,4.3-9.5,6.5-14.3c2-4.3,4.1-8.6,6.1-13c2.6-5.8,5.3-11.4,8.1-17.1
		c1.9-3.9,6.3-12.1,6-12.1C215.3,382.8,195,391.6,183.6,397z"/>
	<path class="st1" d="M357.5,360.3c-1.6,7.4-4.5,14.3-7.3,21.3c-6,15.6-17.4,42-20.1,48.2c-15.6,1.6-65.2,10.8-85.9,16.9
		c0.6-2,2.9-6.4,3.8-8.8c14.7-5.4,38.8-10.2,43-12c2-1.2,3.5-2.3,5.9-5.8c-8.1,1.2-27.6,5-46.7,12.3c1-2.2,2.3-4.7,3.3-6.6
		c0,0,15.5-6.3,33.4-9.9c1.2-0.5,2.3-2.2,4.1-5.2c-16.4,3.2-31.2,8.6-35.8,11.1c1.2-2.7,2.5-5.2,4.1-8.1c8.3-3.6,20.7-6.9,24.3-8.2
		c2-0.8,2.5-3,3.7-5.1c-11.8,2.8-15.6,4.2-26.8,8.3c1.1-2.8,13.2-30.4,14.5-33.2c7.8-3.6,37.8-14.5,45.6-16.9
		c14.2-3.7,31.9-8,35.9-6.3C358.9,352.9,357.9,358,357.5,360.3z"/>
	<path class="st2" d="M358.4,352.5c5.6,1.3,11.3,2.6,16.8,4.1c6.3,1.8,12.6,3.6,18.8,5.9c2.9,1,4.8,3.3,5.9,6.4
		c1.6,4.5,0.5,8.7-0.9,13c-4.3,12.3-11.4,30.5-15.5,40.6c-7.6,0.8-47.7,6.7-51.9,7.3c0.8-1.9,14.2-32.5,24.3-58.7
		c1.7-4.2,3.1-8.6,3.4-13.2C360.1,352.9,358.4,352.6,358.4,352.5z"/>
	<path class="st3" d="M239.1,516.5c-7.4,10.7-15.1,9.9-17.7,9.1c-4.8-1.2-8-4.4-9.9-9c-1.2-2.9-1.6-6.1-1.4-9.2
		c0.5-7.6,3.4-14.2,9.7-18.9c1.7-1.2,3.6-2.2,5.8-2.6C238.6,485.5,247.3,498.7,239.1,516.5z"/>
	<path class="st3" d="M382.5,488.3c-2.8-0.9-5.1-2.4-7-4.6c-2.5-2.8-3.9-6.1-4.2-9.9c-0.5-6,1.1-11.4,4.4-16.3
		c3.2-4.7,7.4-7.5,13.5-7.4c0,0,0,0,0,0c8.3-0.2,14.4,7.9,15,14.2c0.4,5.8-0.6,11.6-3.9,16.4c-2.6,3.8-6,6.5-10.4,7.9
		C388.3,489,383.7,488.7,382.5,488.3z"/>
	<path class="st4" d="M190.7,344.7"/>
	<path class="st4" d="M200.2,340.8"/>
	<path class="st4" d="M392.7,450.5"/>
	<path class="st4" d="M217.2,383.1"/>
	<path class="st4" d="M223,371"/>
	<path class="st4" d="M231.8,355.2"/>
</g>
</svg>
