<svg width="18" height="32" viewBox="0 0 18 32" fill="none" xmlns="http://www.w3.org/2000/svg">
<rect x="1" y="1" width="16" height="30" rx="8" stroke="#021935" stroke-width="2"/>
<line x1="9" y1="20" x2="9" y2="13" stroke="black" stroke-width="2" stroke-linecap="round"/>
<line x1="9" y1="20" x2="9" y2="13" stroke="black" stroke-width="2" stroke-linecap="round"/>
</svg>
