<svg width="180" height="188" viewBox="0 0 180 188" fill="none" xmlns="http://www.w3.org/2000/svg">
<path d="M81.8328 39.934L16.7431 128.33L25.5923 135.751C59.9201 97.8147 129.815 22.981 134.77 27.137C139.726 31.293 71.1291 107.215 36.2113 144.657C36.7389 150.618 39.9552 161.041 48.6002 155.047C59.4064 147.554 124.784 62.4095 133.345 66.5794C140.194 69.9154 87.3717 133.38 60.1042 164.695C61.6125 172.482 66.556 185.759 74.2629 176.569C81.9697 167.379 137.746 100.873 164.67 68.7689" stroke="#bd4b4b" stroke-width="6" stroke-linecap="round" stroke-linejoin="round"/>
</svg>
