<?xml version="1.0" standalone="no"?>
<svg viewBox="0 0 200 200" xmlns="http://www.w3.org/2000/svg">
  <path fill="#bd4b4b" d="M42.5,-51.9C51.4,-43.2,52.3,-26.3,55.8,-9.4C59.2,7.4,65.2,24.2,61.5,40.1C57.8,55.9,44.5,70.8,29.2,73.6C13.8,76.3,-3.5,66.9,-19.3,58.7C-35.1,50.5,-49.3,43.6,-60.1,31.5C-70.9,19.4,-78.3,2.1,-74.2,-11.7C-70.1,-25.5,-54.5,-35.9,-40.2,-43.6C-25.9,-51.2,-12.9,-56.2,1.9,-58.5C16.8,-60.8,33.7,-60.5,42.5,-51.9Z" transform="translate(100 100)" />
</svg>
