<svg width="423" height="331" viewBox="0 0 423 331" fill="none" xmlns="http://www.w3.org/2000/svg">
<g clip-path="url(#clip0)">
<path opacity="0.1" d="M148.381 324.589C189.133 324.589 222.168 318.33 222.168 310.61C222.168 302.89 189.133 296.632 148.381 296.632C107.63 296.632 74.5951 302.89 74.5951 310.61C74.5951 318.33 107.63 324.589 148.381 324.589Z" fill="#6C63FF"/>
<path opacity="0.1" d="M245.766 46.6796C218.648 45.741 192.821 36.9833 168.158 27.4044C143.496 17.8255 119.068 7.21585 92.5993 2.14146C75.5752 -1.12274 56.1042 -1.58786 42.3902 7.53011C29.1874 16.3296 24.922 31.4774 22.63 45.544C20.9037 56.1286 19.8897 67.2704 24.6161 77.1804C27.9011 84.0607 33.7252 89.8433 37.756 96.4345C51.78 119.364 41.8664 147.639 26.6734 170.028C19.5504 180.529 11.2751 190.56 5.77355 201.727C0.272044 212.894 -2.2713 225.733 2.54304 237.156C7.31129 248.469 18.6788 256.95 30.9933 262.921C56.0036 275.052 85.4637 278.522 114.211 280.491C177.829 284.841 241.781 282.959 305.566 281.069C329.172 280.374 352.88 279.666 376.101 276.016C388.998 273.988 402.309 270.77 411.674 263.001C423.557 253.141 426.503 236.447 418.537 224.086C405.18 203.344 368.257 198.195 358.909 175.94C353.772 163.688 359.047 150.045 366.518 138.685C382.541 114.31 409.395 92.9273 410.807 65.0706C411.779 45.9379 398.869 26.7759 378.908 17.7208C357.987 8.22989 328.971 9.42411 313.544 25.1333C297.642 41.2909 269.712 47.5134 245.766 46.6796Z" fill="#6C63FF"/>
<path d="M224.217 151.578L211.383 142.925L217.856 133.287L183.959 130.585L171.779 140.004L156.531 131.456L143.814 132.986L143.663 129.634C143.506 126.139 143.155 122.656 142.612 119.2C142.666 118.152 142.704 116.95 142.7 115.642C142.7 110.132 141.954 102.829 138.677 97.9595L139.432 91.1797L133.314 83.9516C134.297 81.9945 135.417 80.1098 136.666 78.3115C136.876 78.0098 137.085 77.7165 137.311 77.4315C145.251 76.8575 151.516 70.3291 151.516 62.3467C151.516 61.9779 151.516 61.6092 151.474 61.2446C151.474 61.098 151.444 60.9471 151.428 60.8005C152.203 61.2195 152.986 61.6385 153.77 62.0575C153.916 62.267 154.084 62.4766 154.268 62.7238L154.306 62.7699L154.541 63.059L154.616 63.147C154.7 63.2476 154.788 63.3439 154.876 63.4445L154.935 63.5116C155.157 63.7588 155.391 64.0102 155.643 64.2574C155.673 64.2818 155.701 64.3084 155.727 64.337L156.041 64.6303L156.129 64.71C156.397 64.9488 156.682 65.1793 156.967 65.3972L157.059 65.4642L157.419 65.7114L157.537 65.7869C157.675 65.8707 157.817 65.9587 157.956 66.0383L158.006 66.0676C158.169 66.1556 158.337 66.2394 158.505 66.319L158.588 66.3525C158.731 66.414 158.87 66.4727 159.007 66.5285L159.137 66.5746C159.284 66.6249 159.426 66.671 159.577 66.7129L159.669 66.738C159.854 66.7841 160.038 66.8218 160.227 66.8512H160.248C160.425 66.8799 160.604 66.8981 160.784 66.9056H160.905C161.066 66.914 161.227 66.914 161.387 66.9056H161.492C161.693 66.8941 161.893 66.8703 162.091 66.8344C163.029 66.7111 163.929 66.3882 164.731 65.8874C164.935 65.7509 165.116 65.5825 165.267 65.3888C166.105 64.2909 165.183 63.0883 165.183 63.0883C164.857 62.3089 162.736 61.76 162.736 61.76C162.736 61.76 156.032 58.9609 156.032 56.7317C156.032 54.5025 154.356 42.9375 137.056 40.2934C137.056 40.2934 125.801 39.6607 122.638 45.6862L122.571 46.3902C121.641 46.9727 120.87 48.1417 119.952 48.4853C119.556 48.5705 119.173 48.7116 118.817 48.9044V48.8247C118.711 48.9174 118.624 49.0298 118.561 49.1558C118.364 49.548 118.246 49.9751 118.213 50.4128C118.119 50.9476 117.933 51.4621 117.664 51.9339C117.589 52.068 117.505 52.1968 117.413 52.3194V52.3194L117.342 52.4325C117.828 52.4705 118.317 52.3914 118.766 52.2021C118.695 52.7758 118.555 53.3386 118.347 53.8782C118.614 53.8868 118.877 53.8187 119.106 53.682C119.334 53.5453 119.519 53.3458 119.638 53.1072V53.0737L119.692 52.9982C119.798 52.8042 119.885 52.6008 119.952 52.3906L119.906 52.4409C119.99 52.1686 120.065 51.892 120.157 51.6238C120.2 51.4728 120.269 51.3307 120.363 51.2048C120.475 51.0921 120.611 51.0072 120.762 50.9569C120.913 50.9067 121.073 50.8926 121.23 50.9157L121.058 54.5486H121.134C121.033 54.8129 120.909 55.068 120.765 55.3112C120.17 56.275 119.089 56.9329 118.691 57.9888C118.519 58.4981 118.454 59.0371 118.498 59.5727C118.498 59.887 118.536 60.2054 118.561 60.5197V60.4946C118.62 61.3326 118.636 62.1288 118.184 62.8034C117.874 63.2643 117.375 63.6121 117.203 64.1359C117.156 64.2818 117.135 64.4351 117.141 64.5884C117.174 65.0476 117.27 65.5001 117.426 65.9335C117.427 65.9252 117.427 65.9167 117.426 65.9084C117.53 66.2272 117.554 66.5668 117.497 66.8973C117.308 67.7353 116.29 68.4351 116.34 69.2354C116.337 69.3407 116.353 69.4456 116.386 69.5455C116.582 69.9364 116.922 70.2366 117.333 70.3835C117.979 70.7509 118.721 70.9145 119.462 70.8529C119.739 70.8027 120.008 70.7109 120.258 70.5805C119.965 71.2551 119.663 71.9214 119.357 72.5541C119.311 72.6547 119.261 72.7552 119.21 72.8558C119.21 72.8558 116.621 71.1252 115.15 74.6534C114.721 75.3866 114.414 76.1848 114.241 77.0167C114.167 77.3495 114.064 77.6749 113.931 77.9888C113.278 79.0942 112.301 79.972 111.132 80.503C108.132 81.8774 96.0145 96.9916 95.8008 100.905C95.6959 102.433 95.4376 103.946 95.0298 105.422C94.0759 108.898 93.8308 112.531 94.3091 116.103C94.4588 117.258 94.707 118.398 95.0508 119.51C96.3371 123.419 97.1961 130.715 97.1961 130.715L98.5871 143.378C98.5355 145.125 98.6111 146.874 98.8134 148.611C97.393 150.233 91.6904 156.992 93.8692 158.831C95.5452 160.281 98.4782 160.042 100.125 159.745C98.738 163.177 96.555 169.143 96.2659 173.241C95.8469 179.305 96.9824 187.337 98.7799 190.421C100.577 193.506 106.569 201.417 106.569 201.417C106.569 201.417 106.288 212.269 108.43 216.212C110.571 220.155 111.434 228.335 111.434 228.335C111.434 228.335 113.432 235.24 112.431 237.78C111.43 240.319 114.287 242.431 111.287 244.119C108.287 245.808 104.449 283.868 104.449 283.868C104.449 283.868 102.903 308.813 104.449 310.082C104.532 310.142 104.62 310.194 104.713 310.237V318.618C104.713 318.618 103.64 320.378 108.002 320.734C110.99 320.973 119.458 321.513 124.482 321.828L128.374 322.071C128.374 322.071 137.592 323.906 141.665 322.071C145.738 320.235 152.957 320.277 151.884 315.429C151.742 314.769 151.552 314.121 151.314 313.489C150.137 310.48 148.138 310.137 144.455 309.299C144.242 309.253 144.036 309.211 143.848 309.177C139.968 308.503 138.694 310.309 136.519 307.958C134.63 305.926 128.613 303.65 126.564 302.93C126.614 302.779 126.677 302.632 126.727 302.477C126.147 302.379 125.608 302.115 125.173 301.719L130.725 302.071L134.031 302.276C134.031 302.276 141.866 303.839 145.344 302.276C148.821 300.713 154.939 300.755 154.025 296.636C153.905 296.075 153.744 295.523 153.544 294.985C152.542 292.429 150.841 292.148 147.711 291.44C147.531 291.402 147.363 291.364 147.196 291.335C143.898 290.761 142.817 292.295 140.969 290.3C139.385 288.599 134.387 286.692 132.589 286.043C132.589 285.113 131.332 283.788 130.54 282.46C129.61 280.91 131.328 275.483 131.328 275.483L132.308 252.969C132.682 252.803 133.077 252.69 133.482 252.634C133.482 252.634 137.915 248.402 136.913 243.893C136.709 242.53 136.603 241.153 136.595 239.774C138.053 238.421 140.06 236.422 140.63 235.19C141.56 233.183 140.63 223.457 140.63 223.457V186.269L148.046 187.019L154.775 187.71L156.824 187.92L163.554 188.599L179.019 190.162L192.955 187.522L198.984 186.382L211.383 184.036V153.698L224.217 151.578ZM122.143 51.0498L121.28 50.9576C121.565 50.9701 121.867 51.0246 122.143 51.0498Z" fill="url(#paint0_linear)"/>
<path d="M194.137 171.276C189.946 177.273 174.883 174.096 174.883 174.096L163.21 163.172L161.639 161.693L164.274 156.095C164.274 156.095 165.112 156.325 166.549 156.736C174.096 158.928 197.673 166.235 194.137 171.276Z" fill="#EFB7B9"/>
<path opacity="0.1" d="M166.541 156.736C166.026 158.53 164.614 161.215 163.21 163.172L161.639 161.693L164.274 156.095C164.274 156.095 165.121 156.325 166.541 156.736Z" fill="black"/>
<path d="M126.505 93.6059C126.505 93.6059 115.745 98.3786 116.273 110.099C116.653 117.649 117.476 125.171 118.737 132.625C118.737 132.625 116.537 150.262 125.697 154.809C134.856 159.355 143.332 163.093 143.332 163.093C143.332 163.093 157.662 164.635 159.443 165.272C161.224 165.909 166.788 156.17 165.762 154.654C164.735 153.137 151.583 149.956 149.907 147.425C148.231 144.894 144.355 143.332 144.355 143.332C144.355 143.332 140.353 140.91 140.081 138.722C139.809 136.535 140.865 134.905 141.133 133.945C141.401 132.986 142.08 123.721 142.08 123.721C142.08 123.721 146.596 90.7439 126.505 93.6059Z" fill="#DCE6F2"/>
<path opacity="0.1" d="M133.607 132.144C133.607 132.144 118.846 134.616 120.275 139.782C120.275 139.782 125.634 134.205 133.607 132.144Z" fill="black"/>
<path opacity="0.1" d="M133.721 134.234C133.721 134.234 125.604 140.859 127.192 141.199C128.78 141.538 133.721 134.234 133.721 134.234Z" fill="black"/>
<path opacity="0.1" d="M137.621 136.543C137.621 136.543 135.447 140.998 136.783 140.696C138.12 140.394 137.621 136.543 137.621 136.543Z" fill="black"/>
<path opacity="0.1" d="M167.086 157.21L166.189 156.954C166.445 156.116 166.516 155.437 166.306 155.123C165.28 153.606 152.136 150.43 150.464 147.895C148.792 145.36 144.912 143.801 144.912 143.801C144.912 143.801 140.911 141.379 140.638 139.192C140.366 137.004 141.422 135.374 141.69 134.415C141.958 133.455 142.637 124.186 142.637 124.186C142.637 124.186 147.141 91.2132 127.05 94.0752C127.05 94.0752 116.29 98.8521 116.814 110.572C117.194 118.123 118.018 125.645 119.282 133.099C119.282 133.099 117.082 150.736 126.241 155.282C135.401 159.829 143.877 163.566 143.877 163.566C143.877 163.566 158.203 165.104 159.988 165.745C160.662 165.988 161.882 164.735 163.076 163.013L163.755 163.646L175.428 174.566C175.428 174.566 190.491 177.746 194.681 171.75C198.222 166.705 174.649 159.397 167.086 157.21Z" fill="black"/>
<path d="M120.312 49.6167C119.902 49.6969 119.509 49.8486 119.152 50.065C118.733 50.4128 118.733 51.0079 118.628 51.5274C118.505 52.2502 118.218 52.9353 117.79 53.5304C118.267 53.5654 118.745 53.4864 119.185 53.2999C119.114 53.8734 118.973 54.4362 118.766 54.976C119.027 54.9827 119.285 54.9138 119.508 54.7778C119.731 54.6418 119.91 54.4444 120.023 54.2092C120.245 53.737 120.42 53.2445 120.547 52.7384C120.586 52.5871 120.655 52.4448 120.748 52.3194C121.134 51.8627 121.85 52.068 122.445 52.1266C122.94 52.1684 123.438 52.077 123.886 51.8618C124.334 51.6467 124.716 51.3157 124.993 50.9031C125.625 49.9435 125.663 47.488 124.155 47.2283C122.579 46.9685 121.599 49.139 120.312 49.6167Z" fill="#965D7B"/>
<g opacity="0.1">
<path opacity="0.1" d="M119.11 50.5804C119.148 50.3751 119.173 50.1614 119.219 49.9561C118.821 50.3039 118.8 50.8947 118.695 51.4185C118.642 51.7207 118.559 52.0169 118.448 52.3026C118.778 51.7768 119.003 51.1919 119.11 50.5804V50.5804Z" fill="black"/>
<path opacity="0.1" d="M119.244 54.0416C119.453 53.5024 119.593 52.9394 119.663 52.3655C119.243 52.5421 118.789 52.6209 118.335 52.5959C118.202 52.8907 118.041 53.1714 117.853 53.434C118.328 53.4708 118.805 53.3932 119.244 53.2077C119.174 53.7816 119.034 54.3447 118.825 54.8838C119.086 54.89 119.343 54.8209 119.566 54.685C119.789 54.549 119.968 54.3519 120.082 54.117C120.186 53.9266 120.271 53.7257 120.333 53.5178C120.21 53.6896 120.046 53.8277 119.856 53.9192C119.665 54.0108 119.455 54.0529 119.244 54.0416V54.0416Z" fill="black"/>
<path opacity="0.1" d="M122.923 51.1922C122.328 51.1336 121.607 50.9282 121.222 51.385C121.13 51.5114 121.062 51.6533 121.021 51.804C120.983 51.9129 120.949 52.0261 120.92 52.1392C121.318 51.8249 121.963 51.9926 122.504 52.047C122.999 52.0875 123.496 51.9954 123.943 51.7804C124.391 51.5654 124.773 51.2351 125.051 50.8235C125.178 50.62 125.273 50.3981 125.332 50.1656C125.045 50.5208 124.675 50.8001 124.255 50.9791C123.835 51.1581 123.378 51.2313 122.923 51.1922Z" fill="black"/>
</g>
<path d="M132.924 84.2239L139.314 91.9088L138.48 99.665L130.758 87.5761L132.924 84.2239Z" fill="#DCE6F2"/>
<path opacity="0.1" d="M139.31 91.9088L138.526 99.204L138.476 99.665L131.508 88.7536L130.758 87.5761L130.976 87.2367L132.92 84.2239L133.352 84.7435L139.31 91.9088Z" fill="black"/>
<path d="M142.629 73.8195C140.466 74.4397 138.401 76.5683 136.603 79.1537C135.388 80.9375 134.302 82.8055 133.352 84.7435C132.761 85.9251 132.241 87.0607 131.81 88.0496L131.508 88.7536C130.779 90.4758 130.373 91.6281 130.373 91.6281C130.373 91.6281 113.822 79.183 116.441 78.345C117.321 78.0643 118.477 76.1786 119.621 73.8028L119.764 73.5011C120.488 71.9758 121.201 70.2746 121.833 68.6739C123.128 65.3846 124.088 62.5268 124.088 62.5268C124.088 62.5268 149.228 71.9339 142.629 73.8195Z" fill="#EFB7B9"/>
<path d="M152.53 61.8271C152.53 61.8271 156.351 68.741 161.484 67.7982C166.616 66.8554 164.505 64.0856 164.505 64.0856L152.53 61.8271Z" fill="#444053"/>
<path d="M145.126 301.153C141.74 302.699 134.085 301.153 134.085 301.153L130.859 300.952C126.669 300.684 119.655 300.231 117.174 300.03C113.554 299.732 114.442 298.249 114.442 298.249V289.286L132.007 284.836C132.007 284.836 138.95 287.212 140.852 289.286C142.658 291.264 143.714 289.743 146.936 290.313C147.095 290.342 147.263 290.376 147.439 290.417C150.497 291.117 152.157 291.394 153.137 293.929C153.334 294.462 153.492 295.008 153.611 295.563C154.516 299.644 148.507 299.615 145.126 301.153Z" fill="#A36468"/>
<path opacity="0.1" d="M153.137 293.929C152.508 294.322 151.846 294.661 151.159 294.943C148.855 295.995 146.664 297.277 144.334 298.27C142.004 299.263 139.494 299.971 136.972 299.783C135.652 299.686 134.303 299.364 133.042 299.741C132.262 300.042 131.527 300.449 130.859 300.952C126.669 300.684 119.655 300.231 117.174 300.03C113.554 299.732 114.442 298.249 114.442 298.249V297.201C114.572 297.201 114.719 297.164 114.886 297.151C115.753 297.137 116.617 297.266 117.442 297.533C119.261 298.027 121.071 298.513 122.889 298.999C123.039 298.435 123.302 297.907 123.662 297.447C124.022 296.987 124.472 296.606 124.984 296.326C126.022 295.775 127.187 295.507 128.361 295.551C131.181 295.588 133.85 296.925 136.666 297.059C137.453 297.131 138.246 296.999 138.966 296.674C139.352 296.481 139.691 296.2 140.068 295.986C140.672 295.694 141.31 295.479 141.966 295.345C143.813 294.886 145.626 294.3 147.393 293.594C147.895 293.397 148.482 293.041 148.415 292.504C148.327 291.792 147.208 291.708 146.915 291.054C146.863 290.937 146.839 290.808 146.845 290.68C146.851 290.551 146.886 290.425 146.948 290.313C147.108 290.342 147.275 290.376 147.451 290.417C150.497 291.117 152.157 291.394 153.137 293.929Z" fill="black"/>
<path d="M141.547 320.763C137.567 322.582 128.558 320.763 128.558 320.763L124.766 320.541C119.856 320.227 111.585 319.703 108.664 319.456C104.403 319.104 105.45 317.361 105.45 317.361V306.797L126.12 301.559C126.12 301.559 134.29 304.354 136.528 306.797C138.652 309.123 139.88 307.333 143.689 308.004C143.877 308.037 144.074 308.079 144.279 308.125C147.879 308.963 149.831 309.278 150.983 312.261C151.217 312.888 151.403 313.53 151.541 314.185C152.58 318.987 145.528 318.949 141.547 320.763Z" fill="#A36468"/>
<path opacity="0.1" d="M150.975 312.261C150.235 312.724 149.457 313.123 148.65 313.455C145.939 314.692 143.358 316.2 140.617 317.369C137.877 318.538 134.923 319.368 131.952 319.15C130.402 319.037 128.814 318.647 127.343 319.1C126.422 319.459 125.555 319.944 124.766 320.541C119.856 320.227 111.585 319.703 108.664 319.456C104.403 319.104 105.45 317.361 105.45 317.361V316.129C105.624 316.1 105.799 316.081 105.974 316.07C106.995 316.052 108.012 316.203 108.983 316.519L115.389 318.245C115.568 317.579 115.88 316.956 116.307 316.415C116.734 315.874 117.268 315.426 117.874 315.098C119.095 314.447 120.467 314.132 121.85 314.185C125.169 314.231 128.307 315.802 131.621 315.961C132.544 316.045 133.474 315.891 134.32 315.513C134.776 315.282 135.158 314.951 135.619 314.704C136.327 314.357 137.078 314.104 137.852 313.95C140.013 313.405 142.135 312.716 144.204 311.888C144.795 311.654 145.486 311.235 145.407 310.606C145.302 309.768 143.986 309.667 143.638 308.896C143.58 308.757 143.553 308.607 143.56 308.456C143.568 308.305 143.609 308.158 143.68 308.025C143.869 308.058 144.066 308.1 144.271 308.146C147.87 308.951 149.823 309.278 150.975 312.261Z" fill="black"/>
<path d="M132.539 248.276L131.42 274.603C131.42 274.603 129.744 279.98 130.653 281.517C131.563 283.055 133.096 284.589 132.539 285.498C131.982 286.407 125.278 296.238 123.111 292.466C120.945 288.695 118.808 272.353 118.808 272.353L120.807 252.169L132.539 248.276Z" fill="#444053"/>
<path d="M137.391 182.682L140.5 186.839V222.992C140.5 222.992 141.409 232.63 140.5 234.62C139.591 236.611 134.982 240.591 134.982 240.591L131.106 220.688L131.944 199.632L137.391 182.682Z" fill="#444053"/>
<path opacity="0.1" d="M132.539 248.276L131.42 274.603C131.42 274.603 129.744 279.98 130.653 281.517C131.563 283.055 133.096 284.589 132.539 285.498C131.982 286.407 125.278 296.238 123.111 292.466C120.945 288.695 118.808 272.353 118.808 272.353L120.807 252.169L132.539 248.276Z" fill="black"/>
<path opacity="0.1" d="M137.391 182.682L140.5 186.839V222.992C140.5 222.992 141.409 232.63 140.5 234.62C139.591 236.611 134.982 240.591 134.982 240.591L131.106 220.688L131.944 199.632L137.391 182.682Z" fill="black"/>
<path d="M140.5 167.262V186.818L137.01 202.041C137.01 202.041 135.891 238.777 136.867 243.244C137.844 247.711 133.515 251.905 133.515 251.905C133.515 251.905 131.001 252.186 131.001 254.138C131.001 256.091 126.811 261.681 126.811 261.681L126.949 272.575C126.949 272.575 128.768 292.969 125.973 296.879C123.178 300.788 126.949 301.35 126.949 301.35C123.459 312.802 106.699 310.149 105.186 308.892C103.674 307.635 105.186 282.913 105.186 282.913C105.186 282.913 108.932 245.201 111.865 243.524C114.798 241.848 112.008 239.753 112.984 237.239C113.96 234.725 112.008 227.882 112.008 227.882C112.008 227.882 111.17 219.778 109.075 215.869C106.98 211.959 107.256 201.203 107.256 201.203C107.256 201.203 101.39 193.38 99.6472 190.308C97.9042 187.237 96.7812 179.275 97.2002 173.267C97.4852 169.206 99.6179 163.294 100.971 159.891C101.621 158.261 102.09 157.205 102.09 157.205L102.488 157.31L125.374 163.302L140.5 167.262Z" fill="#444053"/>
<path opacity="0.1" d="M142.629 73.8195C140.466 74.4397 138.401 76.5683 136.603 79.1537H136.134C133.499 79.1556 130.911 78.4619 128.63 77.1426C126.349 75.8234 124.457 73.9255 123.145 71.6406C122.597 70.6939 122.155 69.689 121.829 68.6446C123.124 65.3553 124.083 62.4975 124.083 62.4975C124.083 62.4975 149.228 71.9339 142.629 73.8195Z" fill="black"/>
<path d="M151.113 63.3439C151.117 65.6367 150.594 67.8997 149.586 69.9586C148.577 72.0175 147.109 73.8175 145.296 75.2197C143.482 76.622 141.37 77.5892 139.124 78.0469C136.877 78.5045 134.556 78.4403 132.338 77.8593C130.12 77.2783 128.065 76.196 126.332 74.6957C124.598 73.1954 123.232 71.3171 122.339 69.2056C121.445 67.0941 121.049 64.8057 121.179 62.5167C121.309 60.2276 121.963 57.9991 123.09 56.0026C123.545 55.1914 124.075 54.4253 124.674 53.7147C125.662 52.5375 126.824 51.5174 128.118 50.6894C130.305 49.2996 132.816 48.5008 135.404 48.3713C137.991 48.2417 140.569 48.7857 142.884 49.9502C145.199 51.1146 147.172 52.8597 148.611 55.0148C150.049 57.17 150.904 59.6616 151.092 62.2461C151.101 62.6148 151.113 62.9794 151.113 63.3439Z" fill="#EFB7B9"/>
<path opacity="0.1" d="M138.526 99.204L138.476 99.665L131.508 88.7703C130.779 90.4925 130.373 91.6448 130.373 91.6448C130.373 91.6448 113.822 79.1831 116.441 78.345C117.321 78.0643 118.477 76.1787 119.621 73.8028L119.764 73.5011C120.979 77.1215 128.039 84.358 130.976 87.2577C131.315 87.5929 131.596 87.8694 131.814 88.0706L132.262 88.4896L132.497 88.7242C133.565 89.8263 138.074 94.687 138.526 99.204Z" fill="black"/>
<path d="M143.735 136.17L142.972 160.713L142.838 165.083C142.838 165.083 133.804 164.245 125.374 163.323C118.586 162.582 112.188 161.781 111.203 161.312C109.946 160.721 107.252 160.264 105.128 159.975C103.485 159.753 102.195 159.636 102.195 159.636C102.195 159.636 101.713 159.778 100.971 159.912C99.3539 160.206 96.5131 160.444 94.858 159.007C92.7421 157.168 98.3022 150.484 99.6891 148.879L99.995 148.532L99.4713 143.692L98.1095 131.142C98.1095 131.142 97.2715 123.914 96.0145 120.038C95.6784 118.936 95.4359 117.808 95.2896 116.665C94.8226 113.125 95.0618 109.527 95.9935 106.08C96.3916 104.616 96.6442 103.115 96.7477 101.601C96.9572 97.7249 108.794 82.7448 111.727 81.3829C113.046 80.7676 114.108 79.7089 114.727 78.3911C114.931 77.9768 115.085 77.5392 115.184 77.0879C116.441 71.6406 119.621 73.8028 119.621 73.8028C120.388 78.0643 132.258 89.3444 132.258 89.3444L132.493 89.5791C133.67 90.7859 138.916 96.4511 138.543 101.287C138.469 103.086 138.737 104.884 139.335 106.583C141.75 114.186 143.138 122.078 143.462 130.048L143.735 136.17Z" fill="#DCE6F2"/>
<path opacity="0.1" d="M126.916 107.027C126.916 107.027 123.983 114.151 121.783 115.303C119.583 116.455 127.963 117.733 126.916 107.027Z" fill="black"/>
<path opacity="0.1" d="M129.116 120.331C129.116 120.331 122.412 121.169 122.412 122.426C122.412 123.683 129.116 120.331 129.116 120.331Z" fill="black"/>
<path opacity="0.1" d="M136.134 128.502C136.134 128.502 126.392 149.244 123.669 149.872C120.945 150.501 136.134 128.502 136.134 128.502Z" fill="black"/>
<path opacity="0.1" d="M132.074 90.3961L124.016 93.8992L114.291 79.2082C114.496 78.7939 114.649 78.3563 114.748 77.905C116.005 72.4577 119.185 74.6199 119.185 74.6199C119.952 78.8814 131.822 90.1615 131.822 90.1615L132.074 90.3961Z" fill="black"/>
<path d="M132.493 89.5581L124.435 93.0611L114.71 78.3701C114.915 77.9558 115.068 77.5182 115.167 77.067C116.424 71.6197 119.604 73.7818 119.604 73.7818C120.371 78.0433 132.241 89.3235 132.241 89.3235L132.493 89.5581Z" fill="#DCE6F2"/>
<path opacity="0.1" d="M142.838 165.083C142.838 165.083 133.804 164.245 125.374 163.323L140.5 167.283V171.892C139.838 172.491 139.264 172.802 138.891 172.642C137.148 171.909 122.923 169.604 122.923 169.604C122.923 169.604 114.66 165.414 105.744 160.386C105.527 160.266 105.317 160.134 105.115 159.992C104.076 159.286 103.18 158.389 102.475 157.348C100.829 154.964 100.024 151.901 99.6766 148.896C99.4811 147.174 99.4082 145.441 99.4587 143.709C99.5019 141.745 99.6811 139.786 99.995 137.847C99.1327 130.335 98.713 122.78 98.738 115.219C98.8428 103.486 109.842 99.2962 109.842 99.2962C130.058 97.5154 123.79 130.199 123.79 130.199C123.79 130.199 122.621 139.418 122.303 140.361C121.984 141.303 120.84 142.875 120.995 145.075C121.15 147.275 125.014 149.906 125.014 149.906C125.014 149.906 128.785 151.674 130.339 154.293C131.47 156.225 138.82 158.844 142.972 160.713L142.838 165.083Z" fill="black"/>
<path opacity="0.1" d="M149.609 54.0416C149.617 54.7318 149.474 55.4153 149.19 56.0445C148.975 56.558 148.726 57.0563 148.444 57.5363C148.003 58.4191 147.377 59.1965 146.609 59.8158C145.641 60.5071 144.418 60.6999 143.257 60.9806C142.096 61.2614 140.89 61.7097 140.228 62.6986C139.869 63.3344 139.629 64.0301 139.52 64.7519C139.409 65.473 139.121 66.1554 138.682 66.738C138.453 67.0225 138.136 67.223 137.781 67.3079C137.426 67.3929 137.053 67.3575 136.721 67.2074C136.37 66.9711 136.104 66.629 135.962 66.231C135.485 65.1541 135.363 63.9599 135.17 62.7992C134.978 61.6385 134.705 60.4443 133.993 59.5099C133.281 58.5754 132.019 57.9595 130.901 58.324C130.526 58.4682 130.185 58.6865 129.897 58.9659C129.609 59.2453 129.38 59.5799 129.225 59.9498C128.915 60.6904 128.702 61.4678 128.592 62.2629C128.072 65.1066 127.459 67.9337 126.753 70.7439C126.731 70.8591 126.684 70.968 126.614 71.0624C126.503 71.1734 126.353 71.2366 126.195 71.2384C125.257 71.3641 124.356 70.7062 123.409 70.7774C123.311 70.7839 123.215 70.7994 123.12 70.8235C121.589 68.1626 120.913 65.0952 121.183 62.0372C121.454 58.9791 122.658 56.0781 124.632 53.7273L124.708 53.7064C125.338 53.4827 125.91 53.1221 126.384 52.6504C126.989 52.0451 127.549 51.3967 128.06 50.7103L128.395 50.2913C129.358 49.131 130.455 48.0888 131.663 47.1863C131.993 46.9162 132.371 46.7114 132.778 46.583C133.126 46.5152 133.482 46.5039 133.834 46.5494C135.281 46.7231 136.74 46.7778 138.195 46.7128C139.21 46.5534 140.232 46.4499 141.258 46.4028C143.911 46.4782 146.173 48.3512 147.849 50.4045C148.75 51.4562 149.555 52.6672 149.609 54.0416Z" fill="black"/>
<path d="M121.134 56.4007C120.551 57.3561 119.5 58.0056 119.106 59.0531C118.527 60.5742 119.504 62.4682 118.607 63.8258C118.31 64.2825 117.819 64.6219 117.652 65.1457C117.367 66.0299 118.146 66.9727 117.945 67.882C117.744 68.7912 116.546 69.5581 116.864 70.4464C117.052 70.8338 117.382 71.1339 117.786 71.2844C118.421 71.6487 119.151 71.8109 119.881 71.7496C121.025 71.561 121.875 70.438 123.036 70.3542C123.979 70.2872 124.88 70.9408 125.818 70.8193C125.975 70.8138 126.125 70.7495 126.237 70.6391C126.308 70.5458 126.356 70.4365 126.375 70.3207C127.079 67.5132 127.694 64.6862 128.219 61.8396C128.326 61.0444 128.537 60.2667 128.848 59.5266C129.004 59.1575 129.233 58.8234 129.521 58.5442C129.809 58.265 130.15 58.0462 130.524 57.9008C131.642 57.5404 132.899 58.1522 133.616 59.0866C134.332 60.0211 134.605 61.2153 134.797 62.376C134.99 63.5367 135.112 64.7309 135.585 65.8078C135.729 66.2072 135.996 66.5505 136.348 66.7883C136.976 67.1529 137.823 66.8637 138.304 66.319C138.746 65.7361 139.034 65.0517 139.142 64.3286C139.252 63.6082 139.492 62.9138 139.851 62.2796C140.513 61.2907 141.723 60.8423 142.88 60.5616C144.036 60.2809 145.256 60.0839 146.232 59.3925C146.999 58.7739 147.625 57.9981 148.067 57.1172C148.687 56.0361 149.266 54.8629 149.215 53.6184C149.161 52.2607 148.356 51.0497 147.497 49.9938C145.821 47.9406 143.555 46.0675 140.902 45.9963C139.876 46.0392 138.853 46.1428 137.839 46.3064C136.383 46.3719 134.924 46.3158 133.478 46.1388C133.126 46.0967 132.77 46.1094 132.422 46.1765C132.015 46.3008 131.637 46.506 131.311 46.7799C130.102 47.6808 129.004 48.7216 128.039 49.8807C127.417 50.7055 126.742 51.4893 126.019 52.2272C125.545 52.6996 124.973 53.0616 124.343 53.2873C123.924 53.4047 123.505 53.3209 123.107 53.4508C121.871 53.8404 121.708 55.4537 121.134 56.4007Z" fill="#965D7B"/>
<path opacity="0.1" d="M161.484 67.794C158.132 68.4099 155.354 65.6989 153.816 63.7211C153.344 63.1204 152.914 62.4875 152.53 61.8271L164.035 63.9976L164.5 64.0856C164.5 64.0856 166.616 66.8554 161.484 67.794Z" fill="black"/>
<g opacity="0.1">
<path opacity="0.1" d="M117.945 66.6836C117.992 66.1356 117.909 65.5842 117.702 65.0745C117.702 65.1164 117.664 65.1583 117.652 65.2002C117.472 65.7617 117.715 66.3442 117.87 66.9266C117.903 66.8483 117.928 66.7669 117.945 66.6836V66.6836Z" fill="black"/>
<path opacity="0.1" d="M118.942 59.8241C118.899 60.4035 118.91 60.9857 118.976 61.5631C119.019 60.9836 119.008 60.4015 118.942 59.8241Z" fill="black"/>
<path opacity="0.1" d="M148.042 55.9062C147.601 56.789 146.975 57.5665 146.207 58.1857C145.239 58.8771 144.02 59.0699 142.855 59.3506C141.69 59.6314 140.487 60.0797 139.825 61.0686C139.467 61.7046 139.227 62.4003 139.117 63.1218C139.008 63.8448 138.72 64.529 138.279 65.1122C137.797 65.6569 136.951 65.9503 136.323 65.5815C135.971 65.3438 135.704 65.0004 135.56 64.601C135.086 63.5241 134.961 62.3341 134.772 61.1692C134.584 60.0043 134.303 58.8143 133.591 57.8799C132.878 56.9454 131.617 56.3295 130.498 56.694C130.124 56.8388 129.783 57.0573 129.495 57.3366C129.207 57.6159 128.978 57.9503 128.822 58.3198C128.512 59.0599 128.301 59.8376 128.194 60.6328C127.672 63.4794 127.057 66.3064 126.35 69.1139C126.331 69.2297 126.283 69.339 126.212 69.4324C126.1 69.5428 125.95 69.6071 125.793 69.6125C124.854 69.7341 123.954 69.0804 123.011 69.1474C121.85 69.2312 121 70.3542 119.856 70.5386C119.126 70.604 118.394 70.4415 117.761 70.0735C117.469 69.9482 117.208 69.7625 116.994 69.5287C116.896 69.6691 116.831 69.8299 116.804 69.9991C116.777 70.1682 116.789 70.3412 116.839 70.5051C117.023 70.8952 117.355 71.1964 117.761 71.3431C118.394 71.7112 119.126 71.8737 119.856 71.8082C121 71.6239 121.85 70.5009 123.011 70.4171C123.954 70.35 124.854 71.0037 125.793 70.8822C125.95 70.8767 126.1 70.8124 126.212 70.702C126.283 70.6086 126.331 70.4993 126.35 70.3835C127.054 67.5901 127.669 64.763 128.194 61.9025C128.301 61.1072 128.512 60.3295 128.822 59.5895C128.978 59.22 129.207 58.8856 129.495 58.6063C129.783 58.327 130.124 58.1084 130.498 57.9637C131.617 57.5991 132.874 58.2151 133.591 59.1495C134.307 60.0839 134.579 61.2781 134.772 62.4388C134.965 63.5995 135.086 64.7938 135.56 65.8707C135.704 66.27 135.971 66.6134 136.323 66.8512C136.951 67.2157 137.797 66.9266 138.279 66.3819C138.72 65.7986 139.008 65.1144 139.117 64.3915C139.227 63.6699 139.467 62.9743 139.825 62.3383C140.487 61.3494 141.698 60.9052 142.855 60.6203C144.011 60.3353 145.231 60.1468 146.207 59.4554C146.975 58.8361 147.601 58.0587 148.042 57.1759C148.662 56.099 149.24 54.9257 149.19 53.6812C149.182 53.5212 149.165 53.3618 149.14 53.2035C148.938 54.1626 148.566 55.0779 148.042 55.9062V55.9062Z" fill="black"/>
</g>
<path opacity="0.1" d="M149.207 56.032C150.281 57.9425 150.918 60.0678 151.071 62.2545C147.338 60.1594 143.827 57.8589 142.054 57.0586C138.966 55.6632 127.419 55.8727 123.078 56.0026C123.532 55.1914 124.062 54.4253 124.662 53.7148C125.654 52.5366 126.819 51.5164 128.118 50.6894C129.839 49.5974 131.764 48.8677 133.776 48.545C135.789 48.2223 137.845 48.3134 139.821 48.8127C141.797 49.312 143.65 50.2089 145.268 51.4487C146.885 52.6886 148.232 54.2452 149.228 56.0236L149.207 56.032Z" fill="black"/>
<path opacity="0.1" d="M162.531 66.0173C160.516 66.6375 157.227 65.4391 153.816 63.7211C153.344 63.1204 152.914 62.4875 152.53 61.8271L164.035 63.9976C164.798 64.5172 164.991 65.2589 162.531 66.0173Z" fill="black"/>
<path d="M137.026 41.5044C137.026 41.5044 126.028 40.8758 122.935 46.8469L122.437 52.1392L121.599 52.047L121.431 55.6465C121.431 55.6465 138.242 54.9132 142.067 56.6395C145.893 58.3659 157.78 67.0649 162.544 65.5983C167.308 64.1317 162.125 62.7699 162.125 62.7699C162.125 62.7699 155.567 59.9917 155.567 57.8128C155.567 55.6339 153.942 44.1233 137.026 41.5044Z" fill="#444053"/>
<path opacity="0.1" d="M115.812 237.692C115.812 237.692 122.831 244.501 125.868 243.977C125.868 243.977 117.279 243.244 115.812 237.692Z" fill="black"/>
<path opacity="0.1" d="M114.346 240.847C114.346 240.847 114.974 244.35 116.65 244.006C118.326 243.663 114.346 240.847 114.346 240.847Z" fill="black"/>
<path opacity="0.1" d="M125.345 299.393C125.345 299.393 115.381 307.145 117.061 307.354C118.741 307.564 125.345 299.393 125.345 299.393Z" fill="black"/>
<path d="M138.673 145.54L170.936 140.289V170.836L140.282 169.231L138.673 145.54Z" fill="#6C63FF"/>
<path opacity="0.05" d="M138.673 145.54L170.936 140.289V170.836L140.282 169.231L138.673 145.54Z" fill="black"/>
<path d="M170.936 140.289L209.627 143.185L207.486 169.768L170.936 170.836V140.289Z" fill="#6C63FF"/>
<path opacity="0.1" d="M170.936 140.289L209.627 143.185L207.486 169.768L170.936 170.836V140.289Z" fill="black"/>
<path d="M182.832 130.966L170.936 140.289L209.627 143.185L215.95 133.644L182.832 130.966Z" fill="#6C63FF"/>
<path d="M126.991 135.357L156.037 131.821L170.936 140.289L138.673 145.54L126.991 135.357Z" fill="#6C63FF"/>
<path d="M178.009 148.222V189.986L162.896 188.435L156.322 187.765L154.319 187.555L147.749 186.881L138.673 185.95V145.54L170.932 147.735L178.009 148.222Z" fill="#6C63FF"/>
<path d="M209.627 143.185V183.914L197.514 186.24L191.623 187.371L178.009 189.986V148.222L209.627 143.185Z" fill="#6C63FF"/>
<path opacity="0.05" d="M209.627 143.185V183.914L197.514 186.24L191.623 187.371L178.009 189.986V148.222L209.627 143.185Z" fill="black"/>
<path d="M126.991 154.331L138.673 145.54L178.009 148.222L172.218 157.976L126.991 154.331Z" fill="#6C63FF"/>
<path opacity="0.1" d="M126.991 154.331L138.673 145.54L178.009 148.222L172.218 157.976L126.991 154.331Z" fill="white"/>
<path d="M209.627 143.185L178.009 148.222L188.3 157.44L222.168 151.758L209.627 143.185Z" fill="#6C63FF"/>
<path opacity="0.1" d="M209.627 143.185L178.009 148.222L188.3 157.44L222.168 151.758L209.627 143.185Z" fill="white"/>
<path opacity="0.1" d="M197.514 186.24L191.623 187.371V178.668L197.141 177.277L197.514 186.24Z" fill="white"/>
<path opacity="0.1" d="M162.896 182.678V188.435L156.322 187.765V182.678H162.896Z" fill="white"/>
<path opacity="0.1" d="M154.319 184.492V187.555L147.749 186.881V184.492H154.319Z" fill="white"/>
<path opacity="0.1" d="M174.054 179.623C169.549 185.385 154.675 181.404 154.675 181.404L143.622 169.873L142.122 168.31L145.055 162.862C145.055 162.862 145.893 163.139 147.292 163.625C154.7 166.214 177.846 174.775 174.054 179.623Z" fill="black"/>
<path d="M173.635 178.785C169.13 184.547 154.256 180.566 154.256 180.566L143.203 169.034L141.703 167.472L144.636 162.024C144.636 162.024 145.474 162.301 146.873 162.787C154.281 165.376 177.427 173.937 173.635 178.785Z" fill="#EFB7B9"/>
<path opacity="0.1" d="M146.856 162.787C146.245 164.547 144.69 167.153 143.186 169.034L141.686 167.472L144.619 162.024C144.619 162.024 145.461 162.301 146.856 162.787Z" fill="black"/>
<path d="M110.261 97.6201C110.261 97.6201 99.2618 101.81 99.157 113.543C99.132 121.104 99.5517 128.659 100.414 136.17C100.414 136.17 97.2715 153.665 106.175 158.693C115.079 163.721 123.354 167.912 123.354 167.912C123.354 167.912 137.58 170.216 139.327 170.949C141.074 171.683 147.145 162.255 146.203 160.683C145.26 159.112 132.308 155.236 130.771 152.617C129.233 149.998 125.445 148.234 125.445 148.234C125.445 148.234 121.582 145.598 121.427 143.399C121.272 141.199 122.412 139.627 122.734 138.685C123.057 137.742 124.226 128.523 124.226 128.523C124.226 128.523 130.477 95.8183 110.261 97.6201Z" fill="#DCE6F2"/>
<path opacity="0.1" d="M115.289 136.464C115.289 136.464 100.414 138.14 101.566 143.378C101.566 143.378 107.219 138.094 115.289 136.464Z" fill="black"/>
<path opacity="0.1" d="M115.289 138.559C115.289 138.559 106.846 144.739 108.396 145.158C109.946 145.577 115.289 138.559 115.289 138.559Z" fill="black"/>
<path opacity="0.1" d="M119.06 141.073C119.06 141.073 116.65 145.406 118.012 145.179C119.374 144.953 119.06 141.073 119.06 141.073Z" fill="black"/>
<path d="M273.931 47.0942C273.931 47.0942 258.009 46.1346 259.87 57.3058C259.87 57.3058 259.497 59.2794 261.286 60.1761C261.286 60.1761 261.315 59.3381 262.92 59.6272C263.492 59.7234 264.072 59.7515 264.651 59.711C265.434 59.6587 266.179 59.3511 266.771 58.8352V58.8352C266.771 58.8352 271.25 56.9873 272.993 49.6628C272.993 49.6628 274.283 48.0621 274.25 47.6515L271.56 48.8038C271.56 48.8038 272.477 50.7439 271.753 52.3571C271.753 52.3571 271.669 48.875 271.149 48.9546C271.044 48.9546 269.754 49.6293 269.754 49.6293C269.754 49.6293 271.334 53.0066 270.139 55.4663C270.139 55.4663 270.592 51.3012 269.26 49.8723L267.366 50.9785C267.366 50.9785 269.213 54.469 267.961 57.3184C267.961 57.3184 268.283 52.9479 266.968 51.2467L265.25 52.5834C265.25 52.5834 266.989 56.0278 265.928 58.3911C265.928 58.3911 265.79 53.3041 264.877 52.9186C264.877 52.9186 263.377 54.2427 263.15 54.7875C263.15 54.7875 264.336 57.3016 263.599 58.6048C263.599 58.6048 263.146 55.2149 262.761 55.1981C262.761 55.1981 261.265 57.4441 261.11 58.9693C261.182 57.5474 261.626 56.1692 262.396 54.9718C261.534 55.1349 260.739 55.5472 260.109 56.1577C260.109 56.1577 260.339 54.5696 262.765 54.4313C262.765 54.4313 264.022 52.7259 264.332 52.6211C264.332 52.6211 261.919 52.42 260.456 53.0694C260.456 53.0694 261.743 51.5735 264.776 52.2314L266.452 50.8486C266.452 50.8486 263.276 50.4296 261.927 50.8947C261.927 50.8947 263.477 49.5706 266.909 50.5344L268.753 49.4323C268.753 49.4323 266.046 48.8457 264.433 49.0594C264.433 49.0594 266.134 48.1417 269.293 49.1348L270.613 48.544C270.613 48.544 268.627 48.1543 268.049 48.0914C267.47 48.0286 267.437 47.8694 267.437 47.8694C268.693 47.6602 269.983 47.8053 271.162 48.2884C271.162 48.2884 273.99 47.2702 273.931 47.0942Z" fill="#6C63FF"/>
<path opacity="0.1" d="M322.309 102.967C322.309 102.967 306.387 102.007 308.248 113.179C308.248 113.179 307.875 115.152 309.664 116.049C309.664 116.049 309.693 115.211 311.302 115.5C311.874 115.596 312.455 115.624 313.033 115.584C313.807 115.528 314.542 115.222 315.128 114.712V114.712C315.128 114.712 319.611 112.86 321.354 105.536C321.354 105.536 322.64 103.939 322.59 103.528L319.9 104.677C319.9 104.677 320.818 106.617 320.097 108.23C320.097 108.23 320.009 104.748 319.494 104.827C319.389 104.827 318.094 105.502 318.094 105.502C318.094 105.502 319.678 108.884 318.484 111.339C318.484 111.339 318.936 107.174 317.6 105.745L315.727 106.839C315.727 106.839 317.575 110.329 316.322 113.179C316.322 113.179 316.645 108.808 315.329 107.107L313.615 108.448C313.615 108.448 315.35 111.888 314.294 114.251C314.294 114.251 314.156 109.164 313.242 108.779C313.242 108.779 311.742 110.103 311.512 110.648C311.512 110.648 312.702 113.162 311.964 114.465C311.964 114.465 311.512 111.075 311.126 111.058C311.126 111.058 309.63 113.304 309.475 114.829C309.55 113.407 309.995 112.029 310.766 110.832C309.903 110.995 309.106 111.408 308.474 112.018C308.474 112.018 308.709 110.43 311.135 110.291C311.135 110.291 312.371 108.586 312.702 108.481C312.702 108.481 310.288 108.28 308.826 108.93C308.826 108.93 310.112 107.434 313.142 108.113L314.818 106.73C314.818 106.73 311.637 106.311 310.292 106.776C310.292 106.776 311.843 105.452 315.274 106.415L317.118 105.313C317.118 105.313 314.407 104.731 312.794 104.94C312.794 104.94 314.499 104.023 317.659 105.016L318.978 104.425C318.978 104.425 316.992 104.035 316.41 103.973C315.827 103.91 315.798 103.75 315.798 103.75C317.056 103.541 318.347 103.686 319.527 104.169C319.527 104.169 322.36 103.143 322.309 102.967Z" fill="#6C63FF"/>
<path opacity="0.1" d="M225.583 93.0486C225.583 93.0486 229.249 77.507 217.919 77.4525C217.919 77.4525 216.038 76.7485 214.852 78.3576C214.852 78.3576 215.661 78.5294 215.112 80.063C214.922 80.6053 214.795 81.1678 214.735 81.7391C214.654 82.518 214.829 83.3021 215.233 83.9725V83.9725C215.233 83.9725 216.293 88.7075 223.194 91.6742C223.194 91.6742 224.552 93.2162 224.963 93.233L224.292 90.3878C224.292 90.3878 222.222 90.9618 220.756 89.9688C220.756 89.9688 224.204 90.4758 224.208 89.9688C224.208 89.864 223.789 88.477 223.789 88.477C223.789 88.477 220.19 89.4575 217.969 87.8611C217.969 87.8611 221.996 89.0176 223.634 87.9491L222.88 85.8875C222.88 85.8875 219.109 87.1152 216.528 85.393C216.528 85.393 220.781 86.4573 222.683 85.4517L221.657 83.5325C221.657 83.5325 217.969 84.6555 215.82 83.2099C215.82 83.2099 220.848 83.939 221.393 83.1093C221.393 83.1093 220.345 81.4039 219.847 81.0854C219.847 81.0854 217.182 81.8313 216.008 80.8801C216.008 80.8801 219.423 81.01 219.503 80.6497C219.503 80.6497 217.546 78.7934 216.055 78.3744C217.445 78.6909 218.728 79.3638 219.78 80.327C219.764 79.4488 219.493 78.5941 219 77.8673C219 77.8673 220.525 78.3702 220.257 80.8005C220.257 80.8005 221.724 82.309 221.77 82.6526C221.77 82.6526 222.377 80.3102 221.988 78.7557C221.988 78.7557 223.245 80.2809 222.059 83.1512L223.132 85.0578C223.132 85.0578 224.104 81.9989 223.856 80.591C223.856 80.591 224.9 82.3425 223.362 85.5606L224.137 87.5678C224.137 87.5678 225.172 84.9949 225.239 83.3775C225.239 83.3775 225.855 85.2128 224.334 88.1586L224.694 89.5581C224.694 89.5581 225.415 87.6683 225.574 87.1068C225.734 86.5453 225.897 86.5411 225.897 86.5411C225.891 87.8159 225.529 89.0637 224.854 90.1447C224.854 90.1447 225.403 93.0695 225.583 93.0486Z" fill="#6C63FF"/>
<path opacity="0.1" d="M190.713 98.3451C190.713 98.3451 177.925 88.7787 173.354 99.1412C173.354 99.1412 171.959 100.587 172.96 102.317C172.96 102.317 173.438 101.643 174.636 102.762C175.061 103.156 175.53 103.5 176.036 103.784C176.72 104.165 177.51 104.312 178.286 104.203V104.203C178.286 104.203 183.046 105.121 188.526 99.9625C188.526 99.9625 190.483 99.3339 190.667 98.9652L187.78 98.4582C187.78 98.4582 187.479 100.583 185.991 101.534C185.991 101.534 187.831 98.5755 187.353 98.3618C187.257 98.3157 185.815 98.1523 185.815 98.1523C185.815 98.1523 185.279 101.848 182.932 103.243C182.932 103.243 185.601 100.013 185.27 98.0853L183.079 97.9679C183.079 97.9679 182.706 101.903 180.092 103.595C180.092 103.595 182.761 100.122 182.606 97.9763L180.435 98.1523C180.435 98.1523 179.995 101.978 177.812 103.369C177.812 103.369 180.49 99.0448 179.941 98.2235C179.941 98.2235 177.959 98.5043 177.469 98.8311C177.469 98.8311 177.087 101.572 175.746 102.267C175.746 102.267 177.234 99.1873 176.932 98.9736C176.932 98.9736 174.448 100.025 173.471 101.224C174.316 100.076 175.445 99.1692 176.748 98.5923C175.937 98.2554 175.046 98.1622 174.184 98.3241C174.184 98.3241 175.248 97.1257 177.351 98.3451C177.351 98.3451 179.321 97.6034 179.656 97.6956C179.656 97.6956 177.749 96.1996 176.17 95.9398C176.17 95.9398 178.072 95.3951 180.23 97.6159L182.404 97.3939C182.404 97.3939 179.987 95.2987 178.6 94.9468C178.6 94.9468 180.624 94.6912 182.958 97.3813L185.103 97.4777C185.103 97.4777 183.163 95.4999 181.701 94.7875C181.701 94.7875 183.624 94.9551 185.719 97.5238L187.148 97.7542C187.148 97.7542 185.702 96.3379 185.249 95.9692C184.797 95.6004 184.86 95.4454 184.86 95.4454C186.025 95.9616 187.025 96.7914 187.747 97.8422C187.747 97.8422 190.659 98.5169 190.713 98.3451Z" fill="#6C63FF"/>
<path opacity="0.1" d="M233.288 9.46576C233.288 9.46576 220.5 -0.10476 215.929 10.2619C215.929 10.2619 214.534 11.7075 215.535 13.4381C215.535 13.4381 216.013 12.7635 217.211 13.8823C217.638 14.2751 218.109 14.6169 218.615 14.9005C219.299 15.2819 220.089 15.429 220.865 15.3195V15.3195C220.865 15.3195 225.625 16.2372 231.105 11.0748C231.105 11.0748 233.062 10.4505 233.242 10.0775L230.355 9.5789C230.355 9.5789 230.058 11.7034 228.566 12.6545C228.566 12.6545 230.41 9.69622 229.932 9.48252C229.836 9.43643 228.394 9.27301 228.394 9.27301C228.394 9.27301 227.841 12.9772 225.495 14.3642C225.495 14.3642 228.16 11.1335 227.833 9.20596L225.641 9.08864C225.641 9.08864 225.264 13.0233 222.654 14.7119C222.654 14.7119 225.323 11.2382 225.168 9.09283L223.002 9.26882C223.002 9.26882 222.558 13.0987 220.375 14.4899C220.375 14.4899 223.056 10.1655 222.507 9.34424C222.507 9.34424 220.525 9.62499 220.035 9.95183C220.035 9.95183 219.654 12.6922 218.313 13.3878C218.313 13.3878 219.8 10.308 219.499 10.0901C219.499 10.0901 217.014 11.146 216.038 12.3445C216.881 11.1958 218.011 10.2884 219.314 9.71298C218.503 9.3736 217.61 9.28034 216.746 9.44481C216.746 9.44481 217.814 8.2464 219.918 9.46576C219.918 9.46576 221.887 8.7199 222.222 8.81627C222.222 8.81627 220.316 7.32036 218.736 7.05637C218.736 7.05637 220.634 6.51583 222.792 8.73247L224.967 8.51038C224.967 8.51038 222.553 6.41526 221.162 6.05909C221.162 6.05909 223.186 5.80768 225.524 8.49781L227.669 8.59C227.669 8.59 225.729 6.6122 224.263 5.90405C224.263 5.90405 226.19 6.07166 228.285 8.64028L229.71 8.87074C229.71 8.87074 228.26 7.4712 227.808 7.11084C227.355 6.75048 227.418 6.59125 227.418 6.59125C228.584 7.1069 229.584 7.93678 230.305 8.98807C230.305 8.98807 233.217 9.62499 233.288 9.46576Z" fill="#6C63FF"/>
<path opacity="0.1" d="M282.152 21.5881C282.152 21.5881 277.04 6.45717 267.399 12.4031C267.399 12.4031 265.43 12.8221 265.275 14.7958C265.275 14.7958 266.05 14.5108 266.394 16.1031C266.521 16.6695 266.714 17.2193 266.968 17.7415C267.314 18.4443 267.878 19.0161 268.577 19.3715V19.3715C268.577 19.3715 271.979 22.8285 279.42 21.6845C279.42 21.6845 281.385 22.2795 281.746 22.0742L279.651 20.0168C279.651 20.0168 278.201 21.5965 276.433 21.5337C276.433 21.5337 279.63 20.1425 279.366 19.6941C279.311 19.6062 278.218 18.655 278.218 18.655C278.218 18.655 275.679 21.3912 272.955 21.211C272.955 21.211 276.982 20.0629 277.803 18.2778L276.068 16.9412C276.068 16.9412 273.529 19.9665 270.416 19.8743C270.416 19.8743 274.606 18.5293 275.666 16.6688L273.781 15.5835C273.781 15.5835 271.267 18.4874 268.66 18.3952C268.66 18.3952 273.32 16.3545 273.332 15.3656C273.332 15.3656 271.543 14.4731 270.952 14.4647C270.952 14.4647 269.084 16.5054 267.6 16.321C267.6 16.321 270.567 14.624 270.441 14.2762C270.441 14.2762 267.801 13.7356 266.314 14.1714C267.659 13.703 269.104 13.5946 270.504 13.8571C270.026 13.1192 269.343 12.5368 268.539 12.181C268.539 12.181 270.098 11.7997 271.141 13.9954C271.141 13.9954 273.186 14.5024 273.403 14.7664C273.403 14.7664 272.683 12.4576 271.531 11.343C271.531 11.343 273.403 11.9757 273.915 15.0388L275.834 16.0863C275.834 16.0863 275.042 12.9814 274.086 11.8961C274.086 11.8961 275.901 12.8347 276.295 16.3755L278.013 17.6703C278.013 17.6703 277.535 14.9382 276.73 13.5219C276.73 13.5219 278.222 14.7538 278.49 18.06L279.533 19.0572C279.533 19.0572 279.148 17.0711 278.989 16.5096C278.83 15.9481 278.959 15.9104 278.959 15.9104C279.626 16.9974 279.978 18.2475 279.978 19.5224C279.978 19.5224 282.006 21.6971 282.152 21.5881Z" fill="#6C63FF"/>
<path opacity="0.1" d="M248.791 22.334C248.791 22.334 232.911 20.5657 234.223 31.8333C234.223 31.8333 233.749 33.7859 235.48 34.7665C235.48 34.7665 235.551 33.9284 237.156 34.3055C237.723 34.4276 238.302 34.4852 238.882 34.4773C239.665 34.4632 240.423 34.194 241.04 33.7105V33.7105C241.04 33.7105 245.611 32.0889 247.744 24.8607C247.744 24.8607 249.11 23.3313 249.08 22.9165L246.336 23.9305C246.336 23.9305 247.174 25.9125 246.336 27.488C246.336 27.488 246.424 24.0059 245.917 24.0604C245.812 24.0604 244.488 24.6638 244.488 24.6638C244.488 24.6638 245.896 28.1207 244.58 30.5301C244.58 30.5301 245.242 26.3902 243.981 24.8984L242.033 25.9041C242.033 25.9041 243.709 29.4867 242.305 32.2691C242.305 32.2691 242.85 27.9196 241.622 26.1555L239.841 27.4126C239.841 27.4126 241.4 30.9366 240.223 33.2454C240.223 33.2454 240.344 28.1584 239.452 27.7268C239.452 27.7268 237.885 28.9839 237.629 29.5035C237.629 29.5035 238.689 32.0596 237.889 33.3376C237.889 33.3376 237.608 29.9309 237.239 29.8974C237.239 29.8974 235.63 32.0638 235.396 33.5932C235.541 32.1752 236.055 30.8201 236.887 29.6627C236.018 29.7829 235.202 30.1543 234.541 30.7313C234.541 30.7313 234.851 29.1599 237.281 29.1432C237.281 29.1432 238.601 27.5048 238.957 27.4168C238.957 27.4168 236.556 27.0941 235.061 27.6682C235.061 27.6682 236.422 26.2351 239.414 27.069L241.178 25.7742C241.178 25.7742 237.989 25.1289 236.64 25.5479C236.64 25.5479 238.258 24.2909 241.635 25.4432L243.533 24.4333C243.533 24.4333 240.855 23.7126 239.234 23.8425C239.234 23.8425 240.981 23.0044 244.086 24.1651L245.435 23.6414C245.435 23.6414 243.47 23.1511 242.892 23.0589C242.313 22.9667 242.293 22.8075 242.293 22.8075C243.559 22.6622 244.841 22.871 245.997 23.4109C245.997 23.4109 248.821 22.51 248.791 22.334Z" fill="#6C63FF"/>
<path opacity="0.1" d="M387.733 145.598C387.733 145.598 371.861 143.83 373.172 155.085C373.172 155.085 372.699 157.038 374.429 158.018C374.429 158.018 374.5 157.18 376.105 157.553C376.672 157.679 377.251 157.737 377.832 157.725C378.615 157.713 379.374 157.444 379.989 156.958V156.958C379.989 156.958 384.561 155.337 386.673 148.113C386.673 148.113 388.038 146.579 388.009 146.168L385.265 147.178C385.265 147.178 386.103 149.164 385.265 150.74C385.265 150.74 385.353 147.254 384.846 147.312C384.741 147.312 383.417 147.911 383.417 147.911C383.417 147.911 384.825 151.368 383.509 153.778C383.509 153.778 384.171 149.642 382.91 148.146L380.961 149.156C380.961 149.156 382.637 152.739 381.238 155.521C381.238 155.521 381.779 151.171 380.551 149.403L378.77 150.66C378.77 150.66 380.329 154.184 379.151 156.489C379.151 156.489 379.273 151.402 378.38 150.975C378.38 150.975 376.818 152.232 376.558 152.751C376.558 152.751 377.622 155.307 376.818 156.585C376.818 156.585 376.537 153.179 376.168 153.145C376.168 153.145 374.559 155.311 374.324 156.841C374.47 155.423 374.984 154.068 375.816 152.91C374.946 153.028 374.13 153.4 373.47 153.979C373.47 153.979 373.78 152.403 376.21 152.387C376.21 152.387 377.534 150.748 377.886 150.664C377.886 150.664 375.485 150.338 373.989 150.912C373.989 150.912 375.351 149.483 378.347 150.317L380.107 149.022C380.107 149.022 376.956 148.427 375.586 148.837C375.586 148.837 377.203 147.58 380.58 148.729L382.478 147.723C382.478 147.723 379.801 147.002 378.179 147.132C378.179 147.132 379.927 146.294 383.031 147.455L384.381 146.927C384.381 146.927 382.415 146.436 381.837 146.348C381.259 146.26 381.238 146.097 381.238 146.097C382.504 145.949 383.787 146.157 384.942 146.696C384.942 146.696 387.774 145.779 387.733 145.598Z" fill="#6C63FF"/>
<path opacity="0.1" d="M411.997 160.424C411.997 160.424 396.125 158.659 397.437 169.91C397.437 169.91 396.967 171.863 398.694 172.843C398.694 172.843 398.765 172.005 400.37 172.382C400.935 172.506 401.513 172.562 402.092 172.55C402.872 172.534 403.626 172.267 404.241 171.787V171.787C404.241 171.787 408.808 170.166 410.92 162.938C410.92 162.938 412.29 161.408 412.257 160.993L409.512 162.003C409.512 162.003 410.35 163.989 409.512 165.565C409.512 165.565 409.6 162.083 409.093 162.137C408.988 162.137 407.664 162.737 407.664 162.737C407.664 162.737 409.072 166.193 407.757 168.603C407.757 168.603 408.419 164.467 407.157 162.975L405.209 163.981C405.209 163.981 406.885 167.564 405.486 170.346C405.486 170.346 406.026 165.997 404.798 164.232L403.018 165.49C403.018 165.49 404.576 169.014 403.403 171.322C403.403 171.322 403.521 166.231 402.628 165.804C402.628 165.804 401.065 167.061 400.805 167.58C400.805 167.58 401.87 170.137 401.065 171.415C401.065 171.415 400.784 168.008 400.416 167.974C400.416 167.974 398.807 170.141 398.576 171.67C398.721 170.253 399.234 168.898 400.064 167.74C399.194 167.86 398.379 168.231 397.717 168.808C397.717 168.808 398.032 167.233 400.462 167.22C400.462 167.22 401.782 165.582 402.138 165.494C402.138 165.494 399.737 165.171 398.241 165.745C398.241 165.745 399.603 164.312 402.599 165.146L404.359 163.851C404.359 163.851 401.208 163.256 399.838 163.667C399.838 163.667 401.455 162.41 404.832 163.562L406.73 162.552C406.73 162.552 404.053 161.831 402.431 161.961C402.431 161.961 404.178 161.123 407.283 162.284L408.632 161.76C408.632 161.76 406.667 161.27 406.093 161.178C405.519 161.086 405.49 160.926 405.49 160.926C406.757 160.781 408.039 160.99 409.194 161.53C409.194 161.53 412.039 160.604 411.997 160.424Z" fill="#6C63FF"/>
<path opacity="0.1" d="M358.126 35.55C358.126 35.55 345.338 25.9837 340.767 36.3462C340.767 36.3462 339.371 37.7918 340.373 39.5224C340.373 39.5224 340.85 38.8478 342.049 39.9666C342.473 40.3615 342.943 40.7047 343.448 40.989C344.133 41.3698 344.923 41.5169 345.698 41.408V41.408C345.698 41.408 350.458 42.3257 355.943 37.1675C355.943 37.1675 357.895 36.5389 358.08 36.1702L355.201 35.6506C355.201 35.6506 354.899 37.7751 353.412 38.7262C353.412 38.7262 355.251 35.7679 354.774 35.5542C354.677 35.5081 353.24 35.3447 353.24 35.3447C353.24 35.3447 352.7 39.0405 350.353 40.4359C350.353 40.4359 353.022 37.2052 352.691 35.2777L350.5 35.1603C350.5 35.1603 350.127 39.095 347.512 40.7878C347.512 40.7878 350.186 37.3141 350.026 35.1687L347.856 35.3447C347.856 35.3447 347.437 39.1704 345.233 40.5616C345.233 40.5616 347.915 36.2372 347.362 35.4159C347.362 35.4159 345.38 35.6967 344.89 36.0235C344.89 36.0235 344.512 38.764 343.172 39.4595C343.172 39.4595 344.655 36.3797 344.353 36.166C344.353 36.166 341.869 37.2178 340.892 38.4162C341.737 37.2687 342.866 36.3616 344.169 35.7847C343.358 35.4478 342.467 35.3546 341.605 35.5165C341.605 35.5165 342.673 34.3181 344.776 35.5375C344.776 35.5375 346.742 34.7958 347.077 34.888C347.077 34.888 345.17 33.3921 343.591 33.1323C343.591 33.1323 345.493 32.5875 347.651 34.8084L349.825 34.5863C349.825 34.5863 347.412 32.4912 346.021 32.1392C346.021 32.1392 348.045 31.8836 350.378 34.5737L352.528 34.6701C352.528 34.6701 350.584 32.6923 349.121 31.9799C349.121 31.9799 351.049 32.1476 353.14 34.7162L354.568 34.9466C354.568 34.9466 353.123 33.5303 352.67 33.1616C352.218 32.7929 352.285 32.6713 352.285 32.6713C353.449 33.1884 354.447 34.0181 355.168 35.0682C355.168 35.0682 358.071 35.7218 358.126 35.55Z" fill="#6C63FF"/>
<path opacity="0.1" d="M368.006 104.614C368.006 104.614 363.598 89.2648 353.684 94.775C353.684 94.775 351.698 95.0808 351.451 97.067C351.451 97.067 352.239 96.8198 352.511 98.4247C352.612 99.0012 352.781 99.5638 353.014 100.101C353.325 100.823 353.863 101.423 354.548 101.81V101.81C354.548 101.81 357.791 105.414 365.274 104.609C365.274 104.609 367.21 105.288 367.579 105.104L365.597 102.95C365.597 102.95 364.076 104.467 362.316 104.325C362.316 104.325 365.567 103.067 365.316 102.619C365.266 102.527 364.218 101.525 364.218 101.525C364.218 101.525 361.562 104.149 358.846 103.843C358.846 103.843 362.923 102.879 363.82 101.144L362.144 99.7278C362.144 99.7278 359.471 102.636 356.366 102.41C356.366 102.41 360.59 101.249 361.754 99.4429L359.919 98.2738C359.919 98.2738 357.258 101.06 354.677 100.851C354.677 100.851 359.425 99.0197 359.483 98.035C359.483 98.035 357.732 97.0628 357.141 97.0293C357.141 97.0293 355.184 98.982 353.697 98.7305C353.697 98.7305 356.739 97.1676 356.63 96.8156C356.63 96.8156 354.015 96.1577 352.511 96.5223C353.874 96.1183 355.318 96.0764 356.701 96.4008C356.258 95.6426 355.603 95.0308 354.816 94.6409C354.816 94.6409 356.391 94.3266 357.33 96.5684C357.33 96.5684 359.345 97.1634 359.555 97.44C359.555 97.44 358.939 95.0976 357.837 93.9369C357.837 93.9369 359.68 94.6493 360.053 97.7333L361.922 98.8688C361.922 98.8688 361.268 95.7261 360.363 94.6199C360.363 94.6199 362.131 95.6382 362.37 99.1915L364.046 100.562C364.046 100.562 363.69 97.8129 362.953 96.3714C362.953 96.3714 364.39 97.6704 364.507 100.981L365.504 102.028C365.504 102.028 365.211 100.025 365.085 99.4555C364.96 98.8856 365.085 98.806 365.085 98.806C365.705 99.9205 366.003 101.186 365.944 102.46C365.944 102.46 367.855 104.714 368.006 104.614Z" fill="#6C63FF"/>
<path opacity="0.1" d="M269.783 139.2C269.783 139.2 261.223 125.716 253.275 133.786C253.275 133.786 251.456 134.624 251.775 136.615C251.775 136.615 252.466 136.154 253.178 137.62C253.434 138.14 253.752 138.627 254.125 139.07C254.625 139.675 255.309 140.099 256.074 140.277V140.277C256.074 140.277 260.201 142.824 267.156 139.942C267.156 139.942 269.205 140.051 269.507 139.77L266.993 138.261C266.993 138.261 265.958 140.147 264.227 140.503C264.227 140.503 267.001 138.408 266.628 138.022C266.557 137.947 265.266 137.285 265.266 137.285C265.266 137.285 263.452 140.545 260.762 141.018C260.762 141.018 264.403 138.944 264.78 137.025L262.773 136.141C262.773 136.141 261.026 139.682 257.984 140.331C257.984 140.331 261.713 138.031 262.321 135.969L260.226 135.366C260.226 135.366 258.458 138.789 255.923 139.313C255.923 139.313 259.962 136.221 259.74 135.257C259.74 135.257 257.787 134.817 257.226 134.951C257.226 134.951 255.898 137.377 254.398 137.553C254.398 137.553 256.878 135.198 256.673 134.888C256.673 134.888 253.979 134.993 252.638 135.768C253.834 134.993 255.212 134.545 256.635 134.469C255.998 133.866 255.198 133.463 254.335 133.308C254.335 133.308 255.755 132.567 257.268 134.452C257.268 134.452 259.363 134.452 259.652 134.662C259.652 134.662 258.395 132.567 257.016 131.783C257.016 131.783 258.986 131.951 260.209 134.804L262.325 135.366C262.325 135.366 260.812 132.537 259.635 131.729C259.635 131.729 261.617 132.206 262.845 135.554L264.822 136.392C264.822 136.392 263.708 133.857 262.589 132.672C262.589 132.672 264.332 133.51 265.375 136.656L266.632 137.381C266.632 137.381 265.794 135.542 265.497 135.035C265.199 134.528 265.317 134.41 265.317 134.41C266.223 135.306 266.863 136.436 267.165 137.675C267.165 137.675 269.67 139.342 269.783 139.2Z" fill="#6C63FF"/>
<path d="M326.043 70.3039C326.043 70.3039 317.902 56.5641 309.702 64.3831C309.702 64.3831 307.858 65.1793 308.118 67.1655C308.118 67.1655 308.818 66.7213 309.488 68.2088C309.728 68.7376 310.03 69.2356 310.389 69.6922C310.87 70.3101 311.542 70.752 312.299 70.9492V70.9492C312.299 70.9492 316.343 73.6226 323.386 70.9492C323.386 70.9492 325.431 71.121 325.741 70.8487L323.282 69.2648C323.282 69.2648 322.192 71.1127 320.449 71.4186C320.449 71.4186 323.286 69.3947 322.93 69.0133C322.854 68.9337 321.589 68.2298 321.589 68.2298C321.589 68.2298 319.674 71.4353 316.98 71.825C316.98 71.825 320.684 69.864 321.115 67.9616L319.138 67.0314C319.138 67.0314 317.281 70.5218 314.219 71.0791C314.219 71.0791 318.019 68.896 318.689 66.8554L316.619 66.1849C316.619 66.1849 314.742 69.5371 312.195 69.9981C312.195 69.9981 316.326 67.0314 316.133 66.0634C316.133 66.0634 314.198 65.5606 313.619 65.6779C313.619 65.6779 312.216 68.0622 310.711 68.1921C310.711 68.1921 313.263 65.9209 313.07 65.6025C313.07 65.6025 310.372 65.6234 309.01 66.3567C310.23 65.6209 311.621 65.2165 313.045 65.1835C312.426 64.5606 311.638 64.1324 310.779 63.9515C310.779 63.9515 312.224 63.2518 313.712 65.1835C313.712 65.1835 315.807 65.2547 316.087 65.4684C316.087 65.4684 314.901 63.3733 313.544 62.5101C313.544 62.5101 315.505 62.7364 316.64 65.6276L318.735 66.2562C318.735 66.2562 317.315 63.3817 316.159 62.5352C316.159 62.5352 318.128 63.0758 319.251 66.4573L321.199 67.3666C321.199 67.3666 320.164 64.798 319.104 63.5954C319.104 63.5954 320.818 64.4879 321.769 67.6641L322.997 68.4267C322.997 68.4267 322.209 66.5621 321.932 66.0467C321.656 65.5313 321.773 65.4181 321.773 65.4181C322.651 66.3413 323.256 67.4902 323.52 68.7368C323.52 68.7368 325.921 70.4422 326.043 70.3039Z" fill="#6C63FF"/>
<path d="M274.535 99.1957C274.535 99.1957 274.954 83.2308 263.863 85.481C263.863 85.481 261.877 85.1751 261.039 86.9937C261.039 86.9937 261.877 86.9937 261.642 88.6069C261.565 89.1822 261.557 89.7645 261.617 90.3417C261.693 91.1246 262.024 91.8609 262.56 92.4368C262.56 92.4368 264.558 96.8533 271.937 98.3534C271.937 98.3534 273.575 99.5896 273.986 99.5225L272.729 96.8743C272.729 96.8743 270.822 97.8548 269.184 97.1885C269.184 97.1885 272.662 96.9832 272.565 96.472C272.565 96.3673 271.845 95.0934 271.845 95.0934C271.845 95.0934 268.518 96.7905 266.025 95.6759C266.025 95.6759 270.215 95.9901 271.585 94.6115L270.416 92.7553C270.416 92.7553 266.989 94.7163 264.097 93.5598C264.097 93.5598 268.476 93.7358 270.135 92.3656L268.74 90.6895C268.74 90.6895 265.359 92.5416 262.962 91.561C262.962 91.561 268.04 91.2552 268.409 90.3291C268.409 90.3291 267.035 88.8751 266.482 88.653C266.482 88.653 264.026 89.9101 262.685 89.2313C262.685 89.2313 266.037 88.6698 266.058 88.2968C266.058 88.2968 263.766 86.8763 262.22 86.7716C263.646 86.7971 265.04 87.1958 266.264 87.9281C266.073 87.0716 265.636 86.2895 265.007 85.6779C265.007 85.6779 266.603 85.8581 266.821 88.2759C266.821 88.2759 268.568 89.4575 268.681 89.7844C268.681 89.7844 268.803 87.3666 268.103 85.9252C268.103 85.9252 269.645 87.1613 269.067 90.2118L270.504 91.8627C270.504 91.8627 270.831 88.6698 270.307 87.3415C270.307 87.3415 271.681 88.8458 270.835 92.3069L271.996 94.1129C271.996 94.1129 272.49 91.3851 272.226 89.7802C272.226 89.7802 273.198 91.4563 272.31 94.6451L272.947 95.944C272.947 95.944 273.269 93.9453 273.311 93.3628C273.353 92.7804 273.512 92.7427 273.512 92.7427C273.765 93.9927 273.665 95.2882 273.223 96.4846C273.223 96.4846 274.35 99.2501 274.535 99.1957Z" fill="#6C63FF"/>
<path opacity="0.1" d="M292.87 302.054C299.102 302.054 304.154 301.2 304.154 300.147C304.154 299.094 299.102 298.241 292.87 298.241C286.638 298.241 281.587 299.094 281.587 300.147C281.587 301.2 286.638 302.054 292.87 302.054Z" fill="#6C63FF"/>
<path opacity="0.1" d="M251.737 331C257.969 331 263.021 330.146 263.021 329.093C263.021 328.04 257.969 327.187 251.737 327.187C245.505 327.187 240.453 328.04 240.453 329.093C240.453 330.146 245.505 331 251.737 331Z" fill="#6C63FF"/>
<path opacity="0.1" d="M39.0259 316.171C45.2578 316.171 50.3097 315.317 50.3097 314.264C50.3097 313.211 45.2578 312.358 39.0259 312.358C32.7941 312.358 27.7422 313.211 27.7422 314.264C27.7422 315.317 32.7941 316.171 39.0259 316.171Z" fill="#6C63FF"/>
<path opacity="0.1" d="M337.322 329.093C343.554 329.093 348.606 328.24 348.606 327.187C348.606 326.134 343.554 325.28 337.322 325.28C331.091 325.28 326.039 326.134 326.039 327.187C326.039 328.24 331.091 329.093 337.322 329.093Z" fill="#6C63FF"/>
<path d="M349.071 305.846C358.376 305.846 365.919 304.57 365.919 302.997C365.919 301.423 358.376 300.147 349.071 300.147C339.766 300.147 332.223 301.423 332.223 302.997C332.223 304.57 339.766 305.846 349.071 305.846Z" fill="#6C63FF"/>
<path d="M356.056 298.333C356.825 297.708 357.385 296.863 357.661 295.911C357.87 294.947 357.46 293.795 356.542 293.443C355.511 293.049 354.409 293.761 353.571 294.482C352.733 295.203 351.782 296.028 350.689 295.877C351.25 295.367 351.67 294.721 351.908 294.001C352.146 293.28 352.193 292.511 352.046 291.767C351.999 291.458 351.868 291.169 351.669 290.929C351.095 290.317 350.06 290.581 349.373 291.063C347.194 292.596 346.586 295.555 346.574 298.22C346.356 297.26 346.54 296.259 346.536 295.287C346.532 294.314 346.26 293.191 345.426 292.68C344.914 292.395 344.336 292.25 343.75 292.261C342.769 292.228 341.676 292.324 341.01 293.041C340.172 293.929 340.394 295.425 341.114 296.393C341.835 297.361 342.937 297.985 343.951 298.664C344.762 299.149 345.455 299.809 345.979 300.596C346.039 300.705 346.088 300.82 346.126 300.939H352.268C353.643 300.247 354.918 299.37 356.056 298.333V298.333Z" fill="#6C63FF"/>
<path d="M31.4503 305.402C31.4503 305.402 37.882 305.205 39.8304 303.822C41.7788 302.439 49.7314 300.792 50.2133 303.009C50.6951 305.226 59.8839 314.025 52.6184 314.084C45.3529 314.143 35.7367 312.953 33.8009 311.771C31.8651 310.589 31.4503 305.402 31.4503 305.402Z" fill="#A8A8A8"/>
<path opacity="0.2" d="M52.7399 313.313C45.4744 313.372 35.8582 312.182 33.9225 311C32.4476 310.103 31.861 306.881 31.664 305.393H31.4503C31.4503 305.393 31.8693 310.585 33.7926 311.763C35.7158 312.94 45.3445 314.134 52.61 314.076C54.705 314.076 55.4299 313.313 55.3922 312.207C55.0989 312.881 54.2986 313.3 52.7399 313.313Z" fill="black"/>
</g>
<defs>
<linearGradient id="paint0_linear" x1="93.4334" y1="181.614" x2="224.217" y2="181.614" gradientUnits="userSpaceOnUse">
<stop stop-color="#808080" stop-opacity="0.25"/>
<stop offset="0.54" stop-color="#808080" stop-opacity="0.12"/>
<stop offset="1" stop-color="#808080" stop-opacity="0.1"/>
</linearGradient>
<clipPath id="clip0">
<rect width="423" height="331" fill="white"/>
</clipPath>
</defs>
</svg>
