"s";"%";"MPa"
0;0;5,64992
0,02;-0,00019754;5,6489
0,04;0,000251477;5,65446
0,06;0,000809743;5,65641
0,08;0,000822454;5,65759
0,1;0,00229731;5,66444
0,12;0,00230796;5,65756
0,14;0,0019754;5,66069
0,16;0,00113989;5,66454
0,18;0,000217122;5,66763
0,2;-0,000316751;5,67091
0,22;-0,000268998;5,672
0,24;-3,46984e-005;5,66504
0,26;0,000489556;5,65843
0,28;0,00145733;5,66034
0,3;0,00238182;5,64795
0,32;0,0022255;5,65058
0,34;0,00205991;5,65437
0,36;0,00126597;5,6619
0,38;0,000857153;5,66172
0,4;0,000318813;5,67255
0,42;0,000335303;5,68848
0,44;0,000407448;5,69528
0,46;0,000887385;5,69559
0,48;0,00103923;5,70667
0,5;0,00169335;5,71902
0,52;0,00199017;5,72442
0,54;0,00206782;5,74679
0,56;0,00184966;5,78572
0,58;0,00121547;5,83907
0,6;0,000391988;5,91757
0,62;0,000416037;6,01252
0,64;0,000481654;6,12582
0,66;0,000839632;6,26124
0,68;0,00208156;6,41136
0,7;0,00298749;6,57614
0,72;0,00295039;6,76209
0,74;0,0029528;6,96545
0,76;0,00286622;7,18437
0,78;0,00267177;7,41147
0,8;0,00241686;7,65502
0,82;0,002399;7,9173
0,84;0,00237873;8,19244
0,86;0,00275354;8,48307
0,88;0,00370276;8,79034
0,9;0,00485434;9,11724
0,92;0,00482101;9,45433
0,94;0,00512436;9,81695
0,96;0,00501752;10,1919
0,98;0,00496771;10,5873
1;0,0049306;10,9853
1,02;0,00496633;11,4037
1,04;0,00498557;11,8275
1,06;0,00536588;12,2596
1,08;0,00675244;12,7125
1,1;0,00758211;13,1742
1,12;0,00828741;13,6352
1,14;0,00889721;14,1122
1,16;0,00887316;14,6069
1,18;0,0087914;15,0931
1,2;0,00875773;15,5802
1,22;0,00875292;16,082
1,24;0,00876666;16,5753
1,26;0,00930225;17,0762
1,28;0,0107132;17,5688
1,3;0,0119486;18,0891
1,32;0,0121554;18,6099
1,34;0,013196;19,1201
1,36;0,0129126;19,6345
1,38;0,0128552;20,1756
1,4;0,0128782;20,7082
1,42;0,01287;21,2417
1,44;0,0129418;21,7901
1,46;0,0141865;22,3224
1,48;0,01453;22,8507
1,5;0,0158125;23,3796
1,52;0,0165432;23,9221
1,54;0,0172197;24,4687
1,56;0,0172595;25,0171
1,58;0,0172963;25,5651
1,6;0,0172623;26,1089
1,62;0,0172241;26,6398
1,64;0,0172619;27,1669
1,66;0,0183946;27,6966
1,68;0,0188395;28,2241
1,7;0,0207479;28,757
1,72;0,0209221;29,287
1,74;0,0217724;29,8149
1,76;0,0217384;30,3488
1,78;0,0218074;30,8878
1,8;0,0217267;31,4085
1,82;0,0217267;31,9291
1,84;0,0217648;32,4565
1,86;0,0229023;32,9811
1,88;0,02305;33,4919
1,9;0,0251481;34,0183
1,92;0,0253697;34,5514
1,94;0,0261306;35,0788
1,96;0,0260767;35,6004
1,98;0,0265886;36,1307
2;0,0264704;36,6481
2,02;0,0264178;37,1707
2,04;0,0264319;37,6869
2,06;0,0267171;38,199
2,08;0,0272447;38,6967
2,1;0,0289264;39,214
2,12;0,0292892;39,7151
2,14;0,0301299;40,2083
2,16;0,0302024;40,7078
2,18;0,0306833;41,2066
2,2;0,0305514;41,6949
2,22;0,0305394;42,1841
2,24;0,0305366;42,6847
2,26;0,0311602;43,184
2,28;0,0313903;43,6937
2,3;0,0333018;44,1981
2,32;0,0335245;44,703
2,34;0,0345046;45,2113
2,36;0,0344675;45,7121
2,38;0,0346235;46,2172
2,4;0,0345654;46,7125
2,42;0,0345702;47,2152
2,44;0,0345932;47,7099
2,46;0,0348509;48,2153
2,48;0,0354147;48,7017
2,5;0,0369373;49,2051
2,52;0,0373062;49,6976
2,54;0,0381211;50,1971
2,56;0,038575;50,6829
2,58;0,0388711;51,1832
2,6;0,0387382;51,6757
2,62;0,0387897;52,1679
2,64;0,0387869;52,6507
2,66;0,0388443;53,1398
2,68;0,0395362;53,6266
2,7;0,0410341;54,1185
2,72;0,0411636;54,6169
2,74;0,0422406;55,111
2,76;0,0424031;55,613
2,78;0,0428913;56,1098
2,8;0,0428205;56,596
2,82;0,0428192;57,0746
2,84;0,0428243;57,5659
2,86;0,0429318;58,0514
2,88;0,043295;58,5271
2,9;0,0445029;59,0073
2,92;0,0452824;59,4828
2,94;0,045942;59,9602
2,96;0,0461684;60,4342
2,98;0,0468583;60,9216
3;0,0467576;61,3986
3,02;0,0467816;61,8738
3,04;0,0467301;62,3518
3,06;0,0468988;62,8236
3,08;0,0471578;63,2868
3,1;0,0483108;63,7659
3,12;0,0486976;64,2577
3,14;0,0498196;64,739
3,16;0,049909;65,2155
3,18;0,0505844;65,696
3,2;0,050549;66,1685
3,22;0,0505404;66,6314
3,24;0,0504975;67,1084
3,26;0,0505693;67,5817
3,28;0,0506789;68,0535
3,3;0,0520056;68,5318
3,32;0,0524883;69,0079
3,34;0,0535788;69,4734
3,36;0,0539474;69,9431
3,38;0,0542315;70,4141
3,4;0,0541662;70,8855
3,42;0,0542397;71,3694
3,44;0,054216;71,8319
3,46;0,0544328;72,3048
3,48;0,0544651;72,775
3,5;0,0557074;73,2315
3,52;0,0559534;73,6853
3,54;0,0569435;74,1452
3,56;0,0574389;74,6142
3,58;0,0580792;75,0829
3,6;0,0580256;75,5546
3,62;0,0580803;76,0218
3,64;0,0580617;76,4985
3,66;0,0580906;76,9568
3,68;0,058126;77,4188
3,7;0,0595527;77,8745
3,72;0,0598695;78,3163
3,74;0,0606699;78,7591
3,76;0,0613347;79,2243
3,78;0,0616401;79,6857
3,8;0,0618383;80,1555
3,82;0,0618792;80,6311
3,84;0,0618339;81,1097
3,86;0,0618909;81,5745
3,88;0,061917;82,0441
3,9;0,0629202;82,5044
3,92;0,0636918;82,9699
3,94;0,0644562;83,4367
3,96;0,0649873;83,9016
3,98;0,065538;84,3703
4;0,0654676;84,8544
4,02;0,0658877;85,3418
4,04;0,0658211;85,8201
4,06;0,0657915;86,2878
4,08;0,0659482;86,7511
4,1;0,0665989;87,2008
4,12;0,0668875;87,6548
4,14;0,0681555;88,1082
4,16;0,0683225;88,5727
4,18;0,0692054;89,0389
4,2;0,06936;89,5054
4,22;0,0693682;89,9685
4,24;0,0693284;90,4374
4,26;0,0694737;90,9044
4,28;0,0695991;91,372
4,3;0,0699447;91,8377
4,32;0,0709606;92,3013
4,34;0,0718535;92,7707
4,36;0,0720603;93,2368
4,38;0,0730768;93,6959
4,4;0,0730428;94,157
4,42;0,0730672;94,6227
4,44;0,0733046;95,0826
4,46;0,0733046;95,5409
4,48;0,0732527;96,002
4,5;0,0745331;96,4734
4,52;0,0744692;96,939
4,54;0,0754459;97,4026
4,56;0,0762145;97,867
4,58;0,0762643;98,3338
4,6;0,076503;98,8068
4,62;0,0767683;99,272
4,64;0,0767562;99,73
4,66;0,0768772;100,206
4,68;0,0769222;100,663
4,7;0,0777611;101,114
4,72;0,0781194;101,564
4,74;0,078843;102,017
4,76;0,0795218;102,449
4,78;0,0800794;102,923
4,8;0,0801079;103,383
4,82;0,0805775;103,839
4,84;0,0805796;104,29
4,86;0,0805717;104,763
4,88;0,0806029;105,198
4,9;0,0808744;105,64
4,92;0,0815735;106,085
4,94;0,0823475;106,537
4,96;0,0830164;106,969
4,98;0,0835173;107,414
5;0,0835588;107,853
5,02;0,0841601;108,298
5,04;0,084114;108,747
5,06;0,0841274;109,193
5,08;0,0841229;109,635
5,1;0,0845173;110,086
5,12;0,0845331;110,523
5,14;0,0856902;110,966
5,16;0,0862667;111,403
5,18;0,0864419;111,849
5,2;0,0876017;112,292
5,22;0,087577;112,747
5,24;0,0876605;113,178
5,26;0,088195;113,624
5,28;0,0880607;114,059
5,3;0,0882321;114,474
5,32;0,0883304;114,899
5,34;0,0886904;115,339
5,36;0,0897599;115,771
5,38;0,090258;116,185
5,4;0,0903508;116,624
5,42;0,090884;117,049
5,44;0,0908263;117,472
5,46;0,0909194;117,909
5,48;0,0909128;118,342
5,5;0,0911131;118,766
5,52;0,0918346;119,191
5,54;0,0921025;119,597
5,56;0,0931765;120,006
5,58;0,0936564;120,42
5,6;0,0940192;120,839
5,62;0,0945373;121,267
5,64;0,0945156;121,715
5,66;0,0945445;122,146
5,68;0,0945431;122,591
5,7;0,0946393;123,027
5,72;0,0950924;123,457
5,74;0,0953656;123,878
5,76;0,0964522;124,296
5,78;0,09713;124,723
5,8;0,0971778;125,153
5,82;0,0980171;125,581
5,84;0,0979972;126,008
5,86;0,0979954;126,436
5,88;0,098038;126,85
5,9;0,0982287;127,266
5,92;0,0982187;127,677
5,94;0,0994504;128,092
5,96;0,0994899;128,513
5,98;0,100186;128,935
6;0,100602;129,347
6,02;0,100942;129,766
6,04;0,100916;130,187
6,06;0,101433;130,605
6,08;0,101391;131,025
6,1;0,101395;131,454
6,12;0,101533;131,872
6,14;0,102259;132,287
6,16;0,102456;132,695
6,18;0,103655;133,109
6,2;0,103855;133,516
6,22;0,103993;133,928
6,24;0,104328;134,344
6,26;0,104512;134,765
6,28;0,104505;135,175
6,3;0,104626;135,586
6,32;0,104962;136,002
6,34;0,105202;136,401
6,36;0,106127;136,803
6,38;0,106505;137,207
6,4;0,107084;137,61
6,42;0,107505;138,02
6,44;0,107589;138,445
6,46;0,107761;138,859
6,48;0,107788;139,275
6,5;0,107888;139,691
6,52;0,107953;140,097
6,54;0,108712;140,494
6,56;0,108919;140,903
6,58;0,109929;141,305
6,6;0,110336;141,717
6,62;0,110605;142,126
6,64;0,110677;142,538
6,66;0,11096;142,942
6,68;0,111052;143,355
6,7;0,111184;143,756
6,72;0,111332;144,154
6,74;0,112239;144,559
6,76;0,112201;144,976
6,78;0,113002;145,389
6,8;0,113401;145,793
6,82;0,113785;146,205
6,84;0,113944;146,619
6,86;0,114475;147,021
6,88;0,11448;147,424
6,9;0,114584;147,845
6,92;0,114574;148,267
6,94;0,115007;148,669
6,96;0,115186;149,073
6,98;0,116146;149,483
7;0,116442;149,881
7,02;0,117343;150,278
7,04;0,117373;150,692
7,06;0,11764;151,098
7,08;0,117612;151,511
7,1;0,117708;151,928
7,12;0,117683;152,334
7,14;0,118551;152,738
7,16;0,118552;153,152
7,18;0,119142;153,557
7,2;0,119844;153,956
7,22;0,120147;154,365
7,24;0,120359;154,776
7,26;0,121161;155,172
7,28;0,121019;155,573
7,3;0,121062;155,986
7,32;0,12152;156,38
7,34;0,121495;156,767
7,36;0,121531;157,18
7,38;0,12305;157,572
7,4;0,12299;157,957
7,42;0,123105;158,36
7,44;0,123604;158,757
7,46;0,123957;159,143
7,48;0,123968;159,54
7,5;0,124155;159,938
7,52;0,12419;160,333
7,54;0,124236;160,726
7,56;0,124867;161,114
7,58;0,125789;161,499
7,6;0,12581;161,886
7,62;0,12656;162,273
7,64;0,127102;162,651
7,66;0,12717;163,038
7,68;0,127101;163,428
7,7;0,128016;163,818
7,72;0,127925;164,192
7,74;0,127928;164,575
7,76;0,128432;164,966
7,78;0,128926;165,343
7,8;0,128973;165,72
7,82;0,129748;166,121
7,84;0,129952;166,512
7,86;0,130095;166,88
7,88;0,130233;167,26
7,9;0,13076;167,641
7,92;0,130733;168,008
7,94;0,1308;168,38
7,96;0,131358;168,76
7,98;0,13179;169,129
8;0,131894;169,508
8,02;0,13316;169,882
8,04;0,133163;170,256
8,06;0,133334;170,627
8,08;0,133352;171,015
8,1;0,133858;171,381
8,12;0,133833;171,747
8,14;0,133864;172,142
8,16;0,134049;172,523
8,18;0,134817;172,881
8,2;0,134954;173,249
8,22;0,135619;173,631
8,24;0,135757;173,978
8,26;0,136134;174,356
8,28;0,136507;174,733
8,3;0,136831;175,113
8,32;0,136754;175,486
8,34;0,137189;175,861
8,36;0,137243;176,228
8,38;0,13773;176,601
8,4;0,137886;176,964
8,42;0,139097;177,339
8,44;0,139082;177,726
8,46;0,139303;178,101
8,48;0,139527;178,467
8,5;0,139601;178,835
8,52;0,139598;179,195
8,54;0,140166;179,561
8,56;0,14021;179,93
8,58;0,14082;180,307
8,59;0,140849;180,496
8,61;0,141212;180,873
8,63;0,141967;181,235
8,65;0,142069;181,596
8,67;0,142533;181,956
8,69;0,142766;182,325
8,71;0,142859;182,683
8,73;0,142833;183,049
8,75;0,14338;183,41
8,77;0,143401;183,767
8,79;0,143556;184,105
8,81;0,144007;184,464
8,83;0,144761;184,809
8,85;0,144969;185,174
8,87;0,145349;185,539
8,89;0,14551;185,905
8,91;0,145956;186,264
8,93;0,145914;186,639
8,95;0,146243;186,983
8,97;0,146275;187,339
8,99;0,146766;187,7
9,01;0,14702;188,065
9,03;0,147916;188,422
9,05;0,147935;188,809
9,07;0,148545;189,168
9,09;0,148582;189,543
9,11;0,148622;189,926
9,13;0,148687;190,316
9,15;0,149219;190,703
9,17;0,149283;191,107
9,19;0,149821;191,528
9,21;0,150157;191,947
9,23;0,151077;192,386
9,25;0,151103;192,821
9,27;0,151883;193,273
9,29;0,151904;193,715
9,31;0,152497;194,176
9,33;0,15254;194,626
9,35;0,153251;195,109
9,37;0,153249;195,59
9,39;0,15364;196,083
9,41;0,15396;196,578
9,43;0,15462;197,073
9,45;0,154909;197,571
9,47;0,155794;198,082
9,49;0,15585;198,613
9,51;0,156516;199,134
9,53;0,156606;199,68
9,55;0,15717;200,215
9,57;0,157179;200,766
9,59;0,158155;201,315
9,61;0,158213;201,896
9,63;0,159295;202,468
9,65;0,159462;203,06
9,67;0,160346;203,656
9,69;0,160511;204,256
9,71;0,161225;204,862
9,73;0,161422;205,472
9,75;0,162145;206,083
9,77;0,162184;206,698
9,79;0,163176;207,321
9,81;0,16333;207,947
9,83;0,164215;208,575
9,85;0,164603;209,213
9,87;0,165442;209,863
9,89;0,165775;210,518
9,91;0,16665;211,17
9,93;0,166689;211,83
9,95;0,167497;212,493
9,97;0,167544;213,16
9,99;0,168406;213,828
10,01;0,168697;214,492
10,03;0,169652;215,186
10,05;0,170096;215,873
10,07;0,171088;216,546
10,09;0,171317;217,238
10,11;0,172158;217,944
10,13;0,172318;218,632
10,15;0,17325;219,336
10,17;0,173351;220,057
10,19;0,174178;220,761
10,21;0,174621;221,464
10,23;0,175453;222,176
10,25;0,175958;222,909
10,27;0,177054;223,634
10,29;0,177291;224,373
10,31;0,17806;225,123
10,33;0,178498;225,873
10,35;0,179229;226,613
10,37;0,179433;227,363
10,39;0,180417;228,118
10,41;0,180798;228,877
10,43;0,181929;229,643
10,45;0,182344;230,404
10,47;0,183415;231,176
10,49;0,183628;231,952
10,51;0,184836;232,734
10,53;0,184977;233,525
10,55;0,185832;234,335
10,57;0,185974;235,143
10,59;0,187194;235,948
10,61;0,187484;236,767
10,63;0,188312;237,588
10,65;0,189075;238,399
10,67;0,190318;239,223
10,69;0,190606;240,069
10,71;0,191714;240,906
10,73;0,192083;241,759
10,75;0,193045;242,626
10,77;0,193244;243,489
10,79;0,194437;244,355
10,81;0,194671;245,224
10,83;0,195821;246,092
10,85;0,196513;246,958
10,87;0,197744;247,846
10,89;0,198178;248,725
10,91;0,199165;249,634
10,93;0,199686;250,539
10,95;0,20056;251,466
10,97;0,201018;252,392
10,99;0,202183;253,333
11,01;0,20248;254,269
11,03;0,203576;255,208
11,05;0,204462;256,146
11,07;0,205507;257,079
11,09;0,206188;258,019
11,11;0,207445;258,951
11,13;0,207642;259,891
11,15;0,209025;260,821
11,17;0,209271;261,762
11,19;0,210243;262,705
11,21;0,210776;263,658
11,23;0,21183;264,619
11,25;0,212625;265,597
11,27;0,213784;266,57
11,29;0,21443;267,546
11,31;0,215675;268,519
11,33;0,216232;269,491
11,35;0,217303;270,464
11,37;0,217741;271,447
11,39;0,219078;272,427
11,41;0,219383;273,418
11,43;0,22065;274,401
11,45;0,221397;275,384
11,47;0,222514;276,363
11,49;0,223213;277,353
11,51;0,224365;278,332
11,53;0,224868;279,328
11,55;0,225989;280,33
11,57;0,226584;281,332
11,59;0,227504;282,32
11,61;0,228157;283,32
11,63;0,229392;284,318
11,65;0,230125;285,306
11,67;0,231424;286,289
11,69;0,232079;287,293
11,71;0,233429;288,291
11,73;0,233914;289,296
11,75;0,235037;290,303
11,77;0,235686;291,334
11,79;0,236962;292,365
11,81;0,237289;293,393
11,83;0,2386;294,412
11,85;0,239291;295,438
11,87;0,24039;296,448
11,89;0,241237;297,451
11,91;0,242436;298,459
11,93;0,242975;299,454
11,95;0,244233;300,438
11,97;0,244704;301,411
11,99;0,24587;302,369
12,01;0,246136;303,307
12,03;0,247547;304,263
12,05;0,248212;305,234
12,07;0,249224;306,201
12,09;0,250086;307,168
12,11;0,251399;308,144
12,13;0,251727;309,111
12,15;0,252846;310,059
12,17;0,253625;311,014
12,19;0,254544;311,966
12,21;0,255131;312,935
12,23;0,256297;313,904
12,25;0,257029;314,88
12,27;0,258182;315,864
12,29;0,258878;316,871
12,31;0,260103;317,859
12,33;0,260716;318,857
12,35;0,261897;319,864
12,37;0,262493;320,869
12,39;0,263659;321,884
12,41;0,264267;322,913
12,43;0,265507;323,935
12,45;0,266481;324,968
12,47;0,267526;325,995
12,49;0,268294;327,004
12,51;0,269821;328,021
12,53;0,270272;329,036
12,55;0,271514;330,034
12,57;0,272278;331,043
12,59;0,273378;332,062
12,61;0,273995;333,074
12,63;0,275107;334,105
12,65;0,275919;335,138
12,67;0,277193;336,171
12,69;0,278056;337,202
12,71;0,279393;338,241
12,73;0,279904;339,265
12,75;0,281413;340,296
12,77;0,281998;341,314
12,79;0,283;342,323
12,81;0,283874;343,326
12,83;0,285159;344,33
12,85;0,285963;345,325
12,87;0,287143;346,332
12,89;0,288104;347,358
12,91;0,289404;348,385
12,93;0,290096;349,412
12,95;0,291474;350,453
12,97;0,292192;351,505
12,99;0,293264;352,556
13,01;0,294259;353,612
13,03;0,295531;354,676
13,05;0,296255;355,742
13,07;0,297841;356,79
13,09;0,299007;357,824
13,11;0,300086;358,858
13,13;0,301239;359,889
13,15;0,302372;360,894
13,17;0,303229;361,91
13,19;0,304227;362,935
13,21;0,305182;363,958
13,23;0,30645;364,977
13,25;0,307256;366,011
13,27;0,308603;367,036
13,29;0,30976;368,058
13,31;0,31097;369,074
13,33;0,311974;370,093
13,35;0,313393;371,129
13,37;0,313927;372,162
13,39;0,315187;373,189
13,41;0,316259;374,227
13,43;0,317406;375,257
13,45;0,318316;376,277
13,47;0,319844;377,313
13,49;0,320877;378,36
13,51;0,322267;379,396
13,53;0,323134;380,451
13,55;0,324758;381,504
13,57;0,325296;382,55
13,59;0,32682;383,595
13,61;0,327878;384,653
13,63;0,329157;385,688
13,65;0,330017;386,734
13,67;0,331755;387,785
13,69;0,332708;388,848
13,71;0,33416;389,909
13,73;0,335254;390,979
13,75;0,336739;392,039
13,77;0,337588;393,101
13,79;0,339105;394,141
13,81;0,339937;395,169
13,83;0,341387;396,206
13,85;0,342297;397,244
13,87;0,343964;398,276
13,89;0,344997;399,327
13,91;0,346521;400,386
13,93;0,347745;401,434
13,95;0,349384;402,489
13,97;0,350216;403,562
13,99;0,351935;404,633
14,01;0,353088;405,712
14,03;0,354614;406,791
14,05;0,35576;407,872
14,07;0,357547;408,933
14,09;0,358505;409,982
14,11;0,360293;411,025
14,13;0,361547;412,069
14,15;0,363274;413,087
14,17;0,364184;414,117
14,19;0,365836;415,15
14,21;0,367169;416,182
14,23;0,368764;417,213
14,25;0,370082;418,265
14,27;0,371988;419,299
14,29;0,372999;420,333
14,31;0,374729;421,38
14,33;0,376056;422,437
14,35;0,377738;423,481
14,37;0,379087;424,539
14,39;0,380748;425,587
14,41;0,38208;426,627
14,43;0,383705;427,668
14,45;0,385122;428,725
14,47;0,387086;429,783
14,49;0,388404;430,859
14,51;0,390537;431,928
14,53;0,392036;432,991
14,55;0,393934;434,048
14,57;0,394992;435,098
14,59;0,397132;436,117
14,61;0,398261;437,155
14,63;0,400179;438,19
14,65;0,401634;439,229
14,67;0,403843;440,261
14,69;0,405226;441,304
14,71;0,407426;442,33
14,73;0,408867;443,347
14,75;0,411013;444,369
14,77;0,41212;445,403
14,79;0,414575;446,455
14,81;0,415851;447,502
14,83;0,417948;448,567
14,85;0,419704;449,617
14,87;0,421895;450,665
14,89;0,423571;451,703
14,91;0,425974;452,738
14,93;0,427835;453,742
14,95;0,429753;454,733
14,97;0,431586;455,701
14,99;0,434138;456,671
15,01;0,435615;457,646
15,03;0,43779;458,64
15,05;0,439827;459,64
15,07;0,441895;460,664
15,09;0,44371;461,677
15,11;0,446463;462,663
15,13;0,448144;463,646
15,15;0,450593;464,631
15,17;0,452614;465,587
15,19;0,455035;466,547
15,21;0,456981;467,533
15,23;0,459322;468,517
15,25;0,461446;469,503
15,27;0,463982;470,496
15,29;0,466181;471,48
15,31;0,468928;472,457
15,33;0,471287;473,426
15,35;0,473977;474,373
15,37;0,476165;475,326
15,39;0,479095;476,277
15,41;0,481198;477,217
15,43;0,483822;478,149
15,45;0,4865;479,077
15,47;0,489181;479,975
15,49;0,491708;480,874
15,51;0,494784;481,77
15,53;0,497225;482,669
15,55;0,500223;483,585
15,57;0,50284;484,525
15,59;0,506075;485,45
15,61;0,50867;486,377
15,63;0,511749;487,294
15,65;0,51477;488,184
15,67;0,51805;489,044
15,69;0,520885;489,905
15,71;0,524673;490,743
15,73;0,527384;491,591
15,75;0,530938;492,437
15,77;0,534006;493,289
15,79;0,537711;494,124
15,81;0,540806;494,967
15,83;0,544659;495,775
15,85;0,547866;496,567
15,87;0,551646;497,339
15,89;0,555005;498,11
15,91;0,559219;498,862
15,93;0,562334;499,616
15,95;0,566672;500,375
15,97;0,57012;501,142
15,99;0,574598;501,903
16,01;0,578202;502,653
16,03;0,58264;503,395
16,05;0,586472;504,129
16,07;0,590923;504,836
16,09;0,59481;505,516
16,11;0,599558;506,195
16,13;0,603439;506,857
16,15;0,608275;507,503
16,17;0,612604;508,135
16,19;0,617497;508,768
16,21;0,621649;509,401
16,23;0,626646;510,042
16,25;0,631182;510,674
16,27;0,636092;511,31
16,29;0,640927;511,951
16,31;0,64675;512,561
16,33;0,651293;513,15
16,35;0,65704;513,73
16,37;0,66235;514,287
16,39;0,667916;514,826
16,41;0,672815;515,366
16,43;0,678962;515,894
16,45;0,684026;516,413
16,47;0,689866;516,929
16,49;0,695364;517,443
16,51;0,70163;517,921
16,53;0,706841;518,398
16,55;0,713307;518,868
16,57;0,718994;519,323
16,59;0,725406;519,767
16,61;0,731343;520,242
16,63;0,738019;520,7
16,65;0,743882;521,161
16,67;0,75078;521,625
16,69;0,757067;522,062
16,71;0,763912;522,472
16,73;0,77022;522,875
16,75;0,777161;523,257
16,77;0,783491;523,63
16,79;0,790612;524,011
16,81;0,796993;524,385
16,83;0,804865;524,759
16,85;0,810816;525,123
16,87;0,81829;525,488
16,89;0,825147;525,847
16,91;0,832246;526,206
16,93;0,839243;526,557
16,95;0,847092;526,914
16,97;0,854329;527,252
16,99;0,86183;527,579
17,01;0,869369;527,917
17,03;0,876963;528,244
17,05;0,884125;528,568
17,07;0,891811;528,902
17,09;0,899187;529,232
17,11;0,906939;529,535
17,13;0,914224;529,833
17,15;0,922425;530,108
17,17;0,929571;530,381
17,19;0,93762;530,662
17,21;0,945309;530,96
17,23;0,953397;531,273
17,25;0,960964;531,599
17,27;0,969318;531,907
17,29;0,977213;532,198
17,31;0,98542;532,474
17,33;0,993458;532,729
17,35;1,00185;532,989
17,37;1,00973;533,257
17,39;1,01781;533,531
17,41;1,02601;533,795
17,43;1,03451;534,07
17,45;1,04208;534,334
17,47;1,05072;534,6
17,49;1,0589;534,862
17,51;1,06708;535,131
17,53;1,07557;535,393
17,55;1,0845;535,652
17,57;1,09294;535,906
17,59;1,10204;536,166
17,61;1,11063;536,433
17,63;1,11958;536,692
17,65;1,12786;536,952
17,67;1,13661;537,225
17,69;1,14507;537,459
17,71;1,15383;537,693
17,73;1,16236;537,935
17,75;1,17131;538,181
17,77;1,17986;538,411
17,79;1,18893;538,68
17,81;1,1977;538,943
17,83;1,20703;539,205
17,85;1,21542;539,446
17,87;1,2248;539,694
17,89;1,23356;539,925
17,91;1,24274;540,149
17,93;1,25137;540,38
17,95;1,26077;540,625
17,97;1,26923;540,858
17,99;1,27868;541,096
18,01;1,28727;541,342
18,03;1,2964;541,571
18,05;1,3049;541,796
18,07;1,31423;542,031
18,09;1,32288;542,272
18,11;1,3322;542,508
18,13;1,3414;542,755
18,15;1,35105;543,018
18,17;1,35992;543,266
18,19;1,36968;543,51
18,21;1,37891;543,759
18,23;1,38836;543,997
18,25;1,39729;544,22
18,27;1,40712;544,446
18,29;1,41581;544,68
18,31;1,42519;544,903
18,33;1,43453;545,143
18,35;1,44425;545,386
18,37;1,45314;545,633
18,39;1,46345;545,875
18,41;1,47268;546,109
18,43;1,48249;546,337
18,45;1,49167;546,569
18,47;1,50182;546,803
18,49;1,51059;547,048
18,51;1,52094;547,3
18,53;1,52983;547,541
18,55;1,53976;547,764
18,57;1,54841;547,989
18,59;1,55842;548,201
18,61;1,56762;548,431
18,63;1,57743;548,664
18,65;1,58672;548,919
18,67;1,59701;549,169
18,69;1,60624;549,402
18,71;1,61617;549,635
18,73;1,62556;549,869
18,75;1,63546;550,091
18,77;1,64482;550,305
18,79;1,65487;550,549
18,81;1,66422;550,786
18,83;1,67399;551,036
18,85;1,68351;551,292
18,87;1,69373;551,549
18,89;1,703;551,785
18,91;1,71321;552,013
18,93;1,72298;552,224
18,95;1,73329;552,435
18,97;1,74268;552,677
18,99;1,75275;552,924
19,01;1,76256;553,168
19,03;1,77261;553,406
19,05;1,78217;553,639
19,07;1,79235;553,852
19,09;1,80134;554,064
19,11;1,81137;554,297
19,13;1,82076;554,542
19,15;1,83085;554,794
19,17;1,8406;555,037
19,19;1,85078;555,27
19,21;1,86042;555,486
19,23;1,87035;555,697
19,25;1,87999;555,911
19,27;1,8899;556,13
19,29;1,89926;556,359
19,31;1,9092;556,608
19,33;1,91853;556,858
19,35;1,92832;557,096
19,37;1,9378;557,328
19,39;1,94776;557,559
19,41;1,95717;557,778
19,43;1,96741;557,991
19,45;1,97673;558,215
19,47;1,98662;558,446
19,49;1,99601;558,664
19,51;2,00575;558,874
19,53;2,01517;559,09
19,55;2,02499;559,289
19,57;2,03429;559,499
19,59;2,04363;559,728
19,61;2,0532;559,959
19,63;2,06308;560,203
19,65;2,07229;560,441
19,67;2,08219;560,658
19,69;2,09161;560,865
19,71;2,10121;561,071
19,73;2,11057;561,271
19,75;2,12033;561,488
19,77;2,12966;561,719
19,79;2,13945;561,951
19,81;2,14886;562,19
19,83;2,15838;562,414
19,85;2,16792;562,642
19,87;2,1777;562,863
19,89;2,18693;563,094
19,91;2,19693;563,318
19,93;2,20647;563,553
19,95;2,21601;563,776
19,97;2,22569;564,001
19,99;2,23559;564,223
20,01;2,24476;564,431
20,03;2,25458;564,633
20,05;2,26407;564,846
20,07;2,27363;565,053
20,09;2,28259;565,265
20,11;2,29237;565,503
20,13;2,30125;565,749
20,15;2,31098;565,965
20,17;2,32037;566,184
20,19;2,32987;566,375
20,21;2,33919;566,569
20,23;2,34871;566,757
20,25;2,35786;566,973
20,27;2,36763;567,178
20,29;2,3767;567,401
20,31;2,38638;567,611
20,33;2,39533;567,813
20,35;2,40499;568,033
20,37;2,41438;568,263
20,39;2,42416;568,486
20,41;2,43351;568,716
20,43;2,44328;568,947
20,45;2,45256;569,156
20,47;2,46214;569,36
20,49;2,4714;569,557
20,51;2,48113;569,738
20,53;2,49018;569,925
20,55;2,49997;570,118
20,57;2,50916;570,328
20,59;2,5186;570,56
20,61;2,52762;570,791
20,63;2,53754;571,031
20,65;2,54656;571,252
20,67;2,55632;571,455
20,69;2,56552;571,649
20,71;2,57513;571,864
20,73;2,58391;572,065
20,75;2,59345;572,277
20,77;2,60274;572,484
20,79;2,61213;572,682
20,81;2,62104;572,855
20,83;2,63085;573,049
20,85;2,63961;573,242
20,87;2,64934;573,454
20,89;2,65845;573,68
20,91;2,66833;573,925
20,93;2,67726;574,141
20,95;2,68728;574,347
20,97;2,69613;574,54
20,99;2,70548;574,721
21,01;2,71461;574,892
21,03;2,72438;575,073
21,05;2,733;575,271
21,07;2,74267;575,486
21,09;2,75163;575,709
21,11;2,76117;575,926
21,13;2,77012;576,139
21,15;2,7797;576,355
21,17;2,78902;576,541
21,19;2,79849;576,731
21,21;2,80756;576,93
21,23;2,81724;577,136
21,25;2,82635;577,334
21,27;2,83562;577,536
21,29;2,84498;577,725
21,31;2,8544;577,906
21,33;2,86305;578,091
21,35;2,87296;578,28
21,37;2,88192;578,498
21,39;2,89147;578,72
21,41;2,90037;578,939
21,43;2,91034;579,157
21,45;2,91902;579,357
21,47;2,92853;579,54
21,49;2,9375;579,728
21,51;2,94706;579,913
21,53;2,95603;580,093
21,55;2,96562;580,29
21,57;2,97426;580,479
21,59;2,98361;580,664
21,61;2,9926;580,851
21,63;3,00229;581,04
21,65;3,01114;581,218
21,67;3,02088;581,406
21,69;3,03006;581,598
21,71;3,03918;581,8
21,73;3,04795;582,001
21,75;3,0573;582,186
21,77;3,0659;582,363
21,79;3,07509;582,545
21,81;3,08397;582,728
21,83;3,09323;582,916
21,85;3,10221;583,124
21,87;3,11148;583,341
21,89;3,12037;583,543
21,91;3,12998;583,748
21,93;3,13901;583,935
21,95;3,14841;584,123
21,97;3,15749;584,305
21,99;3,16659;584,495
22,01;3,1758;584,673
22,03;3,18523;584,869
22,05;3,19411;585,061
22,07;3,20335;585,24
22,09;3,21234;585,416
22,11;3,22177;585,61
22,13;3,23051;585,791
22,15;3,2401;585,984
22,17;3,24911;586,191
22,19;3,25835;586,396
22,21;3,26742;586,578
22,23;3,27674;586,769
22,25;3,28553;586,943
22,27;3,29502;587,107
22,29;3,30415;587,284
22,31;3,31322;587,472
22,33;3,32183;587,668
22,35;3,33133;587,87
22,37;3,34015;588,073
22,39;3,34945;588,273
22,41;3,35876;588,456
22,43;3,36819;588,626
22,45;3,3771;588,799
22,47;3,38687;588,994
22,49;3,39566;589,183
22,51;3,40503;589,386
22,53;3,41401;589,571
22,55;3,42333;589,751
22,57;3,43202;589,927
22,59;3,44111;590,11
22,61;3,45016;590,294
22,63;3,45958;590,502
22,65;3,46864;590,712
22,67;3,4783;590,898
22,69;3,48731;591,076
22,71;3,49673;591,257
22,73;3,50535;591,413
22,75;3,51519;591,576
22,77;3,52359;591,747
22,79;3,53293;591,926
22,81;3,54168;592,11
22,83;3,55064;592,312
22,85;3,55949;592,503
22,87;3,56893;592,692
22,89;3,5778;592,874
22,91;3,58729;593,035
22,93;3,59628;593,197
22,95;3,60564;593,367
22,97;3,61429;593,543
22,99;3,6238;593,731
23,01;3,63263;593,913
23,03;3,64211;594,094
23,05;3,65088;594,274
23,07;3,6602;594,451
23,09;3,66904;594,614
23,11;3,67853;594,814
23,13;3,68741;595,016
23,15;3,69675;595,2
23,17;3,70576;595,377
23,19;3,71503;595,556
23,21;3,72388;595,707
23,23;3,73291;595,856
23,25;3,74188;596,021
23,27;3,75122;596,188
23,29;3,75988;596,368
23,31;3,76929;596,559
23,33;3,77785;596,74
23,35;3,78727;596,921
23,37;3,79585;597,103
23,39;3,80512;597,268
23,41;3,81401;597,435
23,43;3,82311;597,607
23,45;3,83194;597,772
23,47;3,84117;597,947
23,49;3,84969;598,116
23,51;3,85924;598,27
23,53;3,86786;598,428
23,55;3,87707;598,587
23,57;3,88565;598,749
23,59;3,89454;598,924
23,61;3,90368;599,114
23,63;3,91277;599,311
23,65;3,92179;599,504
23,67;3,93144;599,672
23,69;3,94028;599,825
23,71;3,94936;599,982
23,73;3,95837;600,137
23,75;3,96754;600,293
23,77;3,97621;600,468
23,79;3,98542;600,656
23,81;3,99394;600,811
23,83;4,00299;600,977
23,85;4,01165;601,151
23,87;4,02058;601,317
23,89;4,02969;601,477
23,91;4,03889;601,663
23,93;4,04779;601,828
23,95;4,05699;601,996
23,97;4,06603;602,163
23,99;4,07485;602,329
24,01;4,08404;602,479
24,03;4,09306;602,634
24,05;4,10164;602,799
24,07;4,11084;602,975
24,09;4,11955;603,159
24,11;4,12873;603,358
24,13;4,13766;603,553
24,15;4,14709;603,724
24,17;4,15554;603,875
24,19;4,16495;604,019
24,21;4,17359;604,175
24,23;4,18253;604,327
24,25;4,19115;604,492
24,27;4,20078;604,657
24,29;4,2092;604,818
24,31;4,21843;604,96
24,33;4,22713;605,112
24,35;4,23617;605,257
24,37;4,24478;605,426
24,39;4,25388;605,594
24,41;4,26268;605,769
24,43;4,27152;605,943
24,45;4,28024;606,1
24,47;4,28936;606,242
24,49;4,29791;606,394
24,51;4,30697;606,528
24,53;4,31574;606,657
24,55;4,32497;606,83
24,57;4,33301;606,999
24,59;4,34217;607,171
24,61;4,35111;607,364
24,63;4,3597;607,558
24,65;4,36905;607,71
24,67;4,37868;607,866
24,69;4,38712;608,014
24,71;4,39665;608,16
24,73;4,40543;608,309
24,75;4,41423;608,46
24,77;4,42312;608,609
24,79;4,43245;608,765
24,81;4,44064;608,91
24,83;4,44955;609,058
24,85;4,45838;609,216
24,87;4,46749;609,391
24,89;4,47634;609,567
24,91;4,48557;609,739
24,93;4,49456;609,902
24,95;4,50356;610,058
24,97;4,51218;610,197
24,99;4,52149;610,323
25,01;4,53005;610,461
25,03;4,53894;610,605
25,05;4,54772;610,757
25,07;4,55657;610,92
25,09;4,56538;611,096
25,11;4,57488;611,262
25,13;4,5836;611,427
25,15;4,59274;611,587
25,17;4,60192;611,74
25,19;4,61112;611,876
25,21;4,61982;612,039
25,23;4,62908;612,195
25,25;4,63785;612,354
25,27;4,64716;612,499
25,29;4,65577;612,648
25,31;4,66508;612,772
25,33;4,67353;612,918
25,35;4,68274;613,081
25,37;4,69177;613,254
25,39;4,70114;613,427
25,41;4,71004;613,599
25,43;4,71928;613,74
25,45;4,72833;613,868
25,47;4,73731;614,003
25,49;4,74614;614,144
25,51;4,7555;614,288
25,53;4,76427;614,454
25,55;4,77333;614,605
25,57;4,7821;614,758
25,59;4,79124;614,905
25,61;4,79987;615,054
25,63;4,80915;615,195
25,65;4,81836;615,353
25,67;4,8274;615,511
25,69;4,83648;615,674
25,71;4,8456;615,832
25,73;4,85446;615,981
25,75;4,86338;616,112
25,77;4,87251;616,23
25,79;4,88141;616,359
25,81;4,89009;616,495
25,83;4,89925;616,645
25,85;4,90809;616,822
25,87;4,91718;617,005
25,89;4,92614;617,164
25,91;4,93541;617,319
25,93;4,94437;617,462
25,95;4,95342;617,59
25,97;4,96231;617,717
25,99;4,97138;617,854
26,01;4,98016;617,984
26,03;4,9891;618,125
26,05;4,99772;618,27
26,07;5,00671;618,405
26,09;5,01552;618,538
26,11;5,02461;618,685
26,13;5,03365;618,833
26,15;5,04275;618,993
26,17;5,05171;619,16
26,19;5,06098;619,319
26,21;5,06963;619,475
26,23;5,0787;619,629
26,25;5,08783;619,755
26,27;5,09665;619,876
26,29;5,10571;620,008
26,31;5,11475;620,137
26,33;5,12348;620,27
26,35;5,13236;620,419
26,37;5,1416;620,568
26,39;5,1506;620,706
26,41;5,15949;620,846
26,43;5,16881;620,972
26,45;5,17756;621,096
26,47;5,18671;621,233
26,49;5,19561;621,387
26,51;5,20477;621,533
26,53;5,21355;621,682
26,55;5,22233;621,811
26,57;5,23117;621,951
26,59;5,23999;622,082
26,61;5,24881;622,228
26,63;5,25812;622,376
26,65;5,26709;622,532
26,67;5,27626;622,653
26,69;5,28545;622,775
26,71;5,29454;622,886
26,73;5,30359;622,992
26,75;5,31239;623,105
26,77;5,32182;623,232
26,79;5,33067;623,366
26,81;5,33955;623,515
26,83;5,34858;623,669
26,85;5,35756;623,81
26,87;5,36657;623,959
26,89;5,37575;624,094
26,91;5,38518;624,208
26,93;5,39413;624,327
26,95;5,40351;624,475
26,97;5,41243;624,617
26,99;5,42178;624,762
27,01;5,43075;624,898
27,03;5,44025;625,024
27,05;5,44893;625,13
27,07;5,45818;625,248
27,09;5,46722;625,378
27,11;5,47637;625,53
27,13;5,48539;625,692
27,15;5,49496;625,85
27,17;5,50398;626,002
27,19;5,51341;626,136
27,21;5,52256;626,27
27,23;5,53168;626,391
27,25;5,54095;626,516
27,27;5,55017;626,646
27,29;5,55944;626,789
27,31;5,56853;626,925
27,33;5,57769;627,066
27,35;5,58678;627,212
27,37;5,59602;627,344
27,39;5,60528;627,464
27,41;5,61453;627,589
27,43;5,62385;627,725
27,45;5,63287;627,841
27,47;5,64211;627,964
27,49;5,6511;628,095
27,51;5,66036;628,206
27,53;5,66908;628,312
27,55;5,67817;628,441
27,57;5,68688;628,567
27,59;5,696;628,7
27,61;5,70472;628,859
27,63;5,71398;629,011
27,65;5,72279;629,152
27,67;5,73217;629,281
27,69;5,74116;629,398
27,71;5,75034;629,513
27,73;5,75922;629,634
27,75;5,76848;629,755
27,77;5,77738;629,886
27,79;5,78642;630,032
27,81;5,79521;630,153
27,83;5,8044;630,284
27,85;5,81343;630,409
27,87;5,82247;630,541
27,89;5,83185;630,67
27,91;5,84108;630,807
27,93;5,85014;630,933
27,95;5,85933;631,063
27,97;5,86854;631,184
27,99;5,87768;631,286
28,01;5,88694;631,39
28,03;5,89595;631,508
28,05;5,90486;631,623
28,07;5,914;631,765
28,09;5,92306;631,93
28,11;5,93212;632,09
28,13;5,94126;632,23
28,15;5,95069;632,356
28,17;5,95984;632,459
28,19;5,96905;632,543
28,21;5,97803;632,658
28,23;5,98744;632,777
28,25;5,99629;632,912
28,27;6,00575;633,047
28,29;6,01476;633,191
28,31;6,0239;633,315
28,33;6,03299;633,443
28,35;6,0423;633,579
28,37;6,0513;633,715
28,39;6,06062;633,851
28,41;6,06988;633,991
28,43;6,07909;634,126
28,45;6,08812;634,243
28,47;6,09755;634,347
28,49;6,10654;634,446
28,51;6,11589;634,54
28,53;6,12493;634,63
28,55;6,13411;634,753
28,57;6,14315;634,887
28,59;6,15244;635,022
28,61;6,1612;635,158
28,63;6,17066;635,3
28,65;6,17959;635,408
28,67;6,189;635,522
28,69;6,19796;635,64
28,71;6,20698;635,76
28,73;6,21599;635,878
28,75;6,22535;636,006
28,77;6,23442;636,122
28,79;6,24342;636,225
28,81;6,25249;636,336
28,83;6,26159;636,446
28,85;6,27068;636,578
28,87;6,28;636,719
28,89;6,28943;636,873
28,91;6,29862;637,01
28,93;6,30774;637,134
28,95;6,31708;637,236
28,97;6,32612;637,334
28,99;6,33541;637,43
29,01;6,34455;637,53
29,03;6,35375;637,645
29,05;6,36275;637,762
29,07;6,37195;637,883
29,09;6,38107;638,008
29,11;6,39032;638,127
29,13;6,39932;638,241
29,15;6,40878;638,354
29,17;6,41793;638,474
29,19;6,42724;638,588
29,21;6,43614;638,713
29,23;6,44569;638,831
29,25;6,45418;638,938
29,27;6,46371;639,04
29,29;6,47243;639,139
29,31;6,48173;639,233
29,33;6,49044;639,353
29,35;6,49989;639,494
29,37;6,50905;639,622
29,39;6,51817;639,759
29,41;6,52752;639,899
29,43;6,53691;640,011
29,45;6,54587;640,123
29,47;6,55505;640,243
29,49;6,56422;640,348
29,51;6,57345;640,443
29,53;6,58223;640,559
29,55;6,59147;640,662
29,57;6,6004;640,763
29,59;6,60967;640,887
29,61;6,61866;641,018
29,63;6,62824;641,134
29,65;6,63719;641,251
29,67;6,64681;641,379
29,69;6,65585;641,496
29,71;6,66519;641,611
29,73;6,67421;641,721
29,75;6,68376;641,834
29,77;6,69285;641,928
29,79;6,702;642,029
29,81;6,71099;642,139
29,83;6,72038;642,264
29,85;6,72955;642,387
29,87;6,73867;642,521
29,89;6,74827;642,635
29,91;6,7575;642,734
29,93;6,7666;642,836
29,95;6,77601;642,95
29,97;6,78497;643,052
29,99;6,79458;643,163
30,01;6,80365;643,281
30,03;6,81304;643,387
30,05;6,82185;643,481
30,07;6,83133;643,586
30,09;6,84049;643,693
30,11;6,84963;643,807
30,13;6,85893;643,933
30,15;6,86849;644,059
30,17;6,87787;644,183
30,19;6,88707;644,298
30,21;6,89632;644,4
30,23;6,90544;644,5
30,25;6,91447;644,584
30,27;6,92371;644,673
30,29;6,93279;644,78
30,31;6,9418;644,889
30,33;6,95096;645,006
30,35;6,96022;645,14
30,37;6,96946;645,27
30,39;6,97886;645,383
30,41;6,98832;645,491
30,43;6,99757;645,587
30,45;7,00686;645,692
30,47;7,01646;645,8
30,49;7,02547;645,921
30,51;7,03491;646,026
30,53;7,04393;646,131
30,55;7,05327;646,229
30,57;7,06227;646,324
30,59;7,07171;646,43
30,61;7,08094;646,554
30,63;7,09052;646,668
30,65;7,09991;646,78
30,67;7,10925;646,879
30,69;7,11849;646,963
30,71;7,12762;647,049
30,73;7,13672;647,146
30,75;7,14605;647,238
30,77;7,15525;647,353
30,79;7,16441;647,468
30,81;7,17344;647,577
30,83;7,18284;647,702
30,85;7,19179;647,817
30,87;7,20118;647,918
30,89;7,21031;648,015
30,91;7,22003;648,114
30,93;7,22897;648,201
30,95;7,23843;648,323
30,97;7,24753;648,435
30,99;7,25711;648,543
31,01;7,26607;648,655
31,03;7,2759;648,761
31,05;7,2847;648,843
31,07;7,29401;648,952
31,09;7,30334;649,073
31,11;7,31277;649,19
31,13;7,32178;649,312
31,15;7,33148;649,423
31,17;7,34058;649,512
31,19;7,34974;649,602
31,21;7,3589;649,694
31,23;7,36839;649,773
31,25;7,37738;649,864
31,27;7,38687;649,978
31,29;7,39584;650,081
31,31;7,40522;650,184
31,33;7,41409;650,284
31,35;7,42352;650,39
31,37;7,43252;650,493
31,39;7,44213;650,59
31,41;7,45124;650,688
31,43;7,46085;650,802
31,45;7,46988;650,912
31,47;7,47921;651,004
31,49;7,48853;651,092
31,51;7,4978;651,173
31,53;7,50654;651,244
31,55;7,516;651,332
31,57;7,52487;651,435
31,59;7,53401;651,556
31,61;7,5434;651,698
31,63;7,55293;651,828
31,65;7,56239;651,925
31,67;7,57196;652,011
31,69;7,5809;652,09
31,71;7,59044;652,158
31,73;7,59953;652,244
31,75;7,60884;652,355
31,77;7,61799;652,457
31,79;7,62748;652,555
31,81;7,63637;652,654
31,83;7,64568;652,751
31,85;7,655;652,847
31,87;7,6643;652,956
31,89;7,67364;653,064
31,91;7,68311;653,171
31,93;7,69223;653,274
31,95;7,70164;653,368
31,97;7,71084;653,455
31,99;7,72026;653,534
32,01;7,72916;653,616
32,03;7,73884;653,706
32,05;7,74779;653,803
32,07;7,75756;653,923
32,09;7,76638;654,055
32,11;7,77613;654,18
32,13;7,78542;654,276
32,15;7,79519;654,364
32,17;7,80418;654,425
32,19;7,8141;654,493
32,21;7,8229;654,577
32,23;7,83256;654,674
32,25;7,84188;654,773
32,27;7,85139;654,878
32,29;7,86039;654,972
32,31;7,87029;655,048
32,33;7,87925;655,137
32,35;7,88822;655,235
32,37;7,89761;655,338
32,39;7,90726;655,456
32,41;7,916;655,564
32,43;7,92565;655,67
32,45;7,93479;655,762
32,47;7,94392;655,838
32,49;7,95315;655,901
32,51;7,96286;655,984
32,53;7,97166;656,073
32,55;7,98103;656,17
32,57;7,99004;656,286
32,59;7,99949;656,405
32,61;8,00853;656,52
32,63;8,01844;656,628
32,65;8,02763;656,726
32,67;8,03715;656,814
32,69;8,04611;656,908
32,71;8,05577;656,999
32,73;8,06483;657,082
32,75;8,07405;657,163
32,77;8,08339;657,245
32,79;8,09284;657,32
32,81;8,10159;657,396
32,83;8,11125;657,487
32,85;8,12039;657,585
32,87;8,12972;657,708
32,89;8,13876;657,816
32,91;8,14827;657,914
32,93;8,1571;658
32,95;8,16645;658,08
32,97;8,1752;658,132
32,99;8,18487;658,209
33,01;8,19356;658,299
33,03;8,20294;658,394
33,05;8,21214;658,498
33,07;8,22129;658,611
33,09;8,23021;658,712
33,11;8,24022;658,819
33,13;8,24923;658,906
33,15;8,25895;658,993
33,17;8,26802;659,079
33,19;8,27746;659,168
33,21;8,28653;659,242
33,23;8,29632;659,329
33,25;8,30529;659,404
33,27;8,31448;659,482
33,29;8,32377;659,56
33,31;8,33288;659,652
33,33;8,34191;659,754
33,35;8,35181;659,871
33,37;8,3605;659,975
33,39;8,37027;660,084
33,41;8,37954;660,164
33,43;8,38917;660,234
33,45;8,39815;660,299
33,47;8,40791;660,381
33,49;8,41678;660,448
33,51;8,42634;660,54
33,53;8,43522;660,639
33,55;8,44481;660,737
33,57;8,45359;660,827
33,59;8,46327;660,93
33,61;8,47214;661,02
33,63;8,48201;661,108
33,65;8,49121;661,195
33,67;8,50078;661,295
33,69;8,51004;661,387
33,71;8,51989;661,484
33,73;8,52893;661,556
33,75;8,53878;661,635
33,77;8,54787;661,7
33,79;8,55757;661,775
33,81;8,56666;661,851
33,83;8,57617;661,964
33,85;8,58542;662,066
33,87;8,59546;662,167
33,89;8,60436;662,255
33,91;8,6145;662,326
33,93;8,62366;662,398
33,95;8,63281;662,484
33,97;8,64218;662,565
33,99;8,65202;662,648
34,01;8,66083;662,751
34,03;8,67046;662,823
34,05;8,67942;662,889
34,07;8,68888;662,967
34,09;8,69814;663,04
34,11;8,70807;663,114
34,13;8,71732;663,21
34,15;8,72711;663,314
34,17;8,73676;663,402
34,19;8,74612;663,505
34,21;8,75531;663,588
34,23;8,76547;663,666
34,25;8,77438;663,723
34,27;8,78403;663,803
34,29;8,79341;663,875
34,31;8,80281;663,963
34,33;8,81194;664,051
34,35;8,82214;664,146
34,37;8,83086;664,221
34,39;8,84095;664,29
34,41;8,85018;664,351
34,43;8,85964;664,427
34,45;8,86914;664,5
34,47;8,87916;664,583
34,49;8,88773;664,674
34,51;8,89787;664,754
34,53;8,90676;664,814
34,55;8,91605;664,893
34,57;8,92557;664,963
34,59;8,93502;665,046
34,61;8,94402;665,149
34,63;8,95435;665,249
34,65;8,96363;665,329
34,67;8,97295;665,417
34,69;8,98245;665,479
34,71;8,99228;665,536
34,73;9,00117;665,607
34,75;9,01125;665,686
34,77;9,02042;665,757
34,79;9,02991;665,853
34,81;9,0391;665,937
34,83;9,04883;666,029
34,85;9,05764;666,116
34,87;9,06728;666,198
34,89;9,07684;666,262
34,91;9,08643;666,338
34,93;9,09556;666,416
34,95;9,10581;666,503
34,97;9,11476;666,586
34,99;9,12433;666,671
35,01;9,13402;666,746
35,03;9,1432;666,802
35,05;9,15205;666,863
35,07;9,16218;666,948
35,09;9,17096;667,04
35,11;9,18049;667,14
35,13;9,19009;667,239
35,15;9,20007;667,328
35,17;9,20912;667,397
35,19;9,21909;667,458
35,21;9,22864;667,526
35,23;9,23799;667,598
35,25;9,24719;667,674
35,27;9,25722;667,78
35,29;9,26625;667,883
35,31;9,27562;667,978
35,33;9,28512;668,068
35,35;9,29507;668,162
35,37;9,30438;668,227
35,39;9,31455;668,296
35,41;9,32399;668,382
35,43;9,33393;668,472
35,45;9,34313;668,548
35,47;9,35325;668,619
35,49;9,36264;668,68
35,51;9,37247;668,728
35,53;9,38168;668,776
35,55;9,39144;668,84
35,57;9,40066;668,921
35,59;9,41064;669,022
35,61;9,41981;669,126
35,63;9,42949;669,219
35,65;9,43904;669,288
35,67;9,4487;669,347
35,69;9,4577;669,407
35,71;9,46762;669,453
35,73;9,47692;669,519
35,75;9,48658;669,602
35,77;9,49564;669,679
35,79;9,50573;669,751
35,81;9,51478;669,844
35,83;9,52452;669,923
35,85;9,53393;670
35,87;9,54404;670,092
35,89;9,55318;670,175
35,91;9,56312;670,252
35,93;9,57257;670,326
35,95;9,58228;670,396
35,97;9,59154;670,455
35,99;9,60132;670,513
36,01;9,61047;670,559
36,03;9,62005;670,625
36,05;9,62895;670,698
36,07;9,63891;670,79
36,09;9,6479;670,881
36,11;9,65761;670,974
36,13;9,66711;671,032
36,15;9,6767;671,09
36,17;9,68588;671,133
36,19;9,69585;671,183
36,21;9,70475;671,254
36,23;9,71452;671,332
36,25;9,72389;671,41
36,27;9,73353;671,486
36,29;9,74246;671,569
36,31;9,75242;671,635
36,33;9,76153;671,726
36,35;9,7712;671,824
36,37;9,7808;671,912
36,39;9,79054;672,002
36,41;9,79994;672,084
36,43;9,8097;672,144
36,45;9,81909;672,187
36,47;9,82879;672,234
36,49;9,83823;672,265
36,51;9,84814;672,317
36,53;9,85733;672,389
36,55;9,86711;672,474
36,57;9,87677;672,567
36,59;9,8863;672,673
36,61;9,89581;672,764
36,63;9,9058;672,836
36,65;9,91495;672,906
36,67;9,92473;672,978
36,69;9,93381;673,049
36,71;9,94358;673,117
36,73;9,95272;673,179
36,75;9,96263;673,245
36,77;9,97193;673,298
36,79;9,98171;673,35
36,81;9,99102;673,418
36,83;10,0013;673,504
36,85;10,0106;673,588
36,87;10,0204;673,696
36,89;10,0302;673,783
36,91;10,0399;673,853
36,93;10,0492;673,912
36,95;10,059;673,972
36,97;10,0685;674,004
36,99;10,0783;674,058
37,01;10,0877;674,122
37,03;10,0974;674,19
37,05;10,1064;674,25
37,07;10,1165;674,334
37,09;10,1262;674,399
37,11;10,1357;674,471
37,13;10,1453;674,533
37,15;10,1555;674,596
37,17;10,1648;674,658
37,19;10,1745;674,735
37,21;10,184;674,792
37,23;10,1934;674,851
37,25;10,2029;674,912
37,27;10,2126;674,961
37,29;10,2219;675,015
37,31;10,2316;675,103
37,33;10,2412;675,192
37,35;10,251;675,297
37,37;10,2605;675,385
37,39;10,2707;675,467
37,41;10,2801;675,52
37,43;10,2899;675,582
37,45;10,2995;675,623
37,47;10,3089;675,686
37,49;10,3185;675,744
37,51;10,3287;675,814
37,53;10,3376;675,877
37,55;10,3475;675,952
37,57;10,3572;676,019
37,59;10,3668;676,095
37,61;10,3762;676,16
37,63;10,3866;676,231
37,65;10,3962;676,299
37,67;10,4058;676,376
37,69;10,4153;676,44
37,71;10,4251;676,501
37,73;10,4345;676,548
37,75;10,4445;676,596
37,77;10,4536;676,632
37,79;10,4636;676,697
37,81;10,4728;676,767
37,83;10,4827;676,849
37,85;10,4923;676,94
37,87;10,5023;677,025
37,89;10,5118;677,083
37,91;10,5219;677,145
37,93;10,5314;677,204
37,95;10,5414;677,259
37,97;10,551;677,325
37,99;10,5609;677,397
38,01;10,5706;677,458
38,03;10,5804;677,518
38,05;10,59;677,563
38,07;10,6001;677,63
38,09;10,6096;677,694
38,11;10,6198;677,768
38,13;10,6296;677,849
38,15;10,6396;677,935
38,17;10,6491;677,99
38,19;10,6591;678,051
38,21;10,6688;678,106
38,23;10,6787;678,142
38,25;10,6881;678,176
38,27;10,6982;678,241
38,29;10,7075;678,301
38,31;10,7174;678,382
38,33;10,7271;678,458
38,35;10,7372;678,54
38,37;10,7469;678,594
38,39;10,7572;678,646
38,41;10,7667;678,683
38,43;10,7768;678,749
38,45;10,7862;678,817
38,47;10,7963;678,895
38,49;10,8058;678,96
38,51;10,8154;679,018
38,53;10,8252;679,059
38,55;10,8348;679,112
38,57;10,8445;679,168
38,59;10,8544;679,24
38,61;10,8642;679,315
38,63;10,8743;679,395
38,65;10,8838;679,441
38,67;10,8937;679,489
38,69;10,9033;679,526
38,71;10,913;679,566
38,73;10,9225;679,612
38,75;10,9321;679,677
38,77;10,9418;679,741
38,79;10,9514;679,821
38,81;10,9611;679,909
38,83;10,9707;679,973
38,85;10,9804;680,041
38,87;10,9907;680,094
38,89;11,0003;680,134
38,91;11,0103;680,171
38,93;11,0203;680,24
38,95;11,0298;680,302
38,97;11,0397;680,365
38,99;11,0498;680,427
39,01;11,0595;680,477
39,03;11,0691;680,531
39,05;11,079;680,584
39,07;11,0885;680,652
39,09;11,0984;680,726
39,11;11,1084;680,807
39,13;11,1183;680,858
39,15;11,128;680,913
39,17;11,1382;680,958
39,19;11,1476;680,997
39,21;11,1575;681,039
39,23;11,1674;681,1
39,25;11,1773;681,164
39,27;11,1869;681,239
39,29;11,1969;681,313
39,31;11,2067;681,376
39,33;11,2167;681,441
39,35;11,2265;681,5
39,37;11,2366;681,544
39,39;11,2465;681,615
39,41;11,2562;681,691
39,43;11,2663;681,75
39,45;11,276;681,819
39,47;11,2859;681,882
39,49;11,2955;681,919
39,51;11,3057;681,957
39,53;11,3151;682,008
39,55;11,3249;682,057
39,57;11,3353;682,128
39,59;11,3455;682,224
39,61;11,3551;682,298
39,63;11,3662;682,369
39,65;11,3757;682,412
39,67;11,3859;682,447
39,69;11,3959;682,463
39,71;11,406;682,511
39,73;11,4154;682,542
39,75;11,4256;682,603
39,77;11,4356;682,658
39,79;11,4449;682,71
39,81;11,4546;682,754
39,83;11,4652;682,813
39,85;11,4745;682,862
39,87;11,4844;682,924
39,89;11,495;682,976
39,91;11,5043;683,027
39,93;11,5138;683,081
39,95;11,5242;683,133
39,97;11,5336;683,163
39,99;11,5436;683,209
40,01;11,5536;683,258
40,03;11,5631;683,31
40,05;11,5726;683,384
40,07;11,5827;683,478
40,09;11,5923;683,56
40,11;11,602;683,637
40,13;11,612;683,694
40,15;11,6223;683,718
40,17;11,6318;683,743
40,19;11,642;683,795
40,21;11,6522;683,827
40,23;11,6621;683,878
40,25;11,6717;683,95
40,27;11,6819;684,001
40,29;11,6919;684,033
40,31;11,7014;684,086
40,33;11,711;684,148
40,35;11,7214;684,203
40,37;11,7307;684,271
40,39;11,7407;684,331
40,41;11,751;684,386
40,43;11,7609;684,409
40,45;11,7705;684,438
40,47;11,781;684,46
40,49;11,7904;684,499
40,51;11,801;684,55
40,53;11,81;684,62
40,55;11,8202;684,693
40,57;11,8306;684,768
40,59;11,8396;684,847
40,61;11,8503;684,916
40,63;11,8611;684,968
40,65;11,87;685,016
40,67;11,8809;685,076
40,69;11,8907;685,12
40,71;11,9004;685,172
40,73;11,9106;685,214
40,75;11,9208;685,25
40,77;11,9305;685,289
40,79;11,9406;685,331
40,81;11,9505;685,365
40,83;11,9609;685,44
40,85;11,9706;685,52
40,87;11,9806;685,589
40,89;11,991;685,649
40,91;12,0007;685,7
40,93;12,0106;685,73
40,95;12,021;685,752
40,97;12,0308;685,769
40,99;12,0409;685,799
41,01;12,0514;685,847
41,03;12,0608;685,896
41,05;12,071;685,95
41,07;12,0809;686,021
41,09;12,0911;686,083
41,11;12,1012;686,134
41,13;12,1113;686,187
41,15;12,1218;686,24
41,17;12,1318;686,284
41,19;12,1419;686,332
41,21;12,152;686,383
41,23;12,1626;686,417
41,25;12,1723;686,443
41,27;12,1824;686,473
41,29;12,1924;686,502
41,31;12,2026;686,552
41,33;12,2124;686,616
41,35;12,2229;686,684
41,37;12,233;686,745
41,39;12,243;686,797
41,41;12,2534;686,824
41,43;12,2633;686,862
41,45;12,273;686,91
41,47;12,2836;686,946
41,49;12,2931;686,99
41,51;12,303;687,046
41,53;12,3129;687,085
41,55;12,3229;687,128
41,57;12,3327;687,187
41,59;12,3431;687,247
41,61;12,3532;687,298
41,63;12,3636;687,361
41,65;12,3739;687,412
41,67;12,3841;687,466
41,69;12,3939;687,508
41,71;12,4045;687,539
41,73;12,4149;687,563
41,75;12,4245;687,595
41,77;12,4349;687,622
41,79;12,4451;687,666
41,81;12,455;687,723
41,83;12,4654;687,79
41,85;12,4756;687,837
41,87;12,4859;687,894
41,89;12,4958;687,926
41,91;12,5063;687,959
41,93;12,516;687,987
41,95;12,5266;688,031
41,97;12,5365;688,067
41,99;12,5471;688,121
42,01;12,5568;688,166
42,03;12,5672;688,218
42,05;12,5772;688,257
42,07;12,5873;688,302
42,09;12,5974;688,356
42,11;12,6079;688,427
42,13;12,6183;688,484
42,15;12,6286;688,548
42,17;12,6386;688,603
42,19;12,6494;688,648
42,21;12,6595;688,686
42,23;12,6696;688,712
42,25;12,6802;688,732
42,27;12,6906;688,783
42,29;12,7002;688,829
42,31;12,7112;688,88
42,33;12,7214;688,943
42,35;12,7316;689,002
42,37;12,7421;689,021
42,39;12,7527;689,042
42,41;12,7624;689,058
42,43;12,7732;689,094
42,45;12,7834;689,135
42,47;12,7935;689,187
42,49;12,8034;689,223
42,51;12,814;689,259
42,53;12,8238;689,284
42,55;12,8339;689,315
42,57;12,8441;689,359
42,59;12,8546;689,416
42,61;12,8648;689,465
42,63;12,8754;689,518
42,65;12,8856;689,551
42,67;12,8959;689,588
42,69;12,9062;689,619
42,71;12,9165;689,647
42,73;12,9268;689,677
42,75;12,9373;689,724
42,77;12,9474;689,762
42,79;12,9576;689,816
42,81;12,9676;689,877
42,83;12,9781;689,921
42,85;12,9881;689,96
42,87;12,9987;689,995
42,89;13,0092;690,021
42,91;13,0194;690,061
42,93;13,0299;690,112
42,95;13,0404;690,164
42,97;13,0509;690,207
42,99;13,0612;690,248
43,01;13,0714;690,266
43,03;13,0821;690,284
43,05;13,0918;690,323
43,07;13,1023;690,382
43,09;13,1127;690,442
43,11;13,1229;690,507
43,13;13,1333;690,555
43,15;13,1438;690,574
43,17;13,1538;690,591
43,19;13,1644;690,613
43,21;13,1748;690,632
43,23;13,1852;690,673
43,25;13,1958;690,728
43,27;13,2063;690,771
43,29;13,2165;690,817
43,31;13,2268;690,861
43,33;13,2374;690,893
43,35;13,248;690,925
43,37;13,2581;690,953
43,39;13,2688;690,985
43,41;13,2792;691,018
43,43;13,2893;691,061
43,45;13,2999;691,086
43,47;13,3104;691,112
43,49;13,3207;691,132
43,51;13,3316;691,154
43,53;13,3418;691,192
43,55;13,3522;691,245
43,57;13,3629;691,311
43,59;13,3737;691,383
43,61;13,3836;691,444
43,63;13,3948;691,467
43,65;13,4055;691,492
43,67;13,4156;691,511
43,69;13,4262;691,518
43,71;13,4373;691,556
43,73;13,4474;691,588
43,75;13,4579;691,638
43,77;13,4687;691,672
43,79;13,4789;691,719
43,81;13,4889;691,753
43,83;13,5003;691,811
43,85;13,5106;691,842
43,87;13,521;691,884
43,89;13,532;691,923
43,91;13,5428;691,95
43,93;13,5528;691,969
43,95;13,5636;691,992
43,97;13,5743;692,001
43,99;13,5845;692,016
44,01;13,5947;692,039
44,03;13,6051;692,078
44,05;13,6158;692,12
44,07;13,6256;692,188
44,09;13,6362;692,24
44,11;13,6472;692,283
44,13;13,6573;692,301
44,15;13,6679;692,323
44,17;13,6786;692,337
44,19;13,6886;692,36
44,21;13,6991;692,382
44,23;13,7101;692,415
44,25;13,72;692,442
44,27;13,7303;692,469
44,29;13,741;692,494
44,31;13,7514;692,54
44,33;13,7616;692,591
44,35;13,7727;692,653
44,37;13,7833;692,694
44,39;13,7936;692,738
44,41;13,8045;692,761
44,43;13,8145;692,777
44,45;13,825;692,779
44,47;13,8357;692,789
44,49;13,8458;692,806
44,51;13,8562;692,841
44,53;13,8668;692,875
44,55;13,8775;692,924
44,57;13,8878;692,977
44,59;13,8986;693,024
44,61;13,9095;693,064
44,63;13,9199;693,093
44,65;13,9305;693,124
44,67;13,9412;693,156
44,69;13,9514;693,178
44,71;13,9622;693,206
44,73;13,9729;693,239
44,75;13,9831;693,263
44,77;13,9935;693,281
44,79;14,0045;693,318
44,81;14,0146;693,359
44,83;14,0256;693,414
44,85;14,0363;693,486
44,87;14,047;693,555
44,89;14,0579;693,595
44,91;14,0689;693,625
44,93;14,0798;693,637
44,95;14,0905;693,624
44,97;14,1017;693,614
44,99;14,1122;693,622
45,01;14,123;693,633
45,03;14,1337;693,667
45,05;14,1441;693,708
45,07;14,1551;693,757
45,09;14,166;693,799
45,11;14,1766;693,833
45,13;14,1877;693,857
45,15;14,1985;693,886
45,17;14,2089;693,912
45,19;14,2197;693,949
45,21;14,2302;693,969
45,23;14,2407;693,978
45,25;14,2516;693,974
45,27;14,2622;693,99
45,29;14,2728;694
45,31;14,2839;694,053
45,33;14,2948;694,111
45,35;14,3058;694,174
45,37;14,3169;694,204
45,39;14,3278;694,228
45,41;14,3388;694,23
45,43;14,3494;694,246
45,45;14,3602;694,268
45,47;14,3711;694,298
45,49;14,382;694,33
45,51;14,3928;694,363
45,53;14,4037;694,385
45,55;14,4143;694,394
45,57;14,4255;694,417
45,59;14,4364;694,442
45,61;14,4472;694,46
45,63;14,4585;694,489
45,65;14,4696;694,527
45,67;14,4801;694,559
45,69;14,4911;694,577
45,71;14,5019;694,588
45,73;14,5126;694,586
45,75;14,5232;694,598
45,77;14,5341;694,606
45,79;14,5447;694,647
45,81;14,5556;694,699
45,83;14,5665;694,749
45,85;14,5777;694,779
45,87;14,5886;694,823
45,89;14,5996;694,839
45,91;14,6109;694,86
45,93;14,6219;694,887
45,95;14,6328;694,913
45,97;14,6442;694,918
45,99;14,6551;694,942
46,01;14,6658;694,944
46,03;14,6769;694,959
46,05;14,688;694,98
46,07;14,6988;695,006
46,09;14,7102;695,034
46,11;14,721;695,083
46,13;14,7321;695,113
46,15;14,7433;695,137
46,17;14,7541;695,172
46,19;14,7649;695,187
46,21;14,7765;695,188
46,23;14,7874;695,201
46,25;14,798;695,22
46,27;14,8092;695,239
46,29;14,8204;695,269
46,31;14,8313;695,317
46,33;14,8424;695,356
46,35;14,854;695,392
46,37;14,8653;695,41
46,39;14,8764;695,429
46,41;14,8877;695,443
46,43;14,8988;695,462
46,45;14,9096;695,489
46,47;14,9212;695,516
46,49;14,9319;695,53
46,51;14,943;695,53
46,53;14,9539;695,537
46,55;14,9652;695,55
46,57;14,9762;695,566
46,59;14,9876;695,597
46,61;14,9991;695,624
46,63;15,0102;695,645
46,65;15,0214;695,658
46,67;15,0327;695,668
46,69;15,0436;695,667
46,71;15,0545;695,684
46,73;15,0656;695,695
46,75;15,0766;695,711
46,77;15,0875;695,747
46,79;15,0983;695,789
46,81;15,1099;695,802
46,83;15,1207;695,831
46,85;15,132;695,837
46,87;15,1438;695,827
46,89;15,1547;695,829
46,91;15,1657;695,868
46,93;15,1773;695,887
46,95;15,1883;695,92
46,97;15,1993;695,94
46,99;15,2109;695,961
47,01;15,2219;695,961
47,03;15,2327;695,976
47,05;15,2439;696,013
47,07;15,2552;696,063
47,09;15,2665;696,087
47,11;15,2782;696,115
47,13;15,2894;696,132
47,15;15,3011;696,129
47,17;15,3125;696,113
47,19;15,3236;696,118
47,21;15,3353;696,123
47,23;15,3467;696,136
47,25;15,3581;696,162
47,27;15,3694;696,192
47,29;15,3806;696,212
47,31;15,392;696,23
47,33;15,4034;696,241
47,35;15,4148;696,239
47,37;15,4261;696,25
47,39;15,4376;696,261
47,41;15,4491;696,28
47,43;15,4601;696,302
47,45;15,4717;696,311
47,47;15,4829;696,307
47,49;15,4943;696,309
47,51;15,5058;696,314
47,53;15,5168;696,324
47,55;15,5285;696,359
47,57;15,54;696,415
47,59;15,5512;696,459
47,61;15,5632;696,478
47,63;15,5747;696,475
47,65;15,5864;696,455
47,67;15,5979;696,431
47,69;15,6097;696,415
47,71;15,6208;696,424
47,73;15,6327;696,445
47,75;15,6438;696,466
47,77;15,6554;696,475
47,79;15,6667;696,5
47,81;15,6784;696,504
47,83;15,6897;696,522
47,85;15,7014;696,548
47,87;15,7127;696,572
47,89;15,7245;696,577
47,91;15,7358;696,6
47,93;15,7476;696,607
47,95;15,759;696,603
47,97;15,771;696,601
47,99;15,7824;696,601
48,01;15,7938;696,598
48,03;15,8056;696,632
48,05;15,8171;696,673
48,07;15,8286;696,708
48,09;15,8408;696,731
48,11;15,8522;696,736
48,13;15,864;696,703
48,15;15,8756;696,678
48,17;15,8869;696,668
48,19;15,8986;696,67
48,21;15,9104;696,671
48,23;15,9216;696,681
48,25;15,933;696,68
48,27;15,9448;696,675
48,29;15,9563;696,674
48,31;15,9677;696,7
48,33;15,9795;696,722
48,35;15,9911;696,747
48,37;16,0028;696,763
48,39;16,0144;696,773
48,41;16,026;696,762
48,43;16,0375;696,761
48,45;16,0494;696,742
48,47;16,0607;696,72
48,49;16,0724;696,712
48,51;16,0837;696,729
48,53;16,0954;696,739
48,55;16,1068;696,775
48,57;16,1185;696,814
48,59;16,1305;696,831
48,61;16,1425;696,832
48,63;16,1544;696,834
48,65;16,1666;696,829
48,67;16,1781;696,828
48,69;16,1903;696,83
48,71;16,2023;696,816
48,73;16,2136;696,797
48,75;16,2256;696,782
48,77;16,2375;696,763
48,79;16,2491;696,759
48,81;16,2609;696,78
48,83;16,2729;696,811
48,85;16,2849;696,833
48,87;16,2965;696,846
48,89;16,3084;696,842
48,91;16,3201;696,832
48,93;16,3317;696,802
48,95;16,3437;696,775
48,97;16,3555;696,753
48,99;16,3675;696,755
49,01;16,3794;696,747
49,03;16,3912;696,758
49,05;16,4034;696,776
49,07;16,4153;696,795
49,09;16,4274;696,797
49,11;16,4396;696,803
49,13;16,4514;696,794
49,15;16,4633;696,785
49,17;16,4756;696,787
49,19;16,4874;696,784
49,21;16,4995;696,763
49,23;16,5116;696,745
49,25;16,5236;696,719
49,27;16,5352;696,693
49,29;16,5473;696,691
49,31;16,5595;696,712
49,33;16,5714;696,731
49,35;16,5839;696,749
49,37;16,5961;696,733
49,39;16,608;696,718
49,41;16,6203;696,688
49,43;16,6322;696,663
49,45;16,6443;696,64
49,47;16,6563;696,642
49,49;16,6682;696,625
49,51;16,6802;696,616
49,53;16,6919;696,611
49,55;16,7042;696,603
49,57;16,7161;696,605
49,59;16,7286;696,595
49,61;16,7412;696,595
49,63;16,7532;696,595
49,65;16,7657;696,595
49,67;16,778;696,57
49,69;16,7903;696,548
49,71;16,8023;696,504
49,73;16,8148;696,458
49,75;16,8268;696,42
49,77;16,8389;696,412
49,79;16,8511;696,409
49,81;16,8634;696,433
49,83;16,8758;696,44
49,85;16,8881;696,431
49,87;16,9008;696,402
49,89;16,9132;696,368
49,91;16,9255;696,324
49,93;16,9382;696,29
49,95;16,9505;696,267
49,97;16,9631;696,239
49,99;16,9751;696,228
50,01;16,9874;696,204
50,03;16,9995;696,178
50,05;17,012;696,149
50,07;17,0243;696,13
50,09;17,037;696,103
50,11;17,0493;696,091
50,13;17,0621;696,075
50,15;17,074;696,051
50,17;17,0868;696,03
50,19;17,0992;696
50,21;17,1118;695,94
50,23;17,1242;695,906
50,25;17,1367;695,88
50,27;17,1491;695,853
50,29;17,1615;695,839
50,31;17,1742;695,846
50,33;17,1868;695,813
50,35;17,1992;695,783
50,37;17,2122;695,733
50,39;17,2248;695,675
50,41;17,2368;695,632
50,43;17,2495;695,606
50,45;17,2622;695,563
50,47;17,2741;695,537
50,49;17,2868;695,495
50,51;17,299;695,443
50,53;17,3116;695,397
50,55;17,3239;695,379
50,57;17,3367;695,347
50,59;17,3494;695,328
50,61;17,3623;695,29
50,63;17,3752;695,234
50,65;17,3879;695,167
50,67;17,4007;695,109
50,69;17,4135;695,04
50,71;17,4263;694,995
50,73;17,439;694,952
50,75;17,4517;694,898
50,77;17,4644;694,856
50,79;17,4773;694,818
50,81;17,4899;694,75
50,83;17,5031;694,679
50,85;17,516;694,613
50,87;17,5289;694,529
50,89;17,5419;694,465
50,91;17,5546;694,42
50,93;17,5678;694,373
50,95;17,5811;694,312
50,97;17,5936;694,242
50,99;17,6066;694,163
51,01;17,6197;694,076
51,03;17,6325;694,016
51,05;17,6451;693,967
51,07;17,6586;693,927
51,09;17,6718;693,88
51,11;17,6847;693,814
51,13;17,6979;693,72
51,15;17,711;693,628
51,17;17,724;693,534
51,19;17,737;693,439
51,21;17,7504;693,363
51,23;17,7638;693,303
51,25;17,7769;693,233
51,27;17,79;693,167
51,29;17,8034;693,083
51,31;17,8163;693
51,33;17,8298;692,912
51,35;17,8431;692,82
51,37;17,8565;692,717
51,39;17,87;692,632
51,41;17,8832;692,537
51,43;17,8967;692,429
51,45;17,9102;692,312
51,47;17,9235;692,18
51,49;17,9366;692,041
51,51;17,95;691,919
51,53;17,9629;691,804
51,55;17,9764;691,719
51,57;17,9895;691,636
51,59;18,0029;691,543
51,61;18,0165;691,429
51,63;18,0298;691,298
51,65;18,0431;691,139
51,67;18,0568;690,999
51,69;18,0702;690,864
51,71;18,0835;690,727
51,73;18,0972;690,606
51,75;18,1103;690,492
51,77;18,1236;690,361
51,79;18,1372;690,239
51,81;18,151;690,115
51,83;18,1646;689,986
51,85;18,1786;689,838
51,87;18,1923;689,688
51,89;18,2064;689,521
51,91;18,2198;689,357
51,93;18,2341;689,179
51,95;18,2477;688,991
51,97;18,2612;688,807
51,99;18,2752;688,632
52,01;18,2889;688,456
52,03;18,3026;688,311
52,05;18,3168;688,178
52,07;18,3307;688,03
52,09;18,3448;687,859
52,11;18,3591;687,66
52,13;18,373;687,42
52,15;18,3867;687,194
52,17;18,4003;686,988
52,19;18,4144;686,779
52,21;18,4285;686,582
52,23;18,4424;686,399
52,25;18,4569;686,185
52,27;18,4705;685,966
52,29;18,4852;685,753
52,31;18,4992;685,551
52,33;18,5137;685,333
52,35;18,5281;685,118
52,37;18,543;684,891
52,39;18,557;684,652
52,41;18,5714;684,382
52,43;18,5859;684,106
52,45;18,6003;683,821
52,47;18,6142;683,532
52,49;18,6286;683,252
52,51;18,6425;683
52,53;18,6571;682,747
52,55;18,6714;682,5
52,57;18,6863;682,239
52,59;18,7006;681,956
52,61;18,7156;681,644
52,63;18,7302;681,341
52,65;18,7446;681,035
52,67;18,759;680,724
52,69;18,7738;680,418
52,71;18,7882;680,11
52,73;18,8025;679,781
52,75;18,8171;679,46
52,77;18,8315;679,131
52,79;18,8462;678,811
52,81;18,8611;678,498
52,83;18,8758;678,187
52,85;18,891;677,846
52,87;18,9057;677,482
52,89;18,9208;677,1
52,91;18,9353;676,696
52,93;18,9501;676,284
52,95;18,965;675,878
52,97;18,9799;675,481
52,99;18,9943;675,099
53,01;19,0095;674,724
53,03;19,0242;674,334
53,05;19,039;673,945
53,07;19,0545;673,55
53,09;19,0697;673,117
53,11;19,0847;672,676
53,13;19,1003;672,236
53,15;19,1151;671,776
53,17;19,1303;671,331
53,19;19,1452;670,877
53,21;19,1602;670,398
53,23;19,1754;669,918
53,25;19,1904;669,441
53,27;19,2053;668,959
53,29;19,2209;668,497
53,31;19,236;668,036
53,33;19,2515;667,549
53,35;19,2673;667,045
53,37;19,2827;666,508
53,39;19,2981;665,95
53,41;19,3136;665,401
53,43;19,3289;664,844
53,45;19,3445;664,278
53,47;19,3596;663,725
53,49;19,3752;663,154
53,51;19,3904;662,574
53,53;19,4058;661,997
53,55;19,4212;661,409
53,57;19,4372;660,793
53,59;19,4526;660,165
53,61;19,4687;659,508
53,63;19,4843;658,85
53,65;19,5001;658,195
53,67;19,5154;657,531
53,69;19,5314;656,838
53,71;19,5468;656,15
53,73;19,5624;655,446
53,75;19,5781;654,744
53,77;19,5938;654,03
53,79;19,6094;653,337
53,81;19,6255;652,618
53,83;19,6414;651,887
53,85;19,6575;651,117
53,87;19,6734;650,334
53,89;19,6897;649,532
53,91;19,7054;648,721
53,93;19,7214;647,896
53,95;19,7375;647,068
53,97;19,7536;646,23
53,99;19,7693;645,368
54,01;19,7855;644,496
54,03;19,8015;643,61
54,05;19,8177;642,701
54,07;19,8342;641,79
54,09;19,8507;640,863
54,11;19,8671;639,917
54,13;19,8837;638,944
54,15;19,9;637,972
54,17;19,9163;636,964
54,19;19,9325;635,942
54,21;19,949;634,904
54,23;19,9651;633,86
54,25;19,9816;632,796
54,27;19,9978;631,729
54,29;20,0145;630,646
54,31;20,0308;629,544
54,33;20,0478;628,403
54,35;20,0644;627,227
54,37;20,0811;626,024
54,39;20,0979;624,825
54,41;20,1146;623,601
54,43;20,1313;622,386
54,45;20,1484;621,147
54,47;20,1649;619,88
54,49;20,1816;618,566
54,51;20,1982;617,227
54,53;20,2152;615,853
54,55;20,2323;614,459
54,57;20,2496;613,043
54,59;20,267;611,598
54,61;20,2844;610,124
54,63;20,3016;608,613
54,65;20,3188;607,081
54,67;20,3359;605,527
54,69;20,3534;603,949
54,71;20,3705;602,365
54,73;20,388;600,762
54,75;20,4052;599,132
54,77;20,4229;597,474
54,79;20,4404;595,777
54,81;20,4584;594,012
54,83;20,4765;592,192
54,85;20,4949;590,304
54,87;20,5134;588,351
54,89;20,532;586,353
54,91;20,5504;584,311
54,93;20,5692;582,165
54,95;20,5882;579,865
54,97;20,6075;577,198
54,99;20,6272;571,233
