"s";"%";"MPa"
0;0;5,65492
0,02;0,000266451;5,6525
0,04;-0,000186007;5,65985
0,06;-0,000994526;5,66229
0,08;-0,00326904;5,66276
0,1;-0,00334371;5,66752
0,12;-0,00410437;5,66918
0,14;-0,00357927;5,67261
0,16;-0,0029605;5,67777
0,18;-0,00142254;5,68795
0,2;-0,000788153;5,68435
0,22;0,000386949;5,68305
0,24;4,37863e-005;5,68314
0,26;-0,000913742;5,68152
0,28;-0,00197717;5,6798
0,3;-0,00364614;5,69088
0,32;-0,00389155;5,6971
0,34;-0,00362645;5,69294
0,36;-0,00303008;5,69393
0,38;-0,00131053;5,68748
0,4;-0,000257287;5,67604
0,42;-8,85908e-005;5,6728
0,44;-0,000212143;5,67602
0,46;-0,000402902;5,68605
0,48;-0,00169884;5,70019
0,5;-0,00268726;5,71605
0,52;-0,00325206;5,73541
0,54;-0,00324901;5,77334
0,56;-0,00297645;5,80704
0,58;-0,00120226;5,86018
0,6;-0,000522041;5,93945
0,62;0,00024337;6,04343
0,64;0,000310238;6,17363
0,66;0,000150027;6,33268
0,68;-0,000808519;6,50683
0,7;-0,00165913;6,69479
0,72;-0,00218626;6,8968
0,74;-0,00223174;7,09208
0,76;-0,00196902;7,31743
0,78;-0,000449743;7,56466
0,8;0,00035029;7,82627
0,82;0,00165641;8,10437
0,84;0,00213772;8,38997
0,86;0,0020308;8,71016
0,88;0,00111842;9,03162
0,9;0,000518986;9,38626
0,92;0,000235903;9,74422
0,94;-0,00153557;10,1469
0,96;0,00133837;10,5403
0,98;0,00267266;10,9609
1;0,00165811;11,3816
1,02;0,00569629;11,8327
1,04;0,00467699;12,2913
1,06;0,00425406;12,7611
1,08;0,00465289;13,2517
1,1;0,00331384;13,7413
1,12;0,00320454;14,233
1,14;0,00325444;14,7273
1,16;0,00348763;15,2225
1,18;0,00425338;15,7039
1,2;0,00605099;16,2111
1,22;0,00720369;16,7173
1,24;0,00795417;17,2404
1,26;0,00794908;17,7606
1,28;0,00800305;18,2988
1,3;0,00754957;18,8328
1,32;0,00716398;19,3738
1,34;0,00675055;19,9065
1,36;0,00695455;20,4457
1,38;0,0075696;20,9887
1,4;0,00981288;21,5249
1,42;0,0109724;22,0674
1,44;0,011582;22,6058
1,46;0,0119489;23,1591
1,48;0,0118355;23,7071
1,5;0,0117415;24,263
1,52;0,0114282;24,8224
1,54;0,0112144;25,3814
1,56;0,0112283;25,9252
1,58;0,0122524;26,4678
1,6;0,0130405;26,9991
1,62;0,0147254;27,5439
1,64;0,0154084;28,0944
1,66;0,0165234;28,6442
1,68;0,0163313;29,196
1,7;0,0162644;29,7567
1,72;0,0151331;30,3031
1,74;0,0151338;30,8451
1,76;0,0151066;31,3846
1,78;0,0163812;31,9251
1,8;0,016816;32,4539
1,82;0,0186207;32,9796
1,84;0,0193277;33,5168
1,86;0,0200371;34,0523
1,88;0,0202452;34,5952
1,9;0,020234;35,1536
1,92;0,0195375;35,701
1,94;0,0192018;36,2353
1,96;0,0192782;36,7887
1,98;0,0195317;37,3275
2;0,0209991;37,8551
2,02;0,0226345;38,3874
2,04;0,0229573;38,9249
2,06;0,0243038;39,4538
2,08;0,0242702;39,988
2,1;0,024224;40,523
2,12;0,0236748;41,06
2,14;0,023462;41,5882
2,16;0,0234274;42,1144
2,18;0,0236493;42,6356
2,2;0,0241123;43,1583
2,22;0,0261071;43,6817
2,24;0,026672;44,2032
2,26;0,027678;44,7324
2,28;0,0279934;45,2589
2,3;0,0280256;45,7786
2,32;0,0275806;46,3018
2,34;0,0274482;46,8329
2,36;0,0274197;47,3469
2,38;0,0275365;47,8602
2,4;0,0277768;48,381
2,42;0,0293908;48,8885
2,44;0,0304148;49,4008
2,46;0,0313707;49,9165
2,48;0,0318842;50,4294
2,5;0,0318951;50,9326
2,52;0,0315709;51,4383
2,54;0,0312159;51,9449
2,56;0,031075;52,4507
2,58;0,0311959;52,9603
2,6;0,03139;53,4758
2,62;0,0332348;53,991
2,64;0,0340135;54,4932
2,66;0,0352459;54,9957
2,68;0,0353152;55,5036
2,7;0,0353848;56,0094
2,72;0,0350284;56,5209
2,74;0,034898;57,0271
2,76;0,0347853;57,5285
2,78;0,0348223;58,0205
2,8;0,0350402;58,5215
2,82;0,0365663;59,0136
2,84;0,0373697;59,5073
2,86;0,0385397;60,0102
2,88;0,0392763;60,5122
2,9;0,0392125;61,0029
2,92;0,0388961;61,5091
2,94;0,0388333;62,0062
2,96;0,0387285;62,5032
2,98;0,0387454;63,0113
3;0,0388625;63,5113
3,02;0,0398153;63,9976
3,04;0,0412039;64,5048
3,06;0,0424479;65,0066
3,08;0,0424659;65,4931
3,1;0,0426845;65,9847
3,12;0,0425922;66,4754
3,14;0,0425616;66,9511
3,16;0,0424523;67,4318
3,18;0,0424398;67,9178
3,2;0,0425267;68,4098
3,22;0,0431621;68,9051
3,24;0,0442564;69,3993
3,26;0,0454671;69,8914
3,28;0,0458239;70,3921
3,3;0,0467977;70,8819
3,32;0,0466049;71,3807
3,34;0,046443;71,8723
3,36;0,0461243;72,3673
3,38;0,0460221;72,8656
3,4;0,0460734;73,3702
3,42;0,047205;73,8515
3,44;0,0474447;74,3533
3,46;0,0489368;74,8425
3,48;0,0495885;75,3236
3,5;0,0500515;75,8001
3,52;0,0500325;76,2903
3,54;0,0499948;76,7758
3,56;0,049765;77,2617
3,58;0,0497579;77,7431
3,6;0,0497816;78,2258
3,62;0,050267;78,715
3,64;0,0509499;79,2043
3,66;0,0526715;79,6953
3,68;0,0530075;80,1856
3,7;0,0537353;80,6787
3,72;0,0536878;81,1674
3,74;0,053609;81,6536
3,76;0,0534257;82,1418
3,78;0,0533555;82,6213
3,8;0,0533429;83,1008
3,82;0,0535364;83,5787
3,84;0,0543819;84,0609
3,86;0,0555998;84,5357
3,88;0,0561972;85,0274
3,9;0,0568635;85,5137
3,92;0,0568893;85,9869
3,94;0,0568526;86,4629
3,96;0,0567939;86,9373
3,98;0,0567586;87,3989
4;0,0567385;87,8656
4,02;0,0569137;88,3392
4,04;0,0582208;88,7967
4,06;0,0591037;89,2702
4,08;0,0595833;89,7473
4,1;0,0600229;90,2162
4,12;0,0605771;90,6847
4,14;0,0605965;91,1598
4,16;0,0605171;91,638
4,18;0,0604977;92,1084
4,2;0,0604634;92,5769
4,22;0,0605622;93,0419
4,24;0,0607852;93,5084
4,26;0,0622916;93,9542
4,28;0,0626012;94,3993
4,3;0,063727;94,8465
4,32;0,0637956;95,3109
4,34;0,0638431;95,7706
4,36;0,0636904;96,2352
4,38;0,0636636;96,6969
4,4;0,0636164;97,1608
4,42;0,0638367;97,6073
4,44;0,0643092;98,0592
4,46;0,0654625;98,5092
4,48;0,0658991;98,9625
4,5;0,0670582;99,4126
4,52;0,0670887;99,8687
4,54;0,0670996;100,314
4,56;0,0669981;100,756
4,58;0,0669788;101,214
4,6;0,0669428;101,672
4,62;0,067104;102,12
4,64;0,0672059;102,58
4,66;0,0684624;103,042
4,68;0,0696341;103,485
4,7;0,0703235;103,939
4,72;0,0703086;104,396
4,74;0,0707641;104,839
4,76;0,0706663;105,301
4,78;0,0705964;105,764
4,8;0,0705686;106,203
4,82;0,0706215;106,659
4,84;0,0706857;107,123
4,86;0,0714952;107,565
4,88;0,0725478;108,01
4,9;0,0731991;108,474
4,92;0,0733169;108,925
4,94;0,0740772;109,372
4,96;0,0739306;109,82
4,98;0,0738342;110,27
5;0,0737955;110,718
5,02;0,0738498;111,158
5,04;0,0739014;111,598
5,06;0,0754811;112,043
5,08;0,0756104;112,486
5,1;0,0764156;112,924
5,12;0,0768514;113,375
5,14;0,0771698;113,809
5,16;0,0770938;114,247
5,18;0,0771002;114,691
5,2;0,0770157;115,126
5,22;0,0770568;115,537
5,24;0,0770988;115,947
5,26;0,078296;116,363
5,28;0,078371;116,771
5,3;0,0798041;117,185
5,32;0,0798615;117,612
5,34;0,0805308;118,057
5,36;0,0804758;118,494
5,38;0,0804687;118,925
5,4;0,0803913;119,362
5,42;0,0804205;119,793
5,44;0,0804541;120,229
5,46;0,0809785;120,654
5,48;0,0816095;121,082
5,5;0,0831481;121,514
5,52;0,0831743;121,947
5,54;0,0834967;122,367
5,56;0,0834781;122,797
5,58;0,0834954;123,23
5,6;0,0833725;123,646
5,62;0,0834991;124,076
5,64;0,0835246;124,503
5,66;0,0838654;124,935
5,68;0,0846891;125,368
5,7;0,0860217;125,804
5,72;0,0860733;126,227
5,74;0,0862648;126,663
5,76;0,086725;127,095
5,78;0,0867227;127,51
5,8;0,0866358;127,941
5,82;0,0866724;128,366
5,84;0,0867067;128,795
5,86;0,0868357;129,217
5,88;0,0879219;129,641
5,9;0,0889853;130,06
5,92;0,089042;130,491
5,94;0,0896054;130,904
5,96;0,0896116;131,325
5,98;0,0896197;131,747
6;0,0895684;132,17
6,02;0,0896441;132,594
6,04;0,0896003;133,019
6,06;0,0903549;133,442
6,08;0,09075;133,869
6,1;0,0916345;134,289
6,12;0,0922177;134,7
6,14;0,0930354;135,11
6,16;0,0930031;135,534
6,18;0,0930445;135,952
6,2;0,0930062;136,368
6,22;0,0930048;136,789
6,24;0,0929858;137,211
6,26;0,0934019;137,62
6,28;0,0936827;138,054
6,3;0,0944535;138,482
6,32;0,0952688;138,896
6,34;0,0959355;139,318
6,36;0,0959236;139,745
6,38;0,0959741;140,159
6,4;0,0959524;140,572
6,42;0,0959287;141,006
6,44;0,095947;141,434
6,46;0,0966645;141,852
6,48;0,0967222;142,268
6,5;0,0980922;142,684
6,52;0,0984601;143,096
6,54;0,0990786;143,519
6,56;0,0990514;143,927
6,58;0,0992992;144,335
6,6;0,0992449;144,751
6,62;0,0992442;145,161
6,64;0,0992724;145,553
6,66;0,0993885;145,959
6,68;0,0999869;146,378
6,7;0,10085;146,797
6,72;0,101337;147,211
6,74;0,101969;147,636
6,76;0,101959;148,051
6,78;0,102614;148,457
6,8;0,102591;148,857
6,82;0,102593;149,256
6,84;0,102582;149,645
6,86;0,102633;150,051
6,88;0,10272;150,449
6,9;0,103776;150,841
6,92;0,104099;151,233
6,94;0,104602;151,634
6,96;0,105195;152,018
6,98;0,105465;152,409
7;0,105443;152,813
7,02;0,10541;153,215
7,04;0,105422;153,61
7,06;0,10548;154,014
7,08;0,105897;154,406
7,1;0,10699;154,78
7,12;0,107044;155,168
7,14;0,107859;155,547
7,16;0,108329;155,913
7,18;0,108502;156,295
7,2;0,108434;156,682
7,22;0,10845;157,057
7,24;0,108432;157,443
7,26;0,108472;157,823
7,28;0,108589;158,199
7,3;0,109506;158,586
7,32;0,109819;158,979
7,34;0,111089;159,374
7,36;0,111155;159,773
7,38;0,111177;160,157
7,4;0,111167;160,542
7,42;0,111376;160,927
7,44;0,11128;161,309
7,46;0,111622;161,692
7,48;0,111666;162,088
7,5;0,111937;162,47
7,52;0,112808;162,846
7,54;0,113701;163,221
7,56;0,113718;163,601
7,58;0,114065;163,978
7,6;0,114092;164,364
7,62;0,114181;164,753
7,64;0,114106;165,138
7,66;0,114425;165,515
7,68;0,114455;165,894
7,7;0,114954;166,284
7,72;0,115627;166,663
7,74;0,117033;167,042
7,76;0,116989;167,432
7,78;0,117124;167,823
7,8;0,11713;168,199
7,82;0,117212;168,566
7,84;0,117138;168,942
7,86;0,117255;169,32
7,88;0,117212;169,694
7,9;0,118466;170,061
7,92;0,118545;170,436
7,94;0,118933;170,805
7,96;0,119637;171,161
7,98;0,120211;171,518
8;0,120167;171,88
8,02;0,120307;172,244
8,04;0,120248;172,618
8,06;0,120309;173,008
8,08;0,120271;173,38
8,1;0,121519;173,755
8,12;0,121471;174,124
8,14;0,121938;174,494
8,16;0,122111;174,857
8,18;0,122854;175,226
8,2;0,122823;175,591
8,22;0,122842;175,952
8,24;0,1228;176,315
8,26;0,122848;176,676
8,28;0,122866;177,027
8,3;0,123472;177,381
8,32;0,123796;177,752
8,34;0,124668;178,108
8,36;0,124961;178,454
8,38;0,125727;178,828
8,4;0,12572;179,206
8,42;0,125744;179,568
8,44;0,125679;179,919
8,46;0,126174;180,271
8,48;0,126141;180,621
8,5;0,126189;180,974
8,52;0,126731;181,322
8,54;0,127511;181,698
8,56;0,127604;182,068
8,58;0,128275;182,423
8,6;0,128266;182,774
8,62;0,128499;183,137
8,64;0,128741;183,487
8,66;0,128871;183,845
8,68;0,12882;184,217
8,7;0,128858;184,576
8,72;0,129764;184,943
8,74;0,13028;185,298
8,76;0,130459;185,662
8,78;0,131019;186,011
8,8;0,131046;186,353
8,82;0,131344;186,695
8,84;0,131332;187,044
8,86;0,131365;187,387
8,88;0,131333;187,731
8,9;0,131594;188,089
8,92;0,132196;188,443
8,94;0,132741;188,796
8,96;0,132792;189,149
8,98;0,133531;189,512
9;0,133862;189,887
9,02;0,13441;190,257
9,04;0,134389;190,63
9,06;0,134425;191,02
9,08;0,134401;191,415
9,1;0,134593;191,8
9,12;0,134825;192,194
9,14;0,13545;192,615
9,16;0,135815;193,03
9,18;0,136775;193,448
9,2;0,136882;193,891
9,22;0,137404;194,342
9,24;0,137399;194,792
9,26;0,137459;195,256
9,28;0,137835;195,729
9,3;0,137985;196,191
9,32;0,138099;196,675
9,34;0,138893;197,165
9,36;0,139485;197,661
9,38;0,140611;198,148
9,4;0,140604;198,669
9,42;0,140706;199,185
9,44;0,140956;199,696
9,46;0,141356;200,215
9,48;0,141347;200,746
9,5;0,14183;201,265
9,52;0,14197;201,786
9,54;0,143324;202,323
9,56;0,143582;202,863
9,58;0,144279;203,422
9,6;0,144444;203,99
9,62;0,145455;204,553
9,64;0,145451;205,116
9,66;0,145783;205,688
9,68;0,145793;206,256
9,7;0,145979;206,83
9,72;0,146328;207,42
9,74;0,14754;208,037
9,76;0,147684;208,643
9,78;0,148711;209,244
9,8;0,148824;209,852
9,82;0,150187;210,467
9,84;0,150129;211,074
9,86;0,150284;211,705
9,88;0,150276;212,357
9,9;0,150911;213,016
9,92;0,151254;213,683
9,94;0,152478;214,351
9,96;0,152517;215,012
9,98;0,153818;215,681
10;0,153854;216,341
10,02;0,155127;217,014
10,04;0,155177;217,681
10,06;0,155266;218,369
10,08;0,155722;219,052
10,1;0,156276;219,75
10,12;0,156345;220,442
10,14;0,157182;221,155
10,16;0,157722;221,863
10,18;0,158725;222,581
10,2;0,159395;223,304
10,22;0,16043;224,034
10,24;0,160473;224,754
10,26;0,160809;225,486
10,28;0,161172;226,228
10,3;0,162197;226,975
10,32;0,162277;227,722
10,34;0,163066;228,488
10,36;0,163426;229,255
10,38;0,165133;230,022
10,4;0,165168;230,809
10,42;0,166334;231,6
10,44;0,166365;232,389
10,46;0,167053;233,203
10,48;0,167536;234,023
10,5;0,168149;234,829
10,52;0,168203;235,648
10,54;0,168998;236,476
10,56;0,169967;237,295
10,58;0,171034;238,116
10,6;0,171405;238,947
10,62;0,172605;239,776
10,64;0,172859;240,608
10,66;0,173731;241,435
10,68;0,17391;242,269
10,7;0,174519;243,104
10,72;0,174938;243,959
10,74;0,176365;244,811
10,76;0,17652;245,666
10,78;0,177414;246,526
10,8;0,178466;247,393
10,82;0,179336;248,246
10,84;0,179818;249,105
10,86;0,180696;249,967
10,88;0,180746;250,821
10,9;0,181068;251,675
10,92;0,182038;252,541
10,94;0,182907;253,41
10,96;0,183025;254,28
10,98;0,184138;255,155
11;0,185139;256,033
11,02;0,186133;256,911
11,04;0,186722;257,79
11,06;0,187705;258,672
11,08;0,187715;259,56
11,1;0,188019;260,442
11,12;0,189086;261,314
11,14;0,189364;262,201
11,16;0,189825;263,079
11,18;0,191072;263,964
11,2;0,191901;264,844
11,22;0,193085;265,74
11,24;0,193369;266,614
11,26;0,194056;267,5
11,28;0,194341;268,378
11,3;0,195373;269,263
11,32;0,195651;270,143
11,34;0,196117;271,032
11,36;0,196944;271,921
11,38;0,198411;272,815
11,4;0,198728;273,711
11,42;0,199751;274,608
11,44;0,200162;275,502
11,46;0,20121;276,416
11,48;0,201643;277,318
11,5;0,202749;278,217
11,52;0,202787;279,102
11,54;0,203251;279,991
11,56;0,204144;280,851
11,58;0,205502;281,713
11,6;0,205996;282,579
11,62;0,206746;283,453
11,64;0,207298;284,322
11,66;0,208454;285,196
11,68;0,20847;286,07
11,7;0,209711;286,939
11,72;0,209728;287,795
11,74;0,210486;288,659
11,76;0,211088;289,527
11,78;0,212608;290,386
11,8;0,212652;291,25
11,82;0,214088;292,123
11,84;0,214199;292,993
11,86;0,215429;293,853
11,88;0,215494;294,728
11,9;0,216265;295,596
11,92;0,216707;296,479
11,94;0,217477;297,364
11,96;0,217815;298,265
11,98;0,219439;299,173
12;0,219527;300,086
12,02;0,220691;301,002
12,04;0,221601;301,916
12,06;0,222149;302,842
12,08;0,222381;303,766
12,1;0,223217;304,695
12,12;0,223473;305,625
12,14;0,224752;306,561
12,16;0,225086;307,478
12,18;0,225995;308,411
12,2;0,22704;309,357
12,22;0,228255;310,304
12,24;0,228693;311,263
12,26;0,229978;312,232
12,28;0,229996;313,185
12,3;0,231242;314,149
12,32;0,231505;315,104
12,34;0,232507;316,054
12,36;0,232722;317,004
12,38;0,233742;317,96
12,4;0,234876;318,904
12,42;0,23595;319,854
12,44;0,236226;320,816
12,46;0,237339;321,781
12,48;0,238012;322,744
12,5;0,238842;323,703
12,52;0,239138;324,66
12,54;0,239856;325,608
12,56;0,240313;326,563
12,58;0,241945;327,524
12,6;0,242263;328,486
12,62;0,24365;329,457
12,64;0,243792;330,42
12,66;0,244703;331,38
12,68;0,245301;332,34
12,7;0,246471;333,302
12,72;0,2466;334,261
12,74;0,247321;335,228
12,76;0,248177;336,201
12,78;0,249405;337,178
12,8;0,24985;338,165
12,82;0,251104;339,154
12,84;0,25153;340,156
12,86;0,252584;341,148
12,88;0,25357;342,143
12,9;0,254215;343,136
12,92;0,254485;344,122
12,94;0,255926;345,087
12,96;0,25618;346,058
12,98;0,25762;347,026
13;0,257771;347,99
13,02;0,258913;348,961
13,04;0,259687;349,952
13,06;0,260655;350,943
13,08;0,261031;351,935
13,1;0,261889;352,93
13,12;0,262412;353,916
13,14;0,263735;354,895
13,16;0,263875;355,876
13,18;0,265096;356,86
13,2;0,265835;357,853
13,22;0,266682;358,855
13,24;0,267714;359,858
13,26;0,268684;360,881
13,28;0,268848;361,901
13,3;0,270002;362,928
13,32;0,27058;363,958
13,34;0,271488;364,998
13,36;0,271882;366,027
13,38;0,27313;367,059
13,4;0,273687;368,083
13,42;0,274888;369,101
13,44;0,275554;370,123
13,46;0,276388;371,145
13,48;0,277122;372,173
13,5;0,278209;373,219
13,52;0,278527;374,26
13,54;0,279506;375,305
13,56;0,28007;376,346
13,58;0,28159;377,402
13,6;0,282072;378,437
13,62;0,28328;379,474
13,64;0,283952;380,496
13,66;0,284953;381,515
13,68;0,28586;382,523
13,7;0,286684;383,529
13,72;0,286813;384,562
13,74;0,288095;385,609
13,76;0,288559;386,666
13,78;0,289614;387,728
13,8;0,290717;388,814
13,82;0,291729;389,898
13,84;0,292277;390,986
13,86;0,293698;392,067
13,88;0,294195;393,134
13,9;0,295141;394,189
13,92;0,295524;395,239
13,94;0,29641;396,272
13,96;0,296982;397,319
13,98;0,298195;398,375
14;0,298662;399,423
14,02;0,299971;400,469
14,04;0,300901;401,508
14,06;0,302111;402,543
14,08;0,302354;403,569
14,1;0,303503;404,601
14,12;0,303993;405,647
14,14;0,305053;406,699
14,16;0,30565;407,749
14,18;0,306751;408,818
14,2;0,307487;409,887
14,22;0,308936;410,962
14,24;0,309456;412,047
14,26;0,310926;413,12
14,28;0,311192;414,19
14,3;0,312471;415,275
14,32;0,312902;416,354
14,34;0,314372;417,432
14,36;0,314541;418,515
14,38;0,315849;419,603
14,4;0,316801;420,674
14,42;0,317621;421,756
14,44;0,318447;422,849
14,46;0,319743;423,944
14,48;0,320307;425,046
14,5;0,321492;426,142
14,52;0,322184;427,215
14,54;0,323328;428,292
14,56;0,323698;429,362
14,58;0,325163;430,42
14,6;0,325774;431,502
14,62;0,32714;432,598
14,64;0,327998;433,695
14,66;0,329163;434,809
14,68;0,329962;435,939
14,7;0,331226;437,063
14,72;0,331666;438,18
14,74;0,332839;439,285
14,76;0,333573;440,377
14,78;0,334652;441,457
14,8;0,335415;442,529
14,82;0,336748;443,595
14,84;0,337578;444,661
14,86;0,338967;445,735
14,88;0,339616;446,808
14,9;0,340953;447,896
14,92;0,341441;448,985
14,94;0,342464;450,077
14,96;0,343179;451,169
14,98;0,34456;452,276
15;0,345212;453,374
15,02;0,34637;454,469
15,04;0,347438;455,56
15,06;0,34861;456,676
15,08;0,349728;457,788
15,1;0,350765;458,9
15,12;0,351484;460,035
15,14;0,352559;461,184
15,16;0,353647;462,314
15,18;0,354699;463,445
15,2;0,355458;464,573
15,22;0,356995;465,691
15,24;0,357932;466,811
15,26;0,359132;467,935
15,28;0,360178;469,047
15,3;0,361216;470,152
15,32;0,362111;471,262
15,34;0,363639;472,365
15,36;0,364187;473,471
15,38;0,365463;474,594
15,4;0,366258;475,748
15,42;0,367579;476,912
15,44;0,368932;478,086
15,46;0,370133;479,274
15,48;0,370918;480,461
15,5;0,372179;481,628
15,52;0,373342;482,79
15,54;0,374543;483,932
15,56;0,375391;485,048
15,58;0,376636;486,162
15,6;0,377648;487,277
15,62;0,379222;488,393
15,64;0,380269;489,523
15,66;0,38145;490,674
15,68;0,382682;491,804
15,7;0,383908;492,947
15,72;0,384942;494,083
15,74;0,386111;495,215
15,76;0,386943;496,348
15,78;0,388316;497,51
15,8;0,389548;498,673
15,82;0,391076;499,841
15,84;0,391917;501,021
15,86;0,393557;502,198
15,88;0,394733;503,366
15,9;0,39607;504,533
15,92;0,396984;505,691
15,94;0,398443;506,846
15,96;0,399462;508,004
15,98;0,401113;509,154
16;0,402405;510,284
16,02;0,4036;511,419
16,04;0,404877;512,547
16,06;0,406605;513,672
16,08;0,407671;514,816
16,1;0,409255;515,982
16,12;0,410221;517,176
16,14;0,411784;518,393
16,16;0,413095;519,6
16,18;0,414508;520,799
16,2;0,415691;521,977
16,22;0,417624;523,133
16,24;0,418594;524,273
16,26;0,420754;525,432
16,28;0,421925;526,599
16,3;0,423568;527,784
16,32;0,424718;528,976
16,34;0,426829;530,159
16,36;0,42747;531,325
16,38;0,429279;532,47
16,4;0,430382;533,623
16,42;0,432168;534,766
16,44;0,433584;535,921
16,46;0,435432;537,083
16,48;0,436691;538,266
16,5;0,438618;539,445
16,52;0,440171;540,621
16,54;0,442225;541,786
16,56;0,443294;542,957
16,58;0,444948;544,117
16,6;0,446412;545,259
16,62;0,448532;546,404
16,64;0,449998;547,557
16,66;0,452045;548,694
16,68;0,453816;549,821
16,7;0,455706;550,96
16,72;0,457292;552,116
16,74;0,4595;553,281
16,76;0,460471;554,454
16,78;0,462668;555,656
16,8;0,464523;556,863
16,82;0,46649;558,046
16,84;0,468434;559,223
16,86;0,470825;560,388
16,88;0,472473;561,533
16,9;0,474755;562,672
16,92;0,476521;563,813
16,94;0,47882;564,951
16,96;0,480203;566,082
16,98;0,482736;567,202
17;0,484636;568,314
17,02;0,486846;569,417
17,04;0,488536;570,519
17,06;0,491154;571,636
17,08;0,493257;572,763
17,1;0,495779;573,908
17,12;0,497524;575,071
17,14;0,500171;576,229
17,16;0,502052;577,39
17,18;0,504691;578,526
17,2;0,50666;579,631
17,22;0,509287;580,725
17,24;0,51141;581,819
17,26;0,514459;582,891
17,28;0,516608;583,975
17,3;0,519248;585,075
17,32;0,521569;586,17
17,34;0,524345;587,264
17,36;0,526526;588,373
17,38;0,529449;589,479
17,4;0,531903;590,577
17,42;0,534896;591,669
17,44;0,537636;592,759
17,46;0,540901;593,83
17,48;0,543588;594,899
17,5;0,546662;595,97
17,52;0,549288;597,034
17,54;0,552574;598,081
17,56;0,555149;599,121
17,58;0,558531;600,149
17,6;0,561159;601,158
17,62;0,564513;602,167
17,64;0,567562;603,179
17,66;0,571174;604,209
17,68;0,574101;605,248
17,7;0,577967;606,277
17,72;0,581246;607,282
17,74;0,585028;608,273
17,76;0,588183;609,226
17,78;0,591877;610,164
17,8;0,59518;611,116
17,82;0,59925;612,083
17,84;0,602716;613,043
17,86;0,606656;614,002
17,88;0,610389;614,951
17,9;0,614578;615,885
17,92;0,618246;616,816
17,94;0,622577;617,745
17,96;0,626375;618,669
17,98;0,630799;619,602
18;0,63495;620,527
18,02;0,639906;621,444
18,04;0,644149;622,348
18,06;0,648808;623,244
18,08;0,653235;624,121
18,1;0,658285;624,977
18,12;0,662733;625,803
18,14;0,667666;626,621
18,16;0,671969;627,44
18,18;0,677317;628,253
18,2;0,682192;629,068
18,22;0,687357;629,898
18,24;0,692175;630,718
18,26;0,697976;631,519
18,28;0,70314;632,299
18,3;0,708975;633,058
18,32;0,713962;633,787
18,34;0,71974;634,508
18,36;0,724873;635,22
18,38;0,731102;635,929
18,4;0,736304;636,631
18,42;0,742177;637,323
18,44;0,747801;638,004
18,46;0,754044;638,676
18,48;0,75986;639,332
18,5;0,7664;639,988
18,52;0,772346;640,649
18,54;0,779357;641,31
18,56;0,785333;641,954
18,58;0,792507;642,597
18,6;0,79845;643,224
18,62;0,8056;643,836
18,64;0,812048;644,413
18,66;0,819374;644,991
18,68;0,825907;645,559
18,7;0,833056;646,119
18,72;0,839764;646,675
18,74;0,847655;647,245
18,76;0,854434;647,795
18,78;0,862242;648,328
18,8;0,869302;648,842
18,82;0,877675;649,342
18,84;0,884778;649,836
18,86;0,893032;650,34
18,88;0,900463;650,846
18,9;0,908668;651,355
18,92;0,916404;651,84
18,94;0,92472;652,305
18,96;0,932174;652,753
18,98;0,940598;653,205
19;0,948564;653,654
19,02;0,957602;654,122
19,04;0,965481;654,578
19,06;0,974634;655,027
19,08;0,983155;655,447
19,1;0,991852;655,857
19,12;1,00039;656,246
19,14;1,00926;656,637
19,16;1,01778;657,029
19,18;1,02698;657,433
19,2;1,03549;657,834
19,22;1,04449;658,239
19,24;1,05294;658,639
19,26;1,06214;659,026
19,28;1,07119;659,396
19,3;1,08063;659,755
19,32;1,08938;660,105
19,34;1,09905;660,462
19,36;1,10772;660,821
19,38;1,11762;661,179
19,4;1,1264;661,528
19,42;1,13579;661,864
19,44;1,14454;662,186
19,46;1,15415;662,513
19,48;1,16319;662,838
19,5;1,17256;663,184
19,52;1,18171;663,533
19,54;1,19176;663,879
19,56;1,2011;664,204
19,58;1,21087;664,519
19,6;1,21992;664,823
19,62;1,22978;665,132
19,64;1,23911;665,442
19,66;1,24916;665,758
19,68;1,25844;666,085
19,7;1,26827;666,402
19,72;1,2777;666,715
19,74;1,28763;667,017
19,76;1,29704;667,314
19,78;1,30701;667,605
19,8;1,31632;667,892
19,82;1,32647;668,177
19,84;1,3359;668,474
19,86;1,34552;668,768
19,88;1,35512;669,038
19,9;1,36508;669,305
19,92;1,37459;669,571
19,94;1,38461;669,836
19,96;1,39376;670,118
19,98;1,40332;670,419
20;1,41281;670,735
20,02;1,42297;671,055
20,04;1,43231;671,347
20,06;1,44216;671,612
20,08;1,45162;671,871
20,1;1,46178;672,124
20,12;1,47111;672,377
20,14;1,48103;672,654
20,16;1,49049;672,942
20,18;1,50036;673,236
20,2;1,51;673,524
20,22;1,51965;673,805
20,24;1,52931;674,072
20,26;1,53933;674,347
20,28;1,54906;674,619
20,3;1,55921;674,896
20,32;1,56876;675,167
20,34;1,57882;675,433
20,36;1,58814;675,699
20,38;1,59821;675,943
20,4;1,60794;676,181
20,42;1,61747;676,426
20,44;1,62669;676,677
20,46;1,63652;676,934
20,48;1,6459;677,22
20,5;1,65581;677,516
20,52;1,66511;677,786
20,54;1,67515;678,058
20,56;1,68471;678,31
20,58;1,695;678,548
20,6;1,70414;678,789
20,62;1,71384;679,05
20,64;1,7231;679,313
20,66;1,73334;679,573
20,68;1,74265;679,84
20,7;1,75225;680,087
20,72;1,76125;680,343
20,74;1,77164;680,605
20,76;1,78087;680,87
20,78;1,79115;681,14
20,8;1,80071;681,409
20,82;1,81041;681,662
20,84;1,81991;681,904
20,86;1,82983;682,153
20,88;1,83885;682,383
20,9;1,84883;682,609
20,92;1,85795;682,838
20,94;1,86799;683,098
20,96;1,87734;683,342
20,98;1,88687;683,602
21;1,89611;683,867
21,02;1,90597;684,138
21,04;1,91516;684,367
21,06;1,92507;684,613
21,08;1,93401;684,853
21,1;1,94342;685,1
21,12;1,95277;685,341
21,14;1,96268;685,591
21,16;1,97149;685,832
21,18;1,98091;686,072
21,2;1,99022;686,305
21,22;2,00003;686,545
21,24;2,009;686,8
21,26;2,01882;687,063
21,28;2,02787;687,328
21,3;2,03791;687,591
21,32;2,04729;687,836
21,34;2,05679;688,071
21,36;2,06572;688,29
21,38;2,07568;688,503
21,4;2,08488;688,725
21,42;2,0943;688,954
21,44;2,10333;689,19
21,46;2,11256;689,444
21,48;2,12173;689,699
21,5;2,1314;689,948
21,52;2,14046;690,192
21,54;2,15021;690,441
21,56;2,15935;690,676
21,58;2,16916;690,916
21,6;2,17797;691,164
21,62;2,18736;691,422
21,64;2,19599;691,646
21,66;2,20576;691,874
21,68;2,21471;692,094
21,7;2,22417;692,314
21,72;2,23297;692,533
21,74;2,24268;692,789
21,76;2,25174;693,049
21,78;2,26158;693,311
21,8;2,27071;693,555
21,82;2,28009;693,802
21,84;2,28912;694,023
21,86;2,2989;694,248
21,88;2,30793;694,462
21,9;2,31699;694,699
21,92;2,32622;694,925
21,94;2,33546;695,152
21,96;2,34455;695,381
21,98;2,3537;695,616
22;2,36288;695,851
22,02;2,37221;696,09
22,04;2,38174;696,332
22,06;2,39118;696,568
22,08;2,39991;696,81
22,1;2,40935;697,034
22,12;2,41801;697,255
22,14;2,42771;697,468
22,16;2,43626;697,675
22,18;2,44545;697,892
22,2;2,45441;698,119
22,22;2,46398;698,357
22,24;2,47278;698,61
22,26;2,48224;698,867
22,28;2,49118;699,106
22,3;2,50078;699,34
22,32;2,50995;699,558
22,34;2,51941;699,779
22,36;2,52806;699,994
22,38;2,53761;700,215
22,4;2,54665;700,435
22,42;2,55607;700,67
22,44;2,56489;700,885
22,46;2,5741;701,103
22,48;2,58294;701,315
22,5;2,59238;701,544
22,52;2,60166;701,763
22,54;2,61075;702,003
22,56;2,61985;702,237
22,58;2,62942;702,473
22,6;2,63832;702,696
22,62;2,64754;702,908
22,64;2,65648;703,106
22,66;2,66584;703,319
22,68;2,67447;703,538
22,7;2,68392;703,756
22,72;2,69251;703,993
22,74;2,70195;704,237
22,76;2,71104;704,475
22,78;2,72071;704,697
22,8;2,72972;704,908
22,82;2,73912;705,123
22,84;2,748;705,348
22,86;2,75757;705,571
22,88;2,76639;705,806
22,9;2,776;706,05
22,92;2,7842;706,262
22,94;2,79399;706,465
22,96;2,80267;706,673
22,98;2,81199;706,88
23;2,82109;707,09
23,02;2,83044;707,318
23,04;2,8394;707,546
23,06;2,84926;707,762
23,08;2,85794;707,965
23,1;2,8673;708,167
23,12;2,87584;708,37
23,14;2,88547;708,572
23,16;2,89409;708,783
23,18;2,90324;709,013
23,2;2,91163;709,247
23,22;2,92108;709,48
23,24;2,92991;709,712
23,26;2,93928;709,928
23,28;2,94793;710,135
23,3;2,95754;710,336
23,32;2,96645;710,54
23,34;2,97602;710,755
23,36;2,98453;710,988
23,38;2,99391;711,202
23,4;3,00284;711,42
23,42;3,01236;711,635
23,44;3,02096;711,838
23,46;3,03006;712,036
23,48;3,03867;712,261
23,5;3,04807;712,494
23,52;3,05717;712,711
23,54;3,06649;712,923
23,56;3,0752;713,121
23,58;3,08448;713,307
23,6;3,0934;713,491
23,62;3,10269;713,693
23,64;3,11129;713,887
23,66;3,12067;714,105
23,68;3,12913;714,336
23,7;3,13872;714,554
23,72;3,14718;714,772
23,74;3,15644;715,011
23,76;3,16493;715,223
23,78;3,17469;715,427
23,8;3,18343;715,632
23,82;3,19277;715,836
23,84;3,20144;716,029
23,86;3,21081;716,233
23,88;3,21949;716,418
23,9;3,22884;716,598
23,92;3,23724;716,779
23,94;3,24609;716,976
23,96;3,25482;717,178
23,98;3,26441;717,407
24;3,27292;717,654
24,02;3,28187;717,885
24,04;3,2911;718,089
24,06;3,30054;718,282
24,08;3,30919;718,453
24,1;3,31799;718,628
24,12;3,32668;718,809
24,14;3,33585;719,009
24,16;3,34455;719,214
24,18;3,35359;719,42
24,2;3,36198;719,617
24,22;3,37084;719,831
24,24;3,37969;720,03
24,26;3,38878;720,24
24,28;3,39739;720,459
24,3;3,40629;720,676
24,32;3,41518;720,871
24,34;3,4243;721,077
24,36;3,43288;721,264
24,38;3,44193;721,455
24,4;3,45058;721,646
24,42;3,46;721,841
24,44;3,46833;722,034
24,46;3,4777;722,254
24,48;3,48596;722,471
24,5;3,49516;722,687
24,52;3,50414;722,891
24,54;3,51332;723,09
24,56;3,52158;723,259
24,58;3,53095;723,435
24,6;3,53954;723,612
24,62;3,54889;723,804
24,64;3,55729;723,993
24,66;3,56625;724,194
24,68;3,57479;724,378
24,7;3,58403;724,558
24,72;3,59258;724,742
24,74;3,60134;724,945
24,76;3,60979;725,141
24,78;3,61933;725,352
24,8;3,6277;725,568
24,82;3,63696;725,764
24,84;3,64553;725,947
24,86;3,65406;726,128
24,88;3,66307;726,29
24,9;3,67196;726,461
24,92;3,68041;726,653
24,94;3,68933;726,856
24,96;3,69757;727,071
24,98;3,7068;727,296
25;3,71528;727,513
25,02;3,72464;727,716
25,04;3,73338;727,901
25,06;3,74247;728,087
25,08;3,75132;728,273
25,1;3,7602;728,456
25,12;3,76887;728,636
25,14;3,77785;728,819
25,16;3,78681;728,996
25,18;3,79558;729,166
25,2;3,80386;729,34
25,22;3,81307;729,526
25,24;3,82166;729,727
25,26;3,83069;729,927
25,28;3,8393;730,13
25,3;3,84823;730,32
25,32;3,85675;730,492
25,34;3,8659;730,655
25,36;3,87434;730,805
25,38;3,88326;730,952
25,4;3,8917;731,115
25,42;3,90078;731,291
25,44;3,90933;731,465
25,46;3,91824;731,663
25,48;3,92683;731,874
25,5;3,93592;732,077
25,52;3,94449;732,278
25,54;3,95385;732,47
25,56;3,96229;732,658
25,58;3,97105;732,838
25,6;3,97986;733,015
25,62;3,98903;733,188
25,64;3,99757;733,356
25,66;4,00662;733,513
25,68;4,01484;733,672
25,7;4,02396;733,846
25,72;4,03272;734,026
25,74;4,04155;734,233
25,76;4,04986;734,436
25,78;4,05953;734,633
25,8;4,06825;734,801
25,82;4,07741;734,971
25,84;4,08581;735,134
25,86;4,0947;735,305
25,88;4,10338;735,477
25,9;4,11278;735,666
25,92;4,12125;735,849
25,94;4,13005;736,027
25,96;4,13852;736,214
25,98;4,14783;736,405
26;4,15662;736,59
26,02;4,16553;736,775
26,04;4,17444;736,965
26,06;4,18363;737,152
26,08;4,19273;737,337
26,1;4,20172;737,523
26,12;4,21047;737,693
26,14;4,21961;737,853
26,16;4,22832;737,997
26,18;4,23729;738,155
26,2;4,24611;738,315
26,22;4,25486;738,503
26,24;4,26352;738,7
26,26;4,27305;738,901
26,28;4,28174;739,084
26,3;4,29058;739,255
26,32;4,29947;739,415
26,34;4,30855;739,578
26,36;4,31738;739,737
26,38;4,3266;739,897
26,4;4,33482;740,062
26,42;4,34394;740,233
26,44;4,35246;740,382
26,46;4,36133;740,55
26,48;4,3701;740,728
26,5;4,37904;740,917
26,52;4,38781;741,1
26,54;4,39717;741,298
26,56;4,4061;741,481
26,58;4,41474;741,655
26,6;4,42354;741,826
26,62;4,43252;741,987
26,64;4,44145;742,136
26,66;4,45013;742,294
26,68;4,45901;742,46
26,7;4,46796;742,625
26,72;4,47675;742,804
26,74;4,48573;742,987
26,76;4,49464;743,161
26,78;4,50369;743,322
26,8;4,51273;743,477
26,82;4,52178;743,633
26,84;4,53074;743,799
26,86;4,5392;743,973
26,88;4,54863;744,145
26,9;4,55714;744,311
26,92;4,56608;744,463
26,94;4,57466;744,614
26,96;4,58324;744,763
26,98;4,59231;744,926
27;4,60131;745,103
27,02;4,61045;745,284
27,04;4,61939;745,458
27,06;4,62846;745,628
27,08;4,63761;745,79
27,1;4,64686;745,945
27,12;4,65563;746,091
27,14;4,66489;746,249
27,16;4,67383;746,413
27,18;4,68263;746,577
27,2;4,6917;746,746
27,22;4,70059;746,933
27,24;4,70937;747,099
27,26;4,71869;747,259
27,28;4,72771;747,416
27,3;4,73683;747,567
27,32;4,7458;747,725
27,34;4,75486;747,896
27,36;4,76381;748,061
27,38;4,77309;748,22
27,4;4,78192;748,373
27,42;4,79119;748,52
27,44;4,79996;748,665
27,46;4,80917;748,825
27,48;4,81824;748,996
27,5;4,82735;749,179
27,52;4,83652;749,351
27,54;4,84589;749,511
27,56;4,85485;749,667
27,58;4,86418;749,81
27,6;4,87318;749,943
27,62;4,88229;750,081
27,64;4,89174;750,238
27,66;4,90091;750,41
27,68;4,90982;750,579
27,7;4,91909;750,75
27,72;4,9281;750,92
27,74;4,93738;751,087
27,76;4,94655;751,23
27,78;4,95602;751,388
27,8;4,9652;751,555
27,82;4,97436;751,721
27,84;4,98361;751,878
27,86;4,9929;752,036
27,88;5,00191;752,172
27,9;5,01135;752,293
27,92;5,02047;752,423
27,94;5,02919;752,567
27,96;5,03825;752,711
27,98;5,04746;752,892
28;5,0563;753,081
28,02;5,06568;753,246
28,04;5,07485;753,398
28,06;5,08392;753,545
28,08;5,093;753,67
28,1;5,10224;753,798
28,12;5,11115;753,941
28,14;5,1203;754,09
28,16;5,12936;754,244
28,18;5,13829;754,402
28,2;5,14746;754,554
28,22;5,15647;754,71
28,24;5,16555;754,867
28,26;5,1747;755,019
28,28;5,184;755,178
28,3;5,19306;755,339
28,32;5,2021;755,485
28,34;5,21126;755,631
28,36;5,22029;755,765
28,38;5,22943;755,887
28,4;5,23861;756,015
28,42;5,24736;756,157
28,44;5,25628;756,296
28,46;5,2656;756,47
28,48;5,27449;756,642
28,5;5,28359;756,797
28,52;5,29277;756,935
28,54;5,30193;757,071
28,56;5,31099;757,196
28,58;5,31987;757,324
28,6;5,3289;757,471
28,62;5,33767;757,626
28,64;5,34697;757,783
28,66;5,35594;757,937
28,68;5,3649;758,091
28,7;5,37386;758,238
28,72;5,38298;758,388
28,74;5,39228;758,545
28,76;5,40138;758,695
28,78;5,41086;758,862
28,8;5,41994;759,016
28,82;5,42922;759,159
28,84;5,43851;759,282
28,86;5,44765;759,41
28,88;5,45673;759,522
28,9;5,46584;759,638
28,92;5,47516;759,776
28,94;5,48415;759,936
28,96;5,49319;760,095
28,98;5,50244;760,264
29;5,51167;760,429
29,02;5,52102;760,577
29,04;5,53039;760,706
29,06;5,53937;760,848
29,08;5,54865;760,992
29,1;5,55775;761,128
29,12;5,56699;761,265
29,14;5,57621;761,402
29,16;5,58533;761,518
29,18;5,59452;761,636
29,2;5,60366;761,766
29,22;5,61283;761,919
29,24;5,62205;762,086
29,26;5,63136;762,264
29,28;5,64076;762,419
29,3;5,65015;762,57
29,32;5,65934;762,7
29,34;5,66885;762,811
29,36;5,67804;762,916
29,38;5,68751;763,036
29,4;5,69653;763,154
29,42;5,70594;763,288
29,44;5,71488;763,432
29,46;5,7244;763,586
29,48;5,73357;763,745
29,5;5,74303;763,896
29,52;5,75255;764,025
29,54;5,76174;764,156
29,56;5,77138;764,282
29,58;5,78059;764,408
29,6;5,78964;764,534
29,62;5,7989;764,668
29,64;5,808;764,784
29,66;5,81692;764,895
29,68;5,82611;765,011
29,7;5,83516;765,144
29,72;5,84446;765,292
29,74;5,85382;765,449
29,76;5,86305;765,609
29,78;5,87251;765,754
29,8;5,88152;765,887
29,82;5,89105;766,005
29,84;5,90016;766,133
29,86;5,9093;766,267
29,88;5,91871;766,403
29,9;5,92798;766,531
29,92;5,93708;766,664
29,94;5,94632;766,797
29,96;5,95549;766,93
29,98;5,96455;767,06
30;5,97396;767,202
30,02;5,98331;767,345
30,04;5,99276;767,473
30,06;6,00187;767,604
30,08;6,01123;767,737
30,1;6,02045;767,868
30,12;6,0295;767,978
30,14;6,03892;768,099
30,16;6,04784;768,213
30,18;6,05719;768,34
30,2;6,06638;768,467
30,22;6,07567;768,629
30,24;6,08474;768,776
30,26;6,09447;768,918
30,28;6,10374;769,042
30,3;6,11317;769,162
30,32;6,12267;769,273
30,34;6,13191;769,388
30,36;6,14111;769,497
30,38;6,15072;769,625
30,4;6,15965;769,749
30,42;6,16875;769,87
30,44;6,17788;769,988
30,46;6,18721;770,12
30,48;6,19656;770,243
30,5;6,20614;770,386
30,52;6,2157;770,514
30,54;6,22506;770,65
30,56;6,23456;770,777
30,58;6,24383;770,92
30,6;6,2529;771,033
30,62;6,26218;771,154
30,64;6,27159;771,271
30,66;6,28064;771,391
30,68;6,29001;771,494
30,7;6,29909;771,613
30,72;6,30834;771,727
30,74;6,3177;771,839
30,76;6,32724;771,946
30,78;6,33639;772,05
30,8;6,34565;772,162
30,82;6,35518;772,288
30,84;6,36431;772,419
30,86;6,37341;772,556
30,88;6,38293;772,685
30,9;6,39216;772,808
30,92;6,40145;772,912
30,94;6,41077;773,024
30,96;6,41994;773,139
30,98;6,42946;773,279
31;6,43872;773,418
31,02;6,44834;773,559
31,04;6,45775;773,679
31,06;6,46702;773,789
31,08;6,47629;773,884
31,1;6,48534;773,974
31,12;6,49505;774,068
31,14;6,50423;774,179
31,16;6,51344;774,289
31,18;6,52262;774,409
31,2;6,53233;774,541
31,22;6,54142;774,68
31,24;6,55069;774,803
31,26;6,56003;774,926
31,28;6,56961;775,037
31,3;6,57887;775,142
31,32;6,58836;775,263
31,34;6,59767;775,396
31,36;6,6071;775,521
31,38;6,61667;775,643
31,4;6,62599;775,766
31,42;6,63519;775,873
31,44;6,64425;775,985
31,46;6,65387;776,114
31,48;6,66296;776,263
31,5;6,6726;776,399
31,52;6,68182;776,519
31,54;6,69155;776,625
31,56;6,70088;776,722
31,58;6,7103;776,808
31,6;6,7198;776,889
31,62;6,72923;776,991
31,64;6,73853;777,109
31,66;6,74753;777,237
31,68;6,75721;777,352
31,7;6,76594;777,48
31,72;6,77532;777,598
31,74;6,78467;777,713
31,76;6,7943;777,817
31,78;6,80375;777,939
31,8;6,81305;778,062
31,82;6,82246;778,188
31,84;6,83223;778,294
31,86;6,84112;778,398
31,88;6,85069;778,489
31,9;6,85974;778,581
31,92;6,86918;778,679
31,94;6,87854;778,797
31,96;6,88778;778,928
31,98;6,89725;779,067
32;6,90711;779,202
32,02;6,91653;779,328
32,04;6,9262;779,421
32,06;6,93573;779,516
32,08;6,94489;779,61
32,1;6,95422;779,705
32,12;6,96397;779,805
32,14;6,97287;779,928
32,16;6,98257;780,038
32,18;6,99205;780,152
32,2;7,00133;780,267
32,22;7,01088;780,388
32,24;7,02041;780,512
32,26;7,02974;780,639
32,28;7,03919;780,754
32,3;7,04884;780,863
32,32;7,05819;780,961
32,34;7,06767;781,051
32,36;7,0771;781,123
32,38;7,08671;781,203
32,4;7,09634;781,294
32,42;7,1057;781,391
32,44;7,11489;781,506
32,46;7,12417;781,661
32,48;7,13387;781,796
32,5;7,14313;781,925
32,52;7,15272;782,036
32,54;7,16233;782,126
32,56;7,172;782,202
32,58;7,18136;782,301
32,6;7,19135;782,398
32,62;7,20054;782,507
32,64;7,21001;782,619
32,66;7,21986;782,718
32,68;7,22902;782,817
32,7;7,23853;782,913
32,72;7,24827;783,022
32,74;7,25731;783,139
32,76;7,26714;783,267
32,78;7,27693;783,389
32,8;7,28667;783,511
32,82;7,29557;783,606
32,84;7,30571;783,694
32,86;7,31478;783,768
32,88;7,32479;783,839
32,9;7,33408;783,921
32,92;7,34341;784,031
32,94;7,35332;784,154
32,96;7,36285;784,29
32,98;7,37225;784,423
33;7,38242;784,55
33,02;7,392;784,656
33,04;7,40188;784,747
33,06;7,41184;784,84
33,08;7,4207;784,94
33,1;7,43057;785,045
33,12;7,44005;785,135
33,14;7,44947;785,238
33,16;7,45913;785,328
33,18;7,4688;785,415
33,2;7,4784;785,503
33,22;7,48828;785,623
33,24;7,49782;785,739
33,26;7,50719;785,872
33,28;7,51686;785,981
33,3;7,52617;786,077
33,32;7,53578;786,158
33,34;7,54527;786,237
33,36;7,55474;786,307
33,38;7,56444;786,393
33,4;7,57433;786,489
33,42;7,58378;786,587
33,44;7,59312;786,696
33,46;7,60291;786,814
33,48;7,61243;786,926
33,5;7,62175;787,032
33,52;7,63144;787,146
33,54;7,64089;787,247
33,56;7,65043;787,338
33,58;7,66038;787,44
33,6;7,6702;787,534
33,62;7,67978;787,611
33,64;7,68951;787,675
33,66;7,69932;787,761
33,68;7,70876;787,844
33,7;7,71819;787,957
33,72;7,72783;788,081
33,74;7,73725;788,209
33,76;7,74713;788,306
33,78;7,75708;788,404
33,8;7,76629;788,472
33,82;7,77614;788,54
33,84;7,78579;788,627
33,86;7,79519;788,716
33,88;7,80495;788,801
33,9;7,81426;788,893
33,92;7,82376;788,995
33,94;7,8333;789,088
33,96;7,84293;789,189
33,98;7,85271;789,295
34;7,86278;789,406
34,02;7,87264;789,506
34,04;7,88257;789,609
34,06;7,89276;789,726
34,08;7,90217;789,83
34,1;7,91185;789,918
34,12;7,92157;789,997
34,14;7,93103;790,08
34,16;7,9405;790,143
34,18;7,95031;790,233
34,2;7,95998;790,338
34,22;7,96981;790,45
34,24;7,97989;790,55
34,26;7,98974;790,659
34,28;7,99944;790,735
34,3;8,00961;790,81
34,32;8,01915;790,898
34,34;8,02884;790,982
34,36;8,03865;791,049
34,38;8,0483;791,152
34,4;8,05778;791,242
34,42;8,06769;791,32
34,44;8,07729;791,397
34,46;8,08689;791,497
34,48;8,09699;791,589
34,5;8,10644;791,695
34,52;8,1163;791,804
34,54;8,12632;791,92
34,56;8,13569;792,016
34,58;8,14539;792,106
34,6;8,15525;792,19
34,62;8,16519;792,259
34,64;8,17503;792,336
34,66;8,18497;792,423
34,68;8,19467;792,508
34,7;8,20439;792,612
34,72;8,21411;792,72
34,74;8,22373;792,815
34,76;8,23369;792,895
34,78;8,24327;792,975
34,8;8,25334;793,04
34,82;8,26309;793,124
34,84;8,2724;793,203
34,86;8,28286;793,298
34,88;8,2924;793,375
34,9;8,30153;793,448
34,92;8,3112;793,513
34,94;8,32092;793,6
34,96;8,33032;793,697
34,98;8,34028;793,809
35;8,35019;793,93
35,02;8,35982;794,031
35,04;8,37003;794,116
35,06;8,37965;794,188
35,08;8,38956;794,267
35,1;8,39924;794,334
35,12;8,40899;794,407
35,14;8,41842;794,481
35,16;8,42819;794,57
35,18;8,43798;794,652
35,2;8,44761;794,735
35,22;8,45747;794,818
35,24;8,46742;794,91
35,26;8,47746;794,991
35,28;8,48716;795,049
35,3;8,49695;795,127
35,32;8,50657;795,226
35,34;8,51653;795,326
35,36;8,52627;795,402
35,38;8,53592;795,491
35,4;8,54566;795,568
35,42;8,5555;795,641
35,44;8,56542;795,709
35,46;8,575;795,803
35,48;8,58467;795,912
35,5;8,59488;796,019
35,52;8,60471;796,1
35,54;8,61445;796,176
35,56;8,62415;796,248
35,58;8,63398;796,323
35,6;8,64402;796,392
35,62;8,65408;796,484
35,64;8,66408;796,587
35,66;8,67428;796,691
35,68;8,68433;796,776
35,7;8,69429;796,875
35,72;8,70408;796,968
35,74;8,71424;797,051
35,76;8,72454;797,129
35,78;8,73435;797,214
35,8;8,74461;797,284
35,82;8,75477;797,36
35,84;8,76462;797,428
35,86;8,77502;797,488
35,88;8,78524;797,538
35,9;8,79472;797,597
35,92;8,80465;797,666
35,94;8,81485;797,737
35,96;8,82453;797,839
35,98;8,83454;797,951
36;8,84474;798,045
36,02;8,85464;798,111
36,04;8,86462;798,176
36,06;8,87504;798,23
36,08;8,88499;798,287
36,1;8,89476;798,369
36,12;8,90474;798,444
36,14;8,91477;798,537
36,16;8,92456;798,611
36,18;8,93441;798,699
36,2;8,94431;798,783
36,22;8,95434;798,88
36,24;8,96476;798,967
36,26;8,97512;799,059
36,28;8,98482;799,138
36,3;8,99526;799,204
36,32;9,00554;799,267
36,34;9,01526;799,326
36,36;9,02515;799,376
36,38;9,03537;799,434
36,4;9,04531;799,49
36,42;9,05519;799,57
36,44;9,06529;799,664
36,46;9,07538;799,78
36,48;9,08556;799,876
36,5;9,09563;799,969
36,52;9,10568;800,034
36,54;9,11584;800,085
36,56;9,12527;800,128
36,58;9,13542;800,193
36,6;9,14529;800,267
36,62;9,15542;800,355
36,64;9,16557;800,434
36,66;9,17571;800,513
36,68;9,18553;800,579
36,7;9,19572;800,647
36,72;9,20563;800,723
36,74;9,21551;800,82
36,76;9,22585;800,901
36,78;9,23579;800,993
36,8;9,24589;801,066
36,82;9,25575;801,126
36,84;9,26598;801,164
36,86;9,27592;801,213
36,88;9,28597;801,25
36,9;9,29583;801,314
36,92;9,30571;801,397
36,94;9,31545;801,492
36,96;9,32585;801,592
36,98;9,33577;801,697
37;9,34582;801,781
37,02;9,35588;801,845
37,04;9,36633;801,909
37,06;9,37601;801,976
37,08;9,38623;802,034
37,1;9,39642;802,098
37,12;9,40636;802,158
37,14;9,41611;802,223
37,16;9,42619;802,29
37,18;9,4359;802,352
37,2;9,44586;802,439
37,22;9,45601;802,543
37,24;9,46638;802,644
37,26;9,47659;802,73
37,28;9,48699;802,814
37,3;9,49717;802,875
37,32;9,50723;802,93
37,34;9,5173;802,974
37,36;9,52789;803,019
37,38;9,53761;803,077
37,4;9,54762;803,147
37,42;9,55794;803,217
37,44;9,56833;803,286
37,46;9,57801;803,369
37,48;9,5887;803,443
37,5;9,59887;803,511
37,52;9,60918;803,571
37,54;9,61925;803,639
37,56;9,62949;803,7
37,58;9,6391;803,775
37,6;9,64917;803,828
37,62;9,65917;803,869
37,64;9,66928;803,918
37,66;9,67902;803,969
37,68;9,68919;804,017
37,7;9,69958;804,097
37,72;9,70981;804,201
37,74;9,72009;804,29
37,76;9,73019;804,374
37,78;9,74044;804,447
37,8;9,75043;804,514
37,82;9,76068;804,575
37,84;9,77072;804,639
37,86;9,78068;804,697
37,88;9,79093;804,759
37,9;9,80094;804,815
37,92;9,81099;804,867
37,94;9,82087;804,931
37,96;9,83085;804,999
37,98;9,84106;805,069
38;9,85142;805,136
38,02;9,8615;805,204
38,04;9,87177;805,276
38,06;9,88193;805,348
38,08;9,89227;805,414
38,1;9,9022;805,469
38,12;9,91251;805,52
38,14;9,92225;805,555
38,16;9,93238;805,61
38,18;9,94262;805,677
38,2;9,95207;805,763
38,22;9,96238;805,851
38,24;9,97288;805,942
38,26;9,98324;806,015
38,28;9,99359;806,079
38,3;10,004;806,133
38,32;10,0145;806,192
38,34;10,0247;806,253
38,36;10,0351;806,304
38,38;10,0451;806,358
38,4;10,0552;806,421
38,42;10,0656;806,477
38,44;10,0759;806,535
38,46;10,086;806,615
38,48;10,097;806,701
38,5;10,1071;806,781
38,52;10,1177;806,859
38,54;10,128;806,923
38,56;10,1384;806,985
38,58;10,1482;807,037
38,6;10,1586;807,065
38,62;10,1689;807,097
38,64;10,1787;807,147
38,66;10,189;807,193
38,68;10,1993;807,238
38,7;10,2094;807,328
38,72;10,22;807,407
38,74;10,2304;807,477
38,76;10,2404;807,54
38,78;10,2508;807,604
38,8;10,2614;807,656
38,82;10,2717;807,719
38,84;10,2819;807,791
38,86;10,2923;807,852
38,88;10,3029;807,92
38,9;10,3132;807,964
38,92;10,3234;808,01
38,94;10,3336;808,07
38,96;10,3441;808,14
38,98;10,3545;808,212
39;10,3649;808,286
39,02;10,3754;808,347
39,04;10,3856;808,388
39,06;10,3962;808,427
39,08;10,4065;808,45
39,1;10,4169;808,489
39,12;10,4274;808,534
39,14;10,4377;808,579
39,16;10,4477;808,642
39,18;10,4579;808,721
39,2;10,4681;808,792
39,22;10,478;808,86
39,24;10,4884;808,929
39,26;10,499;808,977
39,28;10,5096;809,017
39,3;10,5198;809,078
39,32;10,5302;809,146
39,34;10,5405;809,211
39,36;10,5511;809,269
39,38;10,5612;809,323
39,4;10,5715;809,357
39,42;10,5818;809,402
39,44;10,5922;809,464
39,46;10,6025;809,539
39,48;10,6132;809,614
39,5;10,6237;809,682
39,52;10,6346;809,731
39,54;10,6448;809,757
39,56;10,6555;809,786
39,58;10,6655;809,825
39,6;10,6758;809,868
39,62;10,6865;809,924
39,64;10,6965;809,998
39,66;10,7067;810,067
39,68;10,7175;810,133
39,7;10,7275;810,202
39,72;10,7382;810,267
39,74;10,7489;810,319
39,76;10,7596;810,37
39,78;10,7699;810,424
39,8;10,7804;810,472
39,82;10,7912;810,516
39,84;10,8015;810,565
39,86;10,8119;810,603
39,88;10,8222;810,627
39,9;10,8326;810,676
39,92;10,8432;810,735
39,94;10,8535;810,799
39,96;10,8642;810,88
39,98;10,8746;810,972
40;10,8854;811,032
40,02;10,8963;811,078
40,04;10,9065;811,122
40,06;10,917;811,15
40,08;10,9281;811,181
40,1;10,9388;811,225
40,12;10,9492;811,262
40,14;10,9598;811,303
40,16;10,9702;811,348
40,18;10,9807;811,399
40,2;10,9914;811,443
40,22;11,0018;811,512
40,24;11,012;811,569
40,26;11,0226;811,635
40,28;11,0336;811,68
40,3;11,0435;811,737
40,32;11,0544;811,779
40,34;11,0649;811,82
40,36;11,0755;811,844
40,38;11,0861;811,886
40,4;11,0965;811,929
40,42;11,1069;811,993
40,44;11,1175;812,081
40,46;11,1281;812,177
40,48;11,1388;812,251
40,5;11,1494;812,312
40,52;11,1602;812,347
40,54;11,171;812,365
40,56;11,1817;812,393
40,58;11,1924;812,433
40,6;11,2027;812,467
40,62;11,2135;812,515
40,64;11,224;812,555
40,66;11,2349;812,594
40,68;11,2453;812,636
40,7;11,2559;812,698
40,72;11,2671;812,749
40,74;11,2777;812,804
40,76;11,2883;812,848
40,78;11,2991;812,887
40,8;11,3094;812,909
40,82;11,3201;812,932
40,84;11,3308;812,946
40,86;11,3414;812,956
40,88;11,3521;812,986
40,9;11,3627;813,043
40,92;11,3733;813,111
40,94;11,3841;813,191
40,96;11,3946;813,279
40,98;11,4053;813,358
41;11,4163;813,4
41,02;11,4269;813,447
41,04;11,4376;813,488
41,06;11,4482;813,536
41,08;11,459;813,574
41,1;11,47;813,621
41,12;11,4805;813,649
41,14;11,4914;813,681
41,16;11,5018;813,706
41,18;11,5127;813,742
41,2;11,5239;813,803
41,22;11,5342;813,879
41,24;11,5452;813,951
41,26;11,5559;814,017
41,28;11,5669;814,056
41,3;11,5776;814,084
41,32;11,5883;814,101
41,34;11,5989;814,117
41,36;11,61;814,138
41,38;11,6206;814,183
41,4;11,6311;814,223
41,42;11,6418;814,275
41,44;11,6525;814,33
41,46;11,6631;814,383
41,48;11,6739;814,425
41,5;11,6848;814,469
41,52;11,6957;814,509
41,54;11,7063;814,54
41,56;11,7174;814,587
41,58;11,7282;814,633
41,6;11,739;814,661
41,62;11,7496;814,68
41,64;11,7605;814,709
41,66;11,771;814,73
41,68;11,7819;814,774
41,7;11,7924;814,848
41,72;11,8032;814,921
41,74;11,8143;814,984
41,76;11,8252;815,026
41,78;11,8358;815,053
41,8;11,8464;815,065
41,82;11,8572;815,09
41,84;11,8684;815,113
41,86;11,879;815,163
41,88;11,89;815,206
41,9;11,9006;815,246
41,92;11,9114;815,281
41,94;11,9224;815,334
41,96;11,9333;815,379
41,98;11,9441;815,428
42;11,9556;815,479
42,02;11,9661;815,536
42,04;11,9772;815,583
42,06;11,9878;815,615
42,08;11,9987;815,645
42,1;12,0095;815,663
42,12;12,0204;815,672
42,14;12,0313;815,688
42,16;12,0424;815,72
42,18;12,0532;815,771
42,2;12,0643;815,833
42,22;12,0754;815,892
42,24;12,0862;815,945
42,26;12,0973;815,988
42,28;12,1081;816,011
42,3;12,1189;816,04
42,32;12,1298;816,066
42,34;12,1403;816,096
42,36;12,1513;816,129
42,38;12,162;816,168
42,4;12,1731;816,193
42,42;12,1837;816,233
42,44;12,1945;816,278
42,46;12,2055;816,335
42,48;12,2168;816,394
42,5;12,2278;816,464
42,52;12,2393;816,522
42,54;12,2502;816,564
42,56;12,2613;816,604
42,58;12,2727;816,632
42,6;12,2839;816,642
42,62;12,2946;816,67
42,64;12,3057;816,704
42,66;12,3168;816,732
42,68;12,3277;816,775
42,7;12,3384;816,837
42,72;12,3496;816,879
42,74;12,3611;816,914
42,76;12,3722;816,941
42,78;12,3838;816,966
42,8;12,395;816,983
42,82;12,4058;817,021
42,84;12,4176;817,057
42,86;12,4283;817,085
42,88;12,439;817,108
42,9;12,4499;817,133
42,92;12,4609;817,149
42,94;12,472;817,188
42,96;12,4832;817,24
42,98;12,494;817,285
43;12,5053;817,323
43,02;12,5165;817,353
43,04;12,5275;817,367
43,06;12,5384;817,386
43,08;12,5496;817,402
43,1;12,5607;817,42
43,12;12,572;817,451
43,14;12,5829;817,501
43,16;12,5944;817,538
43,18;12,6053;817,592
43,2;12,6168;817,645
43,22;12,6281;817,697
43,24;12,6393;817,704
43,26;12,6506;817,717
43,28;12,6616;817,74
43,3;12,6725;817,782
43,32;12,6838;817,803
43,34;12,6951;817,845
43,36;12,7061;817,872
43,38;12,7173;817,895
43,4;12,7286;817,9
43,42;12,7395;817,934
43,44;12,7507;817,985
43,46;12,7618;818,053
43,48;12,7732;818,114
43,5;12,7844;818,158
43,52;12,7954;818,183
43,54;12,8064;818,193
43,56;12,8179;818,209
43,58;12,8286;818,222
43,6;12,8403;818,245
43,62;12,8514;818,297
43,64;12,8625;818,346
43,66;12,8735;818,382
43,68;12,8852;818,409
43,7;12,8958;818,449
43,72;12,9073;818,465
43,74;12,9185;818,483
43,76;12,9299;818,507
43,78;12,9411;818,54
43,8;12,9527;818,57
43,82;12,9636;818,602
43,84;12,9751;818,614
43,86;12,9863;818,62
43,88;12,9977;818,633
43,9;13,0079;818,664
43,92;13,0198;818,688
43,94;13,0309;818,759
43,96;13,0419;818,837
43,98;13,0534;818,896
44;13,0649;818,914
44,02;13,0761;818,939
44,04;13,0875;818,944
44,06;13,0986;818,95
44,08;13,1098;818,97
44,1;13,1209;819,009
44,12;13,1324;819,046
44,14;13,1435;819,072
44,16;13,1551;819,096
44,18;13,1661;819,125
44,2;13,1775;819,153
44,22;13,189;819,182
44,24;13,2008;819,224
44,26;13,2118;819,256
44,28;13,2234;819,282
44,3;13,2344;819,304
44,32;13,246;819,307
44,34;13,2572;819,298
44,36;13,2687;819,308
44,38;13,2794;819,319
44,4;13,2915;819,338
44,42;13,3025;819,393
44,44;13,3142;819,459
44,46;13,3257;819,5
44,48;13,3369;819,528
44,5;13,3485;819,546
44,52;13,3601;819,535
44,54;13,371;819,528
44,56;13,3827;819,545
44,58;13,3937;819,576
44,6;13,4059;819,606
44,62;13,417;819,65
44,64;13,4285;819,679
44,66;13,4399;819,702
44,68;13,4515;819,724
44,7;13,4625;819,769
44,72;13,4745;819,799
44,74;13,4857;819,844
44,76;13,4976;819,873
44,78;13,5091;819,899
44,8;13,521;819,909
44,82;13,5323;819,919
44,84;13,5441;819,918
44,86;13,5556;819,921
44,88;13,5671;819,939
44,9;13,5784;819,966
44,92;13,59;819,997
44,94;13,6014;820,031
44,96;13,6134;820,076
44,98;13,625;820,103
45;13,6368;820,114
45,02;13,6485;820,124
45,04;13,6601;820,146
45,06;13,6714;820,161
45,08;13,6833;820,171
45,1;13,6944;820,195
45,12;13,7061;820,208
45,14;13,7174;820,22
45,16;13,7288;820,24
45,18;13,74;820,272
45,2;13,752;820,318
45,22;13,7642;820,388
45,24;13,7757;820,434
45,26;13,7878;820,47
45,28;13,7999;820,481
45,3;13,8111;820,482
45,32;13,8232;820,468
45,34;13,8349;820,466
45,36;13,8465;820,474
45,38;13,8577;820,509
45,4;13,8697;820,535
45,42;13,8811;820,565
45,44;13,8929;820,596
45,46;13,9044;820,631
45,48;13,9167;820,646
45,5;13,9281;820,67
45,52;13,9399;820,679
45,54;13,9517;820,699
45,56;13,9632;820,715
45,58;13,975;820,724
45,6;13,987;820,72
45,62;13,9984;820,72
45,64;14,0102;820,714
45,66;14,0218;820,727
45,68;14,0339;820,765
45,7;14,0455;820,821
45,72;14,0573;820,873
45,74;14,069;820,916
45,76;14,0811;820,934
45,78;14,093;820,937
45,8;14,1047;820,926
45,82;14,1165;820,93
45,84;14,1285;820,938
45,86;14,1402;820,942
45,88;14,1525;820,952
45,9;14,1639;820,966
45,92;14,1756;820,97
45,94;14,1874;820,986
45,96;14,1998;821,009
45,98;14,211;821,023
46;14,2233;821,039
46,02;14,2353;821,064
46,04;14,2469;821,087
46,06;14,2587;821,099
46,08;14,2704;821,094
46,1;14,282;821,09
46,12;14,2938;821,092
46,14;14,3053;821,091
46,16;14,3172;821,114
46,18;14,3286;821,156
46,2;14,341;821,198
46,22;14,3527;821,238
46,24;14,3648;821,274
46,26;14,3767;821,29
46,28;14,3889;821,314
46,3;14,4003;821,338
46,32;14,4125;821,35
46,34;14,4244;821,353
46,36;14,4363;821,367
46,38;14,4479;821,368
46,4;14,46;821,372
46,42;14,4716;821,377
46,44;14,4838;821,385
46,46;14,496;821,41
46,48;14,5081;821,444
46,5;14,5201;821,472
46,52;14,5325;821,485
46,54;14,5444;821,505
46,56;14,5561;821,496
46,58;14,5681;821,483
46,6;14,5801;821,46
46,62;14,5917;821,458
46,64;14,6036;821,46
46,66;14,6152;821,48
46,68;14,6274;821,517
46,7;14,6391;821,567
46,72;14,6514;821,604
46,74;14,6634;821,626
46,76;14,6756;821,631
46,78;14,6875;821,646
46,8;14,7001;821,66
46,82;14,7121;821,684
46,84;14,7238;821,704
46,86;14,7365;821,711
46,88;14,7486;821,701
46,9;14,76;821,698
46,92;14,7721;821,708
46,94;14,7842;821,729
46,96;14,7964;821,77
46,98;14,8088;821,796
47;14,8215;821,798
47,02;14,8331;821,788
47,04;14,8457;821,782
47,06;14,8581;821,768
47,08;14,8702;821,756
47,1;14,8823;821,754
47,12;14,8945;821,755
47,14;14,9065;821,765
47,16;14,9184;821,779
47,18;14,9308;821,807
47,2;14,9427;821,835
47,22;14,9549;821,857
47,24;14,9679;821,858
47,26;14,98;821,863
47,28;14,9923;821,881
47,3;15,0049;821,899
47,32;15,017;821,915
47,34;15,0294;821,924
47,36;15,042;821,936
47,38;15,0536;821,928
47,4;15,0658;821,929
47,42;15,0785;821,952
47,44;15,0905;821,99
47,46;15,1027;822,026
47,48;15,1153;822,046
47,5;15,1279;822,055
47,52;15,14;822,036
47,54;15,1524;822,011
47,56;15,1647;821,991
47,58;15,1766;821,987
47,6;15,1893;821,99
47,62;15,2014;822,011
47,64;15,2137;822,03
47,66;15,2255;822,043
47,68;15,2382;822,056
47,7;15,2506;822,065
47,72;15,263;822,066
47,74;15,2754;822,069
47,76;15,288;822,072
47,78;15,2998;822,074
47,8;15,3126;822,074
47,82;15,3246;822,069
47,84;15,3369;822,052
47,86;15,3495;822,038
47,88;15,3618;822,034
47,9;15,3741;822,043
47,92;15,3865;822,051
47,94;15,3989;822,097
47,96;15,4112;822,131
47,98;15,424;822,141
48;15,4365;822,132
48,02;15,4485;822,13
48,04;15,4615;822,115
48,06;15,4742;822,102
48,08;15,4868;822,108
48,1;15,4991;822,111
48,12;15,5117;822,109
48,14;15,5235;822,1
48,16;15,5365;822,096
48,18;15,5487;822,1
48,2;15,561;822,114
48,22;15,5733;822,14
48,24;15,5862;822,161
48,26;15,5986;822,175
48,28;15,611;822,185
48,3;15,6236;822,193
48,32;15,6364;822,182
48,34;15,6487;822,166
48,36;15,6618;822,161
48,38;15,6737;822,156
48,4;15,6863;822,17
48,42;15,6989;822,211
48,44;15,7117;822,251
48,46;15,7244;822,28
48,48;15,7372;822,286
48,5;15,7497;822,26
48,52;15,763;822,216
48,54;15,775;822,196
48,56;15,7881;822,182
48,58;15,8004;822,172
48,6;15,8131;822,174
48,62;15,8257;822,173
48,64;15,8386;822,153
48,66;15,8509;822,139
48,68;15,8636;822,149
48,7;15,8762;822,168
48,72;15,8893;822,185
48,74;15,9018;822,214
48,76;15,9147;822,228
48,78;15,9269;822,215
48,8;15,9402;822,203
48,82;15,9524;822,18
48,84;15,9654;822,143
48,86;15,9778;822,135
48,88;15,9906;822,144
48,9;16,0032;822,158
48,92;16,0161;822,197
48,94;16,0285;822,243
48,96;16,0416;822,258
48,98;16,0546;822,258
49;16,0675;822,25
49,02;16,0802;822,241
49,04;16,0931;822,223
49,06;16,1059;822,22
49,08;16,119;822,208
49,1;16,1317;822,2
49,12;16,1441;822,179
49,14;16,1571;822,158
49,16;16,1697;822,146
49,18;16,1826;822,169
49,2;16,1956;822,182
49,22;16,2083;822,21
49,24;16,2212;822,222
49,26;16,2342;822,213
49,28;16,2471;822,179
49,3;16,2594;822,155
49,32;16,2727;822,107
49,34;16,2854;822,079
49,36;16,2984;822,06
49,38;16,3113;822,056
49,4;16,3238;822,056
49,42;16,3365;822,068
49,44;16,35;822,08
49,46;16,3627;822,102
49,48;16,3757;822,113
49,5;16,3891;822,116
49,52;16,402;822,121
49,54;16,4147;822,132
49,56;16,4282;822,118
49,58;16,4408;822,097
49,6;16,4536;822,065
49,62;16,4668;822,041
49,64;16,4801;822,005
49,66;16,4928;822,003
49,68;16,5057;822,024
49,7;16,5191;822,047
49,72;16,5324;822,054
49,74;16,5455;822,051
49,76;16,5587;822,026
49,78;16,5716;821,988
49,8;16,5848;821,964
49,82;16,5978;821,947
49,84;16,6112;821,939
49,86;16,6235;821,932
49,88;16,6367;821,934
49,9;16,6496;821,936
49,92;16,6629;821,93
49,94;16,6755;821,936
49,96;16,689;821,936
49,98;16,7023;821,932
50;16,7157;821,912
50,02;16,7283;821,917
50,04;16,7419;821,898
50,06;16,7546;821,884
50,08;16,768;821,851
50,1;16,7811;821,825
50,12;16,7944;821,787
50,14;16,8072;821,77
50,16;16,8207;821,765
50,18;16,8337;821,786
50,2;16,847;821,798
50,22;16,8602;821,802
50,24;16,8735;821,785
50,26;16,8867;821,754
50,28;16,9002;821,717
50,3;16,9126;821,688
50,32;16,9261;821,659
50,34;16,9388;821,646
50,36;16,9525;821,639
50,38;16,9651;821,623
50,4;16,9785;821,604
50,42;16,9916;821,596
50,44;17,0051;821,594
50,46;17,0182;821,605
50,48;17,0321;821,613
50,5;17,0449;821,617
50,52;17,0588;821,612
50,54;17,0718;821,595
50,56;17,0851;821,55
50,58;17,0981;821,508
50,6;17,1116;821,481
50,62;17,1242;821,459
50,64;17,1377;821,445
50,66;17,1507;821,45
50,68;17,1642;821,463
50,7;17,1775;821,464
50,72;17,1917;821,46
50,74;17,2048;821,45
50,76;17,2187;821,438
50,78;17,232;821,426
50,8;17,2456;821,419
50,82;17,2589;821,408
50,84;17,2725;821,376
50,86;17,2855;821,345
50,88;17,2987;821,304
50,9;17,3117;821,272
50,92;17,3256;821,258
50,94;17,3384;821,274
50,96;17,3522;821,282
50,98;17,3656;821,287
51;17,3795;821,265
51,02;17,3927;821,236
51,04;17,4061;821,197
51,06;17,4196;821,166
51,08;17,4329;821,131
51,1;17,4463;821,12
51,12;17,4603;821,098
51,14;17,473;821,084
51,16;17,4869;821,072
51,18;17,5002;821,063
51,2;17,5139;821,049
51,22;17,5274;821,035
51,24;17,5409;820,991
51,26;17,5545;820,959
51,28;17,568;820,942
51,3;17,5813;820,914
51,32;17,5954;820,872
51,34;17,6083;820,855
51,36;17,6223;820,819
51,38;17,6355;820,772
51,4;17,6492;820,735
51,42;17,6622;820,739
51,44;17,676;820,736
51,46;17,6898;820,734
51,48;17,7037;820,724
51,5;17,7167;820,705
51,52;17,7307;820,663
51,54;17,7436;820,622
51,56;17,7579;820,585
51,58;17,7714;820,556
51,6;17,7847;820,536
51,62;17,7985;820,529
51,64;17,8121;820,516
51,66;17,8256;820,496
51,68;17,8396;820,474
51,7;17,8529;820,453
51,72;17,867;820,414
51,74;17,8808;820,387
51,76;17,8948;820,351
51,78;17,9081;820,318
51,8;17,9221;820,279
51,82;17,9356;820,231
51,84;17,9494;820,183
51,86;17,9624;820,14
51,88;17,9761;820,11
51,9;17,9891;820,088
51,92;18,0029;820,088
51,94;18,0164;820,102
51,96;18,0301;820,12
51,98;18,0439;820,106
52;18,0579;820,068
52,02;18,0716;820,027
52,04;18,0853;819,967
52,06;18,0987;819,923
52,08;18,1127;819,895
52,1;18,1264;819,886
52,12;18,1406;819,869
52,14;18,1537;819,85
52,16;18,1678;819,822
52,18;18,1809;819,802
52,2;18,1956;819,78
52,22;18,2089;819,756
52,24;18,2226;819,734
52,26;18,2362;819,715
52,28;18,2506;819,679
52,3;18,264;819,636
52,32;18,2784;819,573
52,34;18,292;819,518
52,36;18,3059;819,459
52,38;18,3197;819,424
52,4;18,3336;819,41
52,42;18,3473;819,424
52,44;18,3613;819,403
52,46;18,3751;819,379
52,48;18,3897;819,328
52,5;18,403;819,254
52,52;18,417;819,183
52,54;18,431;819,139
52,56;18,4448;819,105
52,58;18,4584;819,074
52,6;18,4728;819,056
52,62;18,4863;819,025
52,64;18,5006;818,992
52,66;18,5142;818,956
52,68;18,5285;818,937
52,7;18,542;818,906
52,72;18,5566;818,884
52,74;18,5707;818,855
52,76;18,585;818,802
52,78;18,5989;818,745
52,8;18,6131;818,686
52,82;18,6267;818,614
52,84;18,6414;818,546
52,86;18,6552;818,506
52,88;18,6688;818,47
52,9;18,6826;818,449
52,92;18,6973;818,44
52,94;18,7107;818,429
52,96;18,7253;818,394
52,98;18,7396;818,338
53;18,7538;818,281
53,02;18,7674;818,222
53,04;18,7817;818,166
53,06;18,7955;818,117
53,08;18,81;818,074
53,1;18,8236;818,019
53,12;18,838;817,977
53,14;18,8515;817,93
53,16;18,8656;817,892
53,18;18,8798;817,877
53,2;18,8941;817,881
53,22;18,9083;817,857
53,24;18,9228;817,814
53,26;18,9365;817,759
53,28;18,9511;817,673
53,3;18,9649;817,583
53,32;18,9792;817,494
53,34;18,9929;817,428
53,36;19,0072;817,374
53,38;19,0206;817,327
53,4;19,0351;817,273
53,42;19,0491;817,228
53,44;19,0632;817,182
53,46;19,0772;817,125
53,48;19,092;817,065
53,5;19,1059;816,999
53,52;19,1201;816,949
53,54;19,1342;816,897
53,56;19,1487;816,835
53,58;19,1626;816,77
53,6;19,1768;816,703
53,62;19,1907;816,63
53,64;19,2048;816,558
53,66;19,2189;816,516
53,68;19,2335;816,49
53,7;19,2474;816,468
53,72;19,262;816,438
53,74;19,2769;816,396
53,76;19,2913;816,341
53,78;19,3051;816,265
53,8;19,3203;816,194
53,82;19,3341;816,119
53,84;19,3484;816,043
53,86;19,3628;815,964
53,88;19,3772;815,896
53,9;19,3906;815,829
53,92;19,4052;815,767
53,94;19,4196;815,71
53,96;19,4342;815,647
53,98;19,4482;815,59
54;19,463;815,52
54,02;19,4767;815,434
54,04;19,4915;815,343
54,06;19,5054;815,243
54,08;19,5197;815,133
54,1;19,5336;815,03
54,12;19,548;814,943
54,14;19,5619;814,871
54,16;19,5762;814,82
54,18;19,5904;814,766
54,2;19,605;814,711
54,22;19,6191;814,644
54,24;19,634;814,553
54,26;19,6477;814,465
54,28;19,6623;814,385
54,3;19,6765;814,288
54,32;19,6909;814,199
54,34;19,7048;814,116
54,36;19,7191;814,025
54,38;19,7332;813,926
54,4;19,7474;813,84
54,42;19,7616;813,763
54,44;19,7765;813,697
54,46;19,7905;813,635
54,48;19,8057;813,567
54,5;19,8199;813,491
54,52;19,8347;813,39
54,54;19,8488;813,294
54,56;19,8635;813,178
54,58;19,8775;813,064
54,6;19,892;812,967
54,62;19,9062;812,883
54,64;19,9204;812,794
54,66;19,9346;812,722
54,68;19,9493;812,653
54,7;19,9638;812,572
54,72;19,9783;812,48
54,74;19,9931;812,375
54,76;20,0077;812,264
54,78;20,0221;812,164
54,8;20,037;812,061
54,82;20,0511;811,957
54,84;20,0661;811,84
54,86;20,0802;811,716
54,88;20,0944;811,584
54,9;20,1087;811,464
54,92;20,1233;811,361
54,94;20,1376;811,263
54,96;20,1526;811,169
54,98;20,167;811,057
55;20,1817;810,931
55,02;20,1962;810,786
55,04;20,2108;810,634
55,06;20,2249;810,483
55,08;20,2398;810,344
55,1;20,254;810,209
55,12;20,2684;810,09
55,14;20,2825;809,984
55,16;20,2974;809,866
55,18;20,3114;809,755
55,2;20,326;809,631
55,22;20,3407;809,498
55,24;20,3554;809,353
55,26;20,37;809,227
55,28;20,3846;809,095
55,3;20,3988;808,962
55,32;20,4137;808,816
55,34;20,4282;808,664
55,36;20,4425;808,504
55,38;20,4572;808,345
55,4;20,4718;808,195
55,42;20,4863;808,065
55,44;20,5012;807,938
55,46;20,5155;807,783
55,48;20,5308;807,615
55,5;20,5451;807,433
55,52;20,56;807,24
55,54;20,5744;807,063
55,56;20,5897;806,884
55,58;20,6041;806,725
55,6;20,619;806,57
55,62;20,6334;806,409
55,64;20,6478;806,234
55,66;20,6622;806,082
55,68;20,6771;805,917
55,7;20,6916;805,751
55,72;20,7066;805,585
55,74;20,7217;805,419
55,76;20,7362;805,233
55,78;20,7512;805,053
55,8;20,7662;804,848
55,82;20,7811;804,635
55,84;20,7959;804,421
55,86;20,8104;804,228
55,88;20,8251;804,034
55,9;20,8397;803,867
55,92;20,8545;803,715
55,94;20,8693;803,554
55,96;20,8847;803,371
55,98;20,8993;803,143
56;20,9144;802,91
56,02;20,9293;802,655
56,04;20,9442;802,41
56,06;20,9588;802,183
56,08;20,9734;801,967
56,1;20,988;801,751
56,12;21,0025;801,536
56,14;21,0172;801,321
56,16;21,032;801,098
56,18;21,0464;800,879
56,2;21,0617;800,66
56,22;21,0763;800,432
56,24;21,0914;800,196
56,26;21,106;799,942
56,28;21,1211;799,706
56,3;21,1354;799,438
56,32;21,1505;799,18
56,34;21,1653;798,92
56,36;21,1799;798,676
56,38;21,1946;798,439
56,4;21,2096;798,233
56,42;21,2242;798,016
56,44;21,2394;797,792
56,46;21,2544;797,537
56,48;21,2694;797,24
56,5;21,2841;796,926
56,52;21,2992;796,629
56,54;21,3139;796,339
56,56;21,329;796,051
56,58;21,3438;795,773
56,6;21,3589;795,488
56,62;21,3735;795,186
56,64;21,3885;794,88
56,66;21,403;794,591
56,68;21,418;794,317
56,7;21,433;794,038
56,72;21,4481;793,749
56,74;21,4628;793,451
56,76;21,4781;793,128
56,78;21,4929;792,786
56,8;21,508;792,448
56,82;21,523;792,103
56,84;21,5382;791,758
56,86;21,5527;791,435
56,88;21,5682;791,116
56,9;21,5826;790,803
56,92;21,598;790,497
56,94;21,6128;790,174
56,96;21,6282;789,822
56,98;21,6433;789,458
57;21,6586;789,078
57,02;21,6736;788,698
57,04;21,6889;788,317
57,06;21,704;787,928
57,08;21,7192;787,529
57,1;21,734;787,123
57,12;21,7494;786,712
57,14;21,7644;786,301
57,16;21,7801;785,908
57,18;21,7948;785,509
57,2;21,8107;785,116
57,22;21,8256;784,69
57,24;21,8412;784,25
57,26;21,8562;783,79
57,28;21,8713;783,332
57,3;21,886;782,854
57,32;21,9015;782,392
57,34;21,9163;781,941
57,36;21,9315;781,488
57,38;21,9464;781,032
57,4;21,9618;780,575
57,42;21,977;780,107
57,44;21,9926;779,605
57,46;22,0081;779,074
57,48;22,0238;778,521
57,5;22,0392;777,958
57,52;22,0547;777,393
57,54;22,0696;776,826
57,56;22,0854;776,254
57,58;22,1007;775,662
57,6;22,1162;775,05
57,62;22,1318;774,402
57,64;22,1477;773,746
57,66;22,1632;773,074
57,68;22,1796;772,363
57,7;22,1954;771,552
57,72;22,2122;770,615
57,74;22,2284;769,448
