"s";"%";"MPa"
0;0;5,67391
0,02;8,95842e-005;5,67476
0,04;-0,000592915;5,68006
0,06;-0,00139254;5,68162
0,08;-0,00245593;5,67951
0,1;-0,0028073;5,67832
0,12;-0,00276815;5,67184
0,14;-0,00240981;5,67524
0,16;-0,00144728;5,6683
0,18;-0,000382226;5,66672
0,2;1,09492e-005;5,66528
0,22;0,000136367;5,66885
0,24;-0,000228274;5,67504
0,26;-0,00127707;5,67706
0,28;-0,00165134;5,67428
0,3;-0,00243968;5,67199
0,32;-0,00252926;5,67303
0,34;-0,00225918;5,66652
0,36;-0,0018388;5,66899
0,38;-0,000319185;5,67684
0,4;-9,22385e-005;5,6809
0,42;8,85888e-005;5,6815
0,44;-3,98152e-006;5,68714
0,46;-0,000670554;5,704
0,48;-0,00139486;5,72206
0,5;-0,00214836;5,74314
0,52;-0,00230397;5,76619
0,54;-0,00224027;5,81034
0,56;-0,00129565;5,86033
0,58;-0,000585283;5,92548
0,6;1,62579e-005;6,01972
0,62;0,000592251;6,15126
0,64;0,000472474;6,2922
0,66;0,000296955;6,44646
0,68;-0,000794313;6,63139
0,7;-0,00161849;6,82038
0,72;-0,00145558;7,02169
0,74;-0,00129997;7,23507
0,76;-0,000552436;7,46982
0,78;0,000381894;7,70674
0,8;0,00138822;7,96995
0,82;0,00200304;8,23678
0,84;0,00205778;8,52761
0,86;0,0019317;8,83358
0,88;0,000887547;9,14876
0,9;0,000809244;9,47299
0,92;0,000759143;9,8227
0,94;0,000822847;10,1741
0,96;0,0013431;10,5446
0,98;0,00239721;10,9325
1;0,00331362;11,349
1,02;0,00427449;11,7563
1,04;0,00440555;12,1945
1,06;0,00412552;12,6362
1,08;0,00386174;13,0926
1,1;0,00370547;13,5462
1,12;0,00343605;14,0127
1,14;0,00366068;14,4773
1,16;0,00400342;14,933
1,18;0,00550744;15,3968
1,2;0,00630905;15,86
1,22;0,00731405;16,3498
1,24;0,00765447;16,8334
1,26;0,00768832;17,3234
1,28;0,00727026;17,8126
1,3;0,007039;18,3019
1,32;0,00699288;18,7767
1,34;0,00707715;19,2679
1,36;0,00756057;19,7621
1,38;0,00875569;20,2468
1,4;0,00984099;20,7482
1,42;0,0107305;21,2518
1,44;0,0113785;21,7393
1,46;0,0114787;22,2413
1,48;0,0112289;22,7464
1,5;0,0108875;23,2498
1,52;0,0107743;23,7496
1,54;0,0108188;24,2478
1,56;0,0112272;24,7467
1,58;0,0122054;25,2471
1,6;0,0130985;25,7374
1,62;0,014287;26,2303
1,64;0,0149347;26,7255
1,66;0,0150767;27,2231
1,68;0,0150067;27,7222
1,7;0,0146331;28,2298
1,72;0,0143146;28,7389
1,74;0,0145793;29,2438
1,76;0,0146576;29,7462
1,78;0,01588;30,247
1,8;0,0166982;30,7458
1,82;0,0175061;31,2455
1,84;0,0185688;31,7508
1,86;0,018878;32,2507
1,88;0,0184507;32,7773
1,9;0,0182878;33,2945
1,92;0,0183087;33,8093
1,94;0,0184155;34,3225
1,96;0,0187652;34,8448
1,98;0,0198668;35,3443
2;0,02033;35,8596
2,02;0,0214972;36,3632
2,04;0,0229966;36,8786
2,06;0,0226977;37,3772
2,08;0,0228098;37,8758
2,1;0,0227889;38,3664
2,12;0,0223479;38,8719
2,14;0,0224223;39,3687
2,16;0,0225709;39,8726
2,18;0,0231373;40,3767
2,2;0,0241353;40,8808
2,22;0,0253507;41,3773
2,24;0,0259871;41,886
2,26;0,0266268;42,3873
2,28;0,0265693;42,8944
2,3;0,0265763;43,3901
2,32;0,0263935;43,8978
2,34;0,0263587;44,3956
2,36;0,026494;44,8947
2,38;0,0268112;45,3834
2,4;0,0277973;45,8762
2,42;0,0286344;46,3633
2,44;0,029443;46,8511
2,46;0,030305;47,3395
2,48;0,0303677;47,8295
2,5;0,0303223;48,3246
2,52;0,0302732;48,8115
2,54;0,0299138;49,2975
2,56;0,0301229;49,7822
2,58;0,0305094;50,2673
2,6;0,0312161;50,7447
2,62;0,0325101;51,2058
2,64;0,0330105;51,6753
2,66;0,0338608;52,1516
2,68;0,0339053;52,6307
2,7;0,0341389;53,0923
2,72;0,0339421;53,5809
2,74;0,0334673;54,0611
2,76;0,0337032;54,5317
2,78;0,0343788;54,9977
2,8;0,034623;55,473
2,82;0,0357093;55,9451
2,84;0,036405;56,413
2,86;0,0369578;56,8788
2,88;0,0376662;57,3425
2,9;0,0369492;57,8097
2,92;0,0370129;58,273
2,94;0,037356;58,7313
2,96;0,0370613;59,1942
2,98;0,0372896;59,6489
3;0,0378951;60,1205
3,02;0,0386184;60,583
3,04;0,0395106;61,0498
3,06;0,0400704;61,5156
3,08;0,040799;61,9992
3,1;0,0408179;62,4694
3,12;0,0408116;62,9425
3,14;0,0407193;63,4122
3,16;0,040582;63,8831
3,18;0,0406746;64,3452
3,2;0,0411454;64,8153
3,22;0,0419739;65,2756
3,24;0,0426816;65,7514
3,26;0,0439225;66,2099
3,28;0,0442297;66,6689
3,3;0,0443628;67,1376
3,32;0,044395;67,615
3,34;0,0441733;68,0662
3,36;0,043876;68,5401
3,38;0,0441421;69,0136
3,4;0,0445698;69,4659
3,42;0,0451521;69,9211
3,44;0,0460433;70,3869
3,46;0,0468346;70,8435
3,48;0,0472743;71,3044
3,5;0,0474982;71,7602
3,52;0,0475268;72,2135
3,54;0,0473559;72,665
3,56;0,0473602;73,1231
3,58;0,0474329;73,5696
3,6;0,0476203;74,0224
3,62;0,0481605;74,4708
3,64;0,0489133;74,9218
3,66;0,0499601;75,3694
3,68;0,0505497;75,8267
3,7;0,0508669;76,271
3,72;0,050857;76,7354
3,74;0,0507588;77,1946
3,76;0,0507538;77,6529
3,78;0,0508238;78,1038
3,8;0,0508686;78,5637
3,82;0,0513762;78,9995
3,84;0,0522684;79,4454
3,86;0,0529529;79,8858
3,88;0,0534798;80,3295
3,9;0,0541703;80,7829
3,92;0,0540701;81,2384
3,94;0,0541022;81,6911
3,96;0,0540395;82,1674
3,98;0,054085;82,6154
4;0,0542091;83,0622
4,02;0,054503;83,5102
4,04;0,0553272;83,9635
4,06;0,0561394;84,403
4,08;0,0567081;84,8662
4,1;0,0573701;85,3232
4,12;0,0574255;85,779
4,14;0,0573993;86,2368
4,16;0,0573455;86,6778
4,18;0,0573833;87,1239
4,2;0,0574676;87,5742
4,22;0,0578412;88,0236
4,24;0,0587009;88,4624
4,26;0,0593645;88,9147
4,28;0,0600141;89,3641
4,3;0,0605264;89,81
4,32;0,0607378;90,2722
4,34;0,0607832;90,7173
4,36;0,0607311;91,1783
4,38;0,0607371;91,6312
4,4;0,06091;92,0853
4,42;0,0618503;92,5209
4,44;0,0616273;92,9717
4,46;0,0627129;93,4121
4,48;0,0631801;93,8617
4,5;0,0637057;94,3001
4,52;0,0640955;94,758
4,54;0,0643809;95,1979
4,56;0,0638281;95,6362
4,58;0,0641566;96,0683
4,6;0,0641576;96,5234
4,62;0,0643931;96,9621
4,64;0,0648417;97,4147
4,66;0,0658056;97,8538
4,68;0,0661606;98,2885
4,7;0,0670209;98,7171
4,72;0,067378;99,16
4,74;0,0674009;99,6123
4,76;0,0674656;100,07
4,78;0,0674264;100,533
4,8;0,0674636;100,998
4,82;0,0676115;101,45
4,84;0,0681736;101,896
4,86;0,0687728;102,342
4,88;0,0694294;102,793
4,9;0,070037;103,225
4,92;0,0705108;103,67
4,94;0,0707241;104,11
4,96;0,0707251;104,554
4,98;0,0707218;104,996
5;0,0707115;105,441
5,02;0,0707861;105,874
5,04;0,0713084;106,319
5,06;0,0718472;106,75
5,08;0,0724955;107,184
5,1;0,0733499;107,616
5,12;0,0736814;108,062
5,14;0,0738818;108,487
5,16;0,0739478;108,929
5,18;0,073897;109,357
5,2;0,0739169;109,792
5,22;0,0740132;110,225
5,24;0,0747225;110,645
5,26;0,0752956;111,046
5,28;0,0758098;111,46
5,3;0,0766211;111,877
5,32;0,0769519;112,266
5,34;0,0772027;112,675
5,36;0,0773122;113,104
5,38;0,0772299;113,514
5,4;0,0772953;113,931
5,42;0,0774213;114,358
5,44;0,0775756;114,792
5,46;0,0780956;115,216
5,48;0,0789921;115,654
5,5;0,0793285;116,084
5,52;0,079947;116,515
5,54;0,0802366;116,934
5,56;0,0803753;117,353
5,58;0,0804327;117,757
5,6;0,0804589;118,158
5,62;0,0805007;118,563
5,64;0,080656;118,976
5,66;0,0813544;119,387
5,68;0,0818495;119,817
5,7;0,0827364;120,241
5,72;0,0831647;120,667
5,74;0,0832944;121,077
5,76;0,0835964;121,498
5,78;0,0835944;121,908
5,8;0,0835794;122,323
5,82;0,083736;122,732
5,84;0,0838409;123,15
5,86;0,0845436;123,561
5,88;0,0849736;123,973
5,9;0,0856774;124,381
5,92;0,0862268;124,794
5,94;0,0865589;125,204
5,96;0,0866754;125,617
5,98;0,0867942;126,025
6;0,0867919;126,45
6,02;0,0867776;126,864
6,04;0,0870188;127,279
6,06;0,0872723;127,684
6,08;0,0880105;128,099
6,1;0,0887329;128,506
6,12;0,0891473;128,918
6,14;0,0895033;129,33
6,16;0,0898109;129,748
6,18;0,0898032;130,156
6,2;0,0898241;130,56
6,22;0,0899084;130,953
6,24;0,0900448;131,353
6,26;0,0901091;131,75
6,28;0,0913338;132,144
6,3;0,0914715;132,537
6,32;0,0922784;132,944
6,34;0,0930011;133,338
6,36;0,0928995;133,734
6,38;0,092938;134,142
6,4;0,0929795;134,541
6,42;0,0930143;134,93
6,44;0,0930375;135,337
6,46;0,09322;135,738
6,48;0,0937993;136,125
6,5;0,0943548;136,517
6,52;0,0949553;136,917
6,54;0,0956226;137,313
6,56;0,0956697;137,709
6,58;0,0957264;138,113
6,6;0,0959706;138,51
6,62;0,0960207;138,906
6,64;0,096038;139,291
6,66;0,0961793;139,678
6,68;0,0963907;140,061
6,7;0,0973084;140,453
6,72;0,0977626;140,846
6,74;0,098265;141,238
6,76;0,0985702;141,624
6,78;0,0985978;142,017
6,8;0,0988745;142,419
6,82;0,0988814;142,8
6,84;0,098911;143,187
6,86;0,0990941;143,569
6,88;0,0993645;143,965
6,9;0,0998572;144,339
6,92;0,100722;144,727
6,94;0,100971;145,106
6,96;0,101274;145,501
6,98;0,101552;145,875
7;0,101566;146,259
7,02;0,101592;146,654
7,04;0,101853;147,042
7,06;0,101956;147,422
7,08;0,1023;147,816
7,1;0,102713;148,2
7,12;0,103458;148,581
7,14;0,103729;148,966
7,16;0,104208;149,362
7,18;0,104624;149,729
7,2;0,104504;150,101
7,22;0,104653;150,47
7,24;0,104698;150,837
7,26;0,104828;151,201
7,28;0,105011;151,574
7,3;0,105575;151,948
7,32;0,105999;152,321
7,34;0,106502;152,704
7,36;0,106969;153,084
7,38;0,107196;153,463
7,4;0,107289;153,853
7,42;0,1075;154,24
7,44;0,107507;154,615
7,46;0,107642;154,99
7,48;0,107874;155,363
7,5;0,10849;155,725
7,52;0,108906;156,1
7,54;0,109203;156,47
7,56;0,109907;156,846
7,58;0,1099;157,225
7,6;0,110437;157,607
7,62;0,110527;157,986
7,64;0,110546;158,374
7,66;0,110569;158,744
7,68;0,111109;159,121
7,7;0,111236;159,494
7,72;0,111513;159,861
7,74;0,112189;160,233
7,76;0,112317;160,608
7,78;0,112789;160,979
7,8;0,113205;161,336
7,82;0,113237;161,697
7,84;0,113251;162,053
7,86;0,113258;162,41
7,88;0,113371;162,78
7,9;0,113906;163,154
7,92;0,114191;163,517
7,94;0,114967;163,88
7,96;0,115104;164,243
7,98;0,115674;164,592
8;0,115661;164,948
8,02;0,115758;165,306
8,04;0,116137;165,683
8,06;0,116174;166,045
8,08;0,116399;166,406
8,1;0,116418;166,773
8,12;0,116799;167,143
8,14;0,117647;167,486
8,16;0,117709;167,848
8,18;0,118238;168,211
8,2;0,118458;168,558
8,22;0,11838;168,899
8,24;0,118642;169,249
8,26;0,118772;169,592
8,28;0,118803;169,939
8,3;0,119245;170,291
8,32;0,119491;170,641
8,34;0,119996;170,988
8,36;0,120334;171,347
8,38;0,120572;171,676
8,4;0,120895;172,022
8,42;0,120983;172,371
8,44;0,121224;172,724
8,46;0,121281;173,058
8,48;0,12142;173,41
8,5;0,121845;173,76
8,52;0,122157;174,103
8,54;0,122497;174,449
8,56;0,12283;174,792
8,58;0,123115;175,149
8,6;0,123634;175,494
8,62;0,123882;175,843
8,64;0,123903;176,195
8,66;0,124041;176,539
8,68;0,124095;176,879
8,7;0,124331;177,233
8,72;0,124528;177,591
8,74;0,125291;177,931
8,76;0,125244;178,28
8,78;0,126089;178,625
8,8;0,126198;178,959
8,82;0,12649;179,293
8,84;0,126544;179,639
8,86;0,126683;179,976
8,88;0,126718;180,327
8,9;0,126857;180,673
8,92;0,127096;181,01
8,94;0,127625;181,346
8,96;0,127758;181,699
8,98;0,128519;182,037
9;0,128705;182,379
9,02;0,128654;182,72
9,04;0,129224;183,059
9,06;0,129324;183,387
9,08;0,129157;183,718
9,1;0,129442;184,051
9,12;0,129852;184,389
9,14;0,129973;184,726
9,16;0,130534;185,068
9,18;0,130981;185,401
9,2;0,131098;185,731
9,22;0,131349;186,064
9,24;0,131667;186,393
9,26;0,131995;186,719
9,28;0,131945;187,06
9,3;0,132055;187,404
9,32;0,132411;187,743
9,34;0,132385;188,097
9,36;0,132738;188,457
9,38;0,133678;188,819
9,4;0,133457;189,186
9,42;0,134266;189,557
9,44;0,134304;189,941
9,46;0,134349;190,346
9,48;0,134444;190,752
9,5;0,134601;191,167
9,52;0,134965;191,592
9,54;0,135226;192,01
9,56;0,136006;192,425
9,58;0,136134;192,846
9,6;0,136701;193,277
9,62;0,137043;193,716
9,64;0,137311;194,175
9,66;0,137759;194,626
9,68;0,13804;195,104
9,7;0,138107;195,584
9,72;0,138299;196,07
9,74;0,138873;196,547
9,76;0,139291;197,048
9,78;0,139732;197,553
9,8;0,140406;198,064
9,82;0,140646;198,579
9,84;0,140904;199,119
9,86;0,141093;199,656
9,88;0,141644;200,189
9,9;0,141903;200,725
9,92;0,142081;201,281
9,94;0,143081;201,828
9,96;0,14318;202,386
9,98;0,143862;202,954
10;0,144452;203,532
10,02;0,144878;204,11
10,04;0,14538;204,691
10,06;0,145559;205,279
10,08;0,145996;205,876
10,1;0,146301;206,476
10,12;0,146591;207,077
10,14;0,147181;207,685
10,16;0,147683;208,302
10,18;0,148178;208,917
10,2;0,148894;209,534
10,22;0,149288;210,156
10,24;0,149994;210,785
10,26;0,150311;211,41
10,28;0,150455;212,048
10,3;0,151081;212,689
10,32;0,151363;213,338
10,34;0,151771;213,985
10,36;0,152373;214,645
10,38;0,15304;215,296
10,4;0,153949;215,955
10,42;0,154196;216,611
10,44;0,154833;217,283
10,46;0,155303;217,957
10,48;0,155537;218,639
10,5;0,156074;219,325
10,52;0,156574;220,024
10,54;0,157072;220,725
10,56;0,157955;221,427
10,58;0,158377;222,133
10,6;0,158909;222,846
10,62;0,159677;223,566
10,64;0,160068;224,282
10,66;0,160613;225,01
10,68;0,161284;225,738
10,7;0,161656;226,455
10,72;0,161784;227,17
10,74;0,162717;227,885
10,76;0,163282;228,601
10,78;0,163678;229,318
10,8;0,164622;230,054
10,82;0,165095;230,792
10,84;0,165432;231,542
10,86;0,166303;232,283
10,88;0,166888;233,036
10,9;0,167033;233,801
10,92;0,167829;234,568
10,94;0,168205;235,336
10,96;0,168836;236,123
10,98;0,169569;236,904
11;0,170281;237,681
11,02;0,17107;238,466
11,04;0,171496;239,254
11,06;0,172172;240,044
11,08;0,172995;240,848
11,1;0,173162;241,653
11,12;0,173695;242,467
11,14;0,17445;243,296
11,16;0,174967;244,123
11,18;0,175922;244,949
11,2;0,176459;245,784
11,22;0,1772;246,613
11,24;0,178121;247,453
11,26;0,178625;248,292
11,28;0,179274;249,142
11,3;0,179848;249,995
11,32;0,180452;250,849
11,34;0,180866;251,696
11,36;0,181677;252,547
11,38;0,182446;253,399
11,4;0,182796;254,251
11,42;0,183664;255,105
11,44;0,184417;255,967
11,46;0,185085;256,828
11,48;0,185762;257,69
11,5;0,18617;258,559
11,52;0,186872;259,433
11,54;0,187505;260,295
11,56;0,188258;261,174
11,58;0,188984;262,044
11,6;0,189484;262,921
11,62;0,190345;263,793
11,64;0,191296;264,674
11,66;0,191576;265,543
11,68;0,19251;266,418
11,7;0,193107;267,273
11,72;0,193767;268,143
11,74;0,194287;269,011
11,76;0,194992;269,896
11,78;0,195609;270,777
11,8;0,196449;271,675
11,82;0,197199;272,568
11,84;0,198013;273,463
11,86;0,198598;274,351
11,88;0,199134;275,267
11,9;0,199819;276,162
11,92;0,200464;277,063
11,94;0,201199;277,963
11,96;0,201652;278,876
11,98;0,202624;279,769
12;0,203375;280,683
12,02;0,204151;281,579
12,04;0,204853;282,485
12,06;0,205366;283,367
12,08;0,206339;284,263
12,1;0,206713;285,135
12,12;0,207461;286,015
12,14;0,208181;286,878
12,16;0,20847;287,737
12,18;0,209364;288,565
12,2;0,209959;289,399
12,22;0,210624;290,231
12,24;0,21149;291,062
12,26;0,211871;291,892
12,28;0,212822;292,73
12,3;0,213141;293,571
12,32;0,213672;294,413
12,34;0,214407;295,245
12,36;0,214802;296,081
12,38;0,215521;296,918
12,4;0,216272;297,748
12,42;0,216868;298,578
12,44;0,217566;299,417
12,46;0,218626;300,261
12,48;0,218872;301,103
12,5;0,219871;301,951
12,52;0,220314;302,798
12,54;0,220771;303,645
12,56;0,221649;304,483
12,58;0,221971;305,337
12,6;0,222857;306,196
12,62;0,223552;307,057
12,64;0,224351;307,934
12,66;0,225236;308,824
12,68;0,225816;309,721
12,7;0,226535;310,619
12,72;0,227167;311,53
12,74;0,227543;312,435
12,76;0,228415;313,335
12,78;0,228924;314,237
12,8;0,229638;315,133
12,82;0,230464;316,019
12,84;0,231259;316,891
12,86;0,231969;317,772
12,88;0,232587;318,647
12,9;0,233292;319,524
12,92;0,234044;320,407
12,94;0,234565;321,311
12,96;0,235467;322,21
12,98;0,235886;323,1
13;0,236697;324,004
13,02;0,237367;324,902
13,04;0,238042;325,792
13,06;0,238764;326,687
13,08;0,239653;327,59
13,1;0,240112;328,484
13,12;0,241261;329,389
13,14;0,24153;330,298
13,16;0,242192;331,211
13,18;0,242856;332,13
13,2;0,243597;333,055
13,22;0,244524;333,983
13,24;0,245152;334,927
13,26;0,246062;335,862
13,28;0,246888;336,801
13,3;0,247386;337,744
13,32;0,248367;338,682
13,34;0,248806;339,601
13,36;0,249567;340,518
13,38;0,250296;341,435
13,4;0,250898;342,353
13,42;0,251825;343,262
13,44;0,252386;344,201
13,46;0,253447;345,151
13,48;0,253957;346,098
13,5;0,254829;347,033
13,52;0,255669;347,982
13,54;0,256128;348,911
13,56;0,257069;349,836
13,58;0,257617;350,746
13,6;0,258392;351,653
13,62;0,258944;352,549
13,64;0,259855;353,447
13,66;0,260597;354,345
13,68;0,261276;355,26
13,7;0,262204;356,197
13,72;0,26292;357,143
13,74;0,263495;358,09
13,76;0,264315;359,052
13,78;0,264973;360,014
13,8;0,265777;360,968
13,82;0,266515;361,92
13,84;0,267378;362,864
13,86;0,268177;363,795
13,88;0,268861;364,721
13,9;0,269852;365,637
13,92;0,270274;366,538
13,94;0,271316;367,445
13,96;0,271691;368,355
13,98;0,27253;369,258
14;0,273231;370,159
14,02;0,27401;371,072
14,04;0,274726;371,982
14,06;0,275689;372,878
14,08;0,276368;373,792
14,1;0,277187;374,695
14,12;0,277951;375,601
14,14;0,278799;376,493
14,16;0,279379;377,398
14,18;0,280145;378,281
14,2;0,28091;379,201
14,22;0,2816;380,102
14,24;0,282408;381,023
14,26;0,283006;381,935
14,28;0,284225;382,865
14,3;0,285047;383,766
14,32;0,28559;384,676
14,34;0,286555;385,579
14,36;0,287365;386,487
14,38;0,287972;387,38
14,4;0,288806;388,299
14,42;0,289367;389,222
14,44;0,290431;390,148
14,46;0,291234;391,069
14,48;0,291972;391,997
14,5;0,292863;392,899
14,52;0,293567;393,791
14,54;0,294442;394,678
14,56;0,295077;395,577
14,58;0,296046;396,477
14,6;0,29649;397,393
14,62;0,297386;398,309
14,64;0,298137;399,24
14,66;0,299161;400,167
14,68;0,299742;401,105
14,7;0,300892;402,044
14,72;0,301805;402,984
14,74;0,302405;403,911
14,76;0,303266;404,835
14,78;0,304086;405,73
14,8;0,304823;406,622
14,82;0,305442;407,511
14,84;0,306324;408,409
14,86;0,307263;409,298
14,88;0,30804;410,204
14,9;0,308914;411,101
14,92;0,309728;412,01
14,94;0,310404;412,904
14,96;0,311341;413,81
14,98;0,311754;414,715
15;0,312667;415,631
15,02;0,313396;416,529
15,04;0,314159;417,432
15,06;0,315076;418,329
15,08;0,31584;419,228
15,1;0,316584;420,123
15,12;0,317566;421,035
15,14;0,318342;421,943
15,16;0,319056;422,854
15,18;0,319798;423,75
15,2;0,320613;424,642
15,22;0,321401;425,525
15,24;0,321986;426,403
15,26;0,323051;427,291
15,28;0,324057;428,19
15,3;0,324586;429,082
15,32;0,325943;429,962
15,34;0,326458;430,849
15,36;0,327144;431,722
15,38;0,32784;432,596
15,4;0,328567;433,48
15,42;0,329234;434,387
15,44;0,330062;435,3
15,46;0,330696;436,22
15,48;0,331889;437,149
15,5;0,33248;438,087
15,52;0,333566;439,011
15,54;0,334315;439,925
15,56;0,334917;440,823
15,58;0,336014;441,701
15,6;0,336376;442,552
15,62;0,337216;443,397
15,64;0,337808;444,243
15,66;0,338817;445,092
15,68;0,339461;445,938
15,7;0,340327;446,795
15,72;0,341122;447,65
15,74;0,342099;448,494
15,76;0,342644;449,346
15,78;0,343774;450,179
15,8;0,344099;451,014
15,82;0,345153;451,86
15,84;0,34564;452,725
15,86;0,346494;453,582
15,88;0,347537;454,455
15,9;0,347878;455,319
15,92;0,349217;456,183
15,94;0,34944;457,033
15,96;0,35088;457,882
15,98;0,351157;458,739
16;0,35214;459,593
16,02;0,352612;460,444
16,04;0,353535;461,301
16,06;0,354256;462,14
16,08;0,355213;462,972
16,1;0,356036;463,819
16,12;0,356887;464,654
16,14;0,357807;465,503
16,16;0,358363;466,383
16,18;0,359091;467,29
16,2;0,359761;468,191
16,22;0,360808;469,095
16,24;0,361567;469,994
16,26;0,362386;470,867
16,28;0,363139;471,728
16,3;0,364157;472,575
16,32;0,364862;473,43
16,34;0,365966;474,292
16,36;0,366557;475,167
16,38;0,367276;476,042
16,4;0,368213;476,928
16,42;0,36883;477,803
16,44;0,369743;478,66
16,46;0,370746;479,524
16,48;0,371335;480,382
16,5;0,37224;481,245
16,52;0,372923;482,127
16,54;0,374035;483,027
16,56;0,37457;483,927
16,58;0,375564;484,825
16,6;0,376304;485,721
16,62;0,377058;486,607
16,64;0,377976;487,493
16,66;0,378817;488,374
16,68;0,379733;489,244
16,7;0,380555;490,107
16,72;0,381394;490,999
16,74;0,382221;491,871
16,76;0,383098;492,741
16,78;0,384082;493,618
16,8;0,38494;494,524
16,82;0,385665;495,411
16,84;0,386587;496,314
16,86;0,38739;497,231
16,88;0,388546;498,17
16,9;0,389433;499,087
16,92;0,390319;500,001
16,94;0,391296;500,904
16,96;0,392159;501,803
16,98;0,393172;502,695
17;0,393746;503,59
17,02;0,394634;504,494
17,04;0,395465;505,401
17,06;0,396478;506,301
17,08;0,397224;507,187
17,1;0,398361;508,068
17,12;0,398951;508,953
17,14;0,39997;509,85
17,16;0,401094;510,768
17,18;0,40181;511,701
17,2;0,402741;512,651
17,22;0,403833;513,603
17,24;0,404558;514,564
17,26;0,405737;515,492
17,28;0,406523;516,415
17,3;0,407299;517,325
17,32;0,408271;518,231
17,34;0,409296;519,124
17,36;0,410178;520,025
17,38;0,411377;520,934
17,4;0,411912;521,846
17,42;0,412942;522,765
17,44;0,4139;523,701
17,46;0,414648;524,653
17,48;0,415922;525,61
17,5;0,416784;526,572
17,52;0,41792;527,532
17,54;0,419014;528,483
17,56;0,41989;529,424
17,58;0,420841;530,353
17,6;0,42183;531,292
17,62;0,422723;532,225
17,64;0,42357;533,155
17,66;0,424709;534,074
17,68;0,425547;534,997
17,7;0,426639;535,909
17,72;0,427572;536,83
17,74;0,428581;537,758
17,76;0,429697;538,722
17,78;0,430596;539,703
17,8;0,431823;540,687
17,82;0,432819;541,659
17,84;0,433814;542,628
17,86;0,434838;543,57
17,88;0,435723;544,506
17,9;0,436917;545,436
17,92;0,437808;546,378
17,94;0,43882;547,31
17,96;0,440007;548,259
17,98;0,441169;549,209
18;0,442046;550,166
18,02;0,443173;551,126
18,04;0,444146;552,105
18,06;0,445342;553,084
18,08;0,446357;554,07
18,1;0,447698;555,066
18,12;0,44878;556,056
18,14;0,450058;557,054
18,16;0,451164;558,05
18,18;0,452332;559,04
18,2;0,453242;560,018
18,22;0,454319;560,992
18,24;0,455608;561,94
18,26;0,456641;562,89
18,28;0,457901;563,853
18,3;0,458986;564,836
18,32;0,460225;565,84
18,34;0,461486;566,873
18,36;0,462602;567,906
18,38;0,463794;568,922
18,4;0,464934;569,924
18,42;0,466259;570,9
18,44;0,467346;571,868
18,46;0,468636;572,838
18,48;0,469716;573,815
18,5;0,470726;574,782
18,52;0,472046;575,768
18,54;0,473644;576,737
18,56;0,474267;577,712
18,58;0,475828;578,689
18,6;0,47705;579,687
18,62;0,478213;580,695
18,64;0,479562;581,731
18,66;0,481024;582,765
18,68;0,481916;583,795
18,7;0,483541;584,815
18,72;0,484893;585,835
18,74;0,486053;586,839
18,76;0,4873;587,835
18,78;0,488624;588,823
18,8;0,489872;589,827
18,82;0,491237;590,821
18,84;0,492351;591,826
18,86;0,493895;592,854
18,88;0,495188;593,895
18,9;0,496615;594,924
18,92;0,497902;595,955
18,94;0,499547;596,975
18,96;0,500555;597,995
18,98;0,502348;599,032
19;0,503867;600,069
19,02;0,504719;601,099
19,04;0,506396;602,134
19,06;0,507685;603,145
19,08;0,508878;604,151
19,1;0,510613;605,172
19,12;0,511683;606,225
19,14;0,513178;607,289
19,16;0,514889;608,37
19,18;0,516521;609,445
19,2;0,518066;610,503
19,22;0,519105;611,537
19,24;0,520895;612,567
19,26;0,522326;613,594
19,28;0,523729;614,623
19,3;0,525325;615,662
19,32;0,526719;616,707
19,34;0,528194;617,75
19,36;0,529841;618,799
19,38;0,531276;619,843
19,4;0,532881;620,887
19,42;0,535119;621,942
19,44;0,53604;622,983
19,46;0,538488;624,029
19,48;0,539574;625,085
19,5;0,540224;626,133
19,52;0,542869;627,16
19,54;0,544101;628,195
19,56;0,545469;629,206
19,58;0,547339;630,21
19,6;0,548716;631,234
19,62;0,549949;632,287
19,64;0,55202;633,348
19,66;0,554115;634,415
19,68;0,555187;635,481
19,7;0,557085;636,515
19,72;0,55889;637,537
19,74;0,55997;638,549
19,76;0,562077;639,572
19,78;0,563982;640,601
19,8;0,565245;641,653
19,82;0,567399;642,695
19,84;0,569443;643,753
19,86;0,570354;644,8
19,88;0,572573;645,845
19,9;0,575273;646,895
19,92;0,575519;647,941
19,94;0,577693;648,969
19,96;0,581116;650,009
19,98;0,580767;651,04
20;0,582645;652,045
20,02;0,58718;653,04
20,04;0,585497;654,039
20,06;0,588064;655,001
20,08;0,591512;655,99
20,1;0,591155;657,001
20,12;0,593386;658,04
20,14;0,597266;659,081
20,16;0,597082;660,156
20,18;0,599602;661,185
20,2;0,602941;662,196
20,22;0,603565;663,193
20,24;0,605356;664,19
20,26;0,609023;665,182
20,28;0,609675;666,213
20,3;0,611235;667,236
20,32;0,614186;668,253
20,34;0,615654;669,26
20,36;0,61739;670,28
20,38;0,619964;671,296
20,4;0,621518;672,315
20,42;0,624266;673,343
20,44;0,626392;674,364
20,46;0,627864;675,364
20,48;0,631565;676,358
20,5;0,632614;677,351
20,52;0,633804;678,31
20,54;0,638325;679,28
20,56;0,637999;680,244
20,58;0,640518;681,199
20,6;0,643978;682,18
20,62;0,644773;683,196
20,64;0,646865;684,206
20,66;0,650825;685,21
20,68;0,651614;686,204
20,7;0,653697;687,169
20,72;0,656922;688,131
20,74;0,658904;689,094
20,76;0,660893;690,078
20,78;0,66405;691,053
20,8;0,66627;692,039
20,82;0,667753;693,014
20,84;0,670999;693,97
20,86;0,673508;694,929
20,88;0,674867;695,91
20,9;0,678432;696,88
20,92;0,681475;697,85
20,94;0,681696;698,823
20,96;0,687092;699,787
20,98;0,688512;700,725
21;0,689045;701,664
21,02;0,694952;702,571
21,04;0,696118;703,491
21,06;0,696702;704,411
21,08;0,702459;705,351
21,1;0,702781;706,288
21,12;0,705078;707,253
21,14;0,70979;708,208
21,16;0,711226;709,152
21,18;0,71367;710,07
21,2;0,717787;710,981
21,22;0,719656;711,874
21,24;0,722015;712,772
21,26;0,725339;713,651
21,28;0,728308;714,531
21,3;0,730053;715,404
21,32;0,733819;716,273
21,34;0,737136;717,136
21,36;0,738387;718,022
21,38;0,74229;718,936
21,4;0,745637;719,846
21,42;0,747929;720,767
21,44;0,750974;721,667
21,46;0,754128;722,54
21,48;0,758703;723,392
21,5;0,759609;724,247
21,52;0,763588;725,076
21,54;0,769076;725,921
21,56;0,768848;726,79
21,58;0,773176;727,631
21,6;0,778535;728,478
21,62;0,778278;729,347
21,64;0,78313;730,205
21,66;0,788524;731,031
21,68;0,789093;731,874
21,7;0,792782;732,7
21,72;0,798284;733,512
21,74;0,799524;734,335
21,76;0,803154;735,156
21,78;0,808417;735,95
21,8;0,810241;736,739
21,82;0,813438;737,514
21,84;0,818982;738,281
21,86;0,821803;739,072
21,88;0,824384;739,881
21,9;0,829617;740,69
21,92;0,833159;741,516
21,94;0,835902;742,299
21,96;0,84203;743,079
21,98;0,84437;743,849
22;0,848462;744,612
22,02;0,855284;745,354
22,04;0,856659;746,128
22,06;0,860443;746,872
22,08;0,867272;747,613
22,1;0,868254;748,364
22,12;0,873393;749,124
22,14;0,879357;749,871
22,16;0,881114;750,624
22,18;0,885825;751,367
22,2;0,892448;752,106
22,22;0,894914;752,836
22,24;0,898778;753,544
22,26;0,904818;754,226
22,28;0,908441;754,915
22,3;0,911767;755,596
22,32;0,918152;756,269
22,34;0,922038;756,963
22,36;0,925407;757,685
22,38;0,93198;758,393
22,4;0,936652;759,093
22,42;0,939885;759,793
22,44;0,945536;760,461
22,46;0,951573;761,129
22,48;0,955086;761,805
22,5;0,959604;762,457
22,52;0,967171;763,113
22,54;0,970474;763,789
22,56;0,9744;764,443
22,58;0,983791;765,075
22,6;0,987055;765,726
22,62;0,989966;766,361
22,64;0,998914;767,007
22,66;1,00293;767,647
22,68;1,00641;768,303
22,7;1,01443;768,933
22,72;1,01907;769,557
22,74;1,02217;770,159
22,76;1,0309;770,746
22,78;1,03598;771,313
22,8;1,03885;771,901
22,82;1,04572;772,48
22,84;1,05246;773,058
22,86;1,05569;773,657
22,88;1,0621;774,253
22,9;1,06941;774,825
22,92;1,07271;775,403
22,94;1,07932;775,951
22,96;1,08663;776,5
22,98;1,09021;777,062
23;1,09708;777,625
23,02;1,10505;778,171
23,04;1,10799;778,735
23,06;1,11522;779,264
23,08;1,12389;779,79
23,1;1,12633;780,324
23,12;1,13324;780,872
23,14;1,14193;781,422
23,16;1,14523;781,984
23,18;1,15196;782,522
23,2;1,16036;783,051
23,22;1,16504;783,564
23,24;1,17077;784,068
23,26;1,17952;784,557
23,28;1,18495;785,067
23,3;1,18983;785,561
23,32;1,1985;786,063
23,34;1,2045;786,561
23,36;1,20905;787,064
23,38;1,21773;787,538
23,4;1,22429;788,02
23,42;1,22916;788,487
23,44;1,23729;788,948
23,46;1,24466;789,427
23,48;1,24934;789,918
23,5;1,25765;790,394
23,52;1,26493;790,868
23,54;1,27005;791,335
23,56;1,27746;791,78
23,58;1,28535;792,227
23,6;1,29059;792,682
23,62;1,29788;793,145
23,64;1,30582;793,616
23,66;1,3118;794,073
23,68;1,31917;794,511
23,7;1,32727;794,938
23,72;1,33341;795,357
23,74;1,33997;795,76
23,76;1,34806;796,179
23,78;1,35469;796,596
23,8;1,36162;797,03
23,82;1,36917;797,454
23,84;1,37574;797,882
23,86;1,38267;798,3
23,88;1,39067;798,726
23,9;1,39757;799,131
23,92;1,40464;799,543
23,94;1,41233;799,958
23,96;1,41965;800,369
23,98;1,42674;800,769
24;1,4344;801,159
24,02;1,44181;801,534
24,04;1,44892;801,899
24,06;1,45639;802,274
24,08;1,46413;802,664
24,1;1,47096;803,064
24,12;1,47859;803,48
24,14;1,4866;803,895
24,16;1,49385;804,302
24,18;1,50159;804,674
24,2;1,50937;805,034
24,22;1,51681;805,382
24,24;1,52442;805,735
24,26;1,53246;806,086
24,28;1,54001;806,441
24,3;1,5472;806,807
24,32;1,55524;807,172
24,34;1,56293;807,533
24,36;1,57006;807,897
24,38;1,57779;808,27
24,4;1,58587;808,638
24,42;1,5936;808,995
24,44;1,60146;809,352
24,46;1,60964;809,688
24,48;1,61693;810,018
24,5;1,62487;810,334
24,52;1,63293;810,657
24,54;1,64035;810,985
24,56;1,64816;811,328
24,58;1,65584;811,677
24,6;1,6637;812,049
24,62;1,67155;812,418
24,64;1,67948;812,769
24,66;1,68749;813,099
24,68;1,69564;813,42
24,7;1,70375;813,726
24,72;1,71142;814,029
24,74;1,71939;814,338
24,76;1,72757;814,655
24,78;1,73526;814,974
24,8;1,74359;815,297
24,82;1,75141;815,616
24,84;1,75916;815,94
24,86;1,76725;816,265
24,88;1,77553;816,596
24,9;1,78333;816,922
24,92;1,79138;817,248
24,94;1,79949;817,567
24,96;1,80742;817,869
24,98;1,81569;818,161
25;1,82384;818,441
25,02;1,8322;818,717
25,04;1,84038;818,995
25,06;1,84879;819,307
25,08;1,85699;819,628
25,1;1,86516;819,956
25,12;1,87346;820,294
25,14;1,88201;820,622
25,16;1,89046;820,919
25,18;1,8992;821,2
25,2;1,90756;821,483
25,22;1,91609;821,759
25,24;1,92465;822,027
25,26;1,93319;822,302
25,28;1,94153;822,583
25,3;1,95008;822,854
25,32;1,95839;823,131
25,34;1,96709;823,42
25,36;1,97559;823,72
25,38;1,98424;824,033
25,4;1,99303;824,348
25,42;2,00161;824,637
25,44;2,01031;824,917
25,46;2,01877;825,178
25,48;2,0272;825,421
25,5;2,03571;825,659
25,52;2,04433;825,913
25,54;2,05275;826,168
25,56;2,06117;826,445
25,58;2,06957;826,717
25,6;2,07821;826,999
25,62;2,08672;827,285
25,64;2,09534;827,568
25,66;2,10418;827,83
25,68;2,11274;828,107
25,7;2,12155;828,369
25,72;2,13022;828,63
25,74;2,13871;828,896
25,76;2,14729;829,147
25,78;2,15629;829,381
25,8;2,16469;829,626
25,82;2,17339;829,86
25,84;2,182;830,109
25,86;2,19063;830,381
25,88;2,19941;830,666
25,9;2,20826;830,94
25,92;2,21706;831,203
25,94;2,2258;831,451
25,96;2,23467;831,696
25,98;2,24333;831,937
26;2,25206;832,184
26,02;2,26087;832,433
26,04;2,26961;832,683
26,06;2,2783;832,92
26,08;2,28726;833,155
26,1;2,29583;833,393
26,12;2,30461;833,65
26,14;2,31355;833,909
26,16;2,32269;834,172
26,18;2,33174;834,43
26,2;2,34059;834,686
26,22;2,34964;834,934
26,24;2,35844;835,16
26,26;2,36757;835,374
26,28;2,37645;835,589
26,3;2,38515;835,813
26,32;2,3941;836,029
26,34;2,40282;836,253
26,36;2,41167;836,503
26,38;2,42038;836,761
26,4;2,42946;837,003
26,42;2,4384;837,244
26,44;2,44755;837,476
26,46;2,45634;837,707
26,48;2,46528;837,921
26,5;2,47408;838,142
26,52;2,48316;838,367
26,54;2,492;838,595
26,56;2,50068;838,809
26,58;2,5095;839,029
26,6;2,51854;839,254
26,62;2,52741;839,485
26,64;2,53649;839,74
26,66;2,54565;839,994
26,68;2,55461;840,241
26,7;2,56377;840,477
26,72;2,57307;840,709
26,74;2,58181;840,919
26,76;2,59087;841,118
26,78;2,60011;841,321
26,8;2,60895;841,534
26,82;2,61802;841,737
26,84;2,62702;841,958
26,86;2,63594;842,199
26,88;2,64512;842,434
26,9;2,65459;842,654
26,92;2,66363;842,876
26,94;2,67282;843,093
26,96;2,68211;843,302
26,98;2,69111;843,515
27;2,70045;843,739
27,02;2,70953;843,943
27,04;2,71865;844,13
27,06;2,72768;844,313
27,08;2,73671;844,502
27,1;2,74601;844,697
27,12;2,75497;844,927
27,14;2,76441;845,159
27,16;2,77378;845,393
27,18;2,78308;845,613
27,2;2,79241;845,818
27,22;2,80158;846,01
27,24;2,81103;846,201
27,26;2,82028;846,396
27,28;2,82956;846,595
27,3;2,83875;846,802
27,32;2,84802;847,006
27,34;2,85741;847,221
27,36;2,86687;847,437
27,38;2,87625;847,645
27,4;2,88569;847,857
27,42;2,89528;848,054
27,44;2,90488;848,253
27,46;2,91447;848,461
27,48;2,92387;848,669
27,5;2,93339;848,857
27,52;2,9431;849,05
27,54;2,95239;849,231
27,56;2,96175;849,4
27,58;2,97108;849,578
27,6;2,98065;849,796
27,62;2,99017;850,01
27,64;2,99976;850,231
27,66;3,00953;850,448
27,68;3,01897;850,644
27,7;3,02859;850,81
27,72;3,03808;850,995
27,74;3,04756;851,173
27,76;3,05698;851,354
27,78;3,06651;851,561
27,8;3,07598;851,772
27,82;3,08552;851,973
27,84;3,09497;852,172
27,86;3,10448;852,365
27,88;3,11412;852,553
27,9;3,12377;852,738
27,92;3,13333;852,918
27,94;3,14292;853,095
27,96;3,15231;853,28
27,98;3,162;853,456
28;3,1715;853,624
28,02;3,18097;853,781
28,04;3,19034;853,942
28,06;3,19958;854,113
28,08;3,20896;854,292
28,1;3,21838;854,482
28,12;3,22796;854,689
28,14;3,23736;854,895
28,16;3,24718;855,074
28,18;3,25672;855,231
28,2;3,26626;855,394
28,22;3,27579;855,548
28,24;3,28532;855,715
28,26;3,29481;855,893
28,28;3,30432;856,091
28,3;3,31374;856,267
28,32;3,32313;856,457
28,34;3,33249;856,637
28,36;3,34198;856,814
28,38;3,35161;856,992
28,4;3,3611;857,172
28,42;3,37066;857,346
28,44;3,38042;857,516
28,46;3,38977;857,681
28,48;3,39924;857,841
28,5;3,40871;857,995
28,52;3,41802;858,136
28,54;3,42739;858,291
28,56;3,4366;858,461
28,58;3,44602;858,643
28,6;3,45527;858,844
28,62;3,46478;859,047
28,64;3,47441;859,229
28,66;3,48372;859,385
28,68;3,49327;859,533
28,7;3,50263;859,678
28,72;3,51217;859,835
28,74;3,52161;860,002
28,76;3,53122;860,179
28,78;3,54066;860,346
28,8;3,55028;860,506
28,82;3,55979;860,659
28,84;3,56924;860,822
28,86;3,57889;860,993
28,88;3,58842;861,169
28,9;3,59816;861,35
28,92;3,60805;861,531
28,94;3,61754;861,69
28,96;3,62702;861,839
28,98;3,63666;861,989
29;3,6463;862,118
29,02;3,65572;862,246
29,04;3,66526;862,395
29,06;3,67465;862,564
29,08;3,68408;862,731
29,1;3,69368;862,923
29,12;3,70315;863,111
29,14;3,71278;863,283
29,16;3,72249;863,438
29,18;3,7321;863,587
29,2;3,74171;863,73
29,22;3,75108;863,883
29,24;3,7607;864,037
29,26;3,77013;864,173
29,28;3,7798;864,322
29,3;3,78911;864,476
29,32;3,79869;864,62
29,34;3,808;864,774
29,36;3,81797;864,965
29,38;3,8275;865,155
29,4;3,83723;865,338
29,42;3,84712;865,511
29,44;3,85674;865,674
29,46;3,86651;865,819
29,48;3,87617;865,944
29,5;3,88579;866,059
29,52;3,89541;866,187
29,54;3,90481;866,317
29,56;3,91447;866,462
29,58;3,92383;866,617
29,6;3,93333;866,78
29,62;3,94307;866,937
29,64;3,95291;867,092
29,66;3,96252;867,229
29,68;3,97219;867,364
29,7;3,98178;867,501
29,72;3,99121;867,65
29,74;4,00077;867,794
29,76;4,01041;867,926
29,78;4,01981;868,065
29,8;4,02949;868,197
29,82;4,03881;868,334
29,84;4,04867;868,498
29,86;4,05804;868,686
29,88;4,06778;868,859
29,9;4,07764;869,02
29,92;4,08741;869,174
29,94;4,09699;869,301
29,96;4,10684;869,428
29,98;4,11639;869,566
30;4,12606;869,701
30,02;4,13586;869,834
30,04;4,14533;869,967
30,06;4,15499;870,103
30,08;4,165;870,237
30,1;4,1743;870,386
30,12;4,18436;870,539
30,14;4,19404;870,695
30,16;4,20402;870,842
30,18;4,21399;870,987
30,2;4,22365;871,13
30,22;4,23344;871,258
30,24;4,24309;871,37
30,26;4,25288;871,473
30,28;4,26271;871,583
30,3;4,27232;871,706
30,32;4,28205;871,848
30,34;4,29176;872,017
30,36;4,30153;872,193
30,38;4,31139;872,344
30,4;4,32134;872,492
30,42;4,33126;872,609
30,44;4,34129;872,725
30,46;4,35086;872,839
30,48;4,36096;872,968
30,5;4,37055;873,084
30,52;4,38038;873,224
30,54;4,39009;873,349
30,56;4,39972;873,472
30,58;4,40932;873,592
30,6;4,41932;873,729
30,62;4,42895;873,863
30,64;4,43913;874,006
30,66;4,44904;874,156
30,68;4,45875;874,303
30,7;4,46873;874,425
30,72;4,47844;874,546
30,74;4,48819;874,653
30,76;4,4979;874,754
30,78;4,50752;874,864
30,8;4,51719;874,987
30,82;4,52671;875,12
30,84;4,53641;875,27
30,86;4,54616;875,415
30,88;4,55598;875,563
30,9;4,56581;875,705
30,92;4,57608;875,827
30,94;4,5855;875,945
30,96;4,59539;876,076
30,98;4,60548;876,198
31;4,61533;876,321
31,02;4,6251;876,435
31,04;4,63487;876,551
31,06;4,6444;876,662
31,08;4,65415;876,783
31,1;4,66397;876,921
31,12;4,67377;877,065
31,14;4,68381;877,213
31,16;4,69397;877,345
31,18;4,70381;877,453
31,2;4,71394;877,55
31,22;4,72351;877,645
31,24;4,7333;877,736
31,26;4,74308;877,837
31,28;4,75293;877,949
31,3;4,76246;878,066
31,32;4,77196;878,198
31,34;4,78174;878,332
31,36;4,79181;878,466
31,38;4,80141;878,605
31,4;4,81129;878,734
31,42;4,82123;878,848
31,44;4,83112;878,985
31,46;4,84094;879,113
31,48;4,85121;879,237
31,5;4,86089;879,358
31,52;4,87107;879,485
31,54;4,88092;879,589
31,56;4,89107;879,702
31,58;4,90078;879,824
31,6;4,91082;879,96
31,62;4,9208;880,09
31,64;4,93128;880,21
31,66;4,94114;880,326
31,68;4,95127;880,417
31,7;4,96123;880,5
31,72;4,97128;880,604
31,74;4,98147;880,701
31,76;4,9913;880,806
31,78;5,00135;880,931
31,8;5,01151;881,056
31,82;5,02117;881,161
31,84;5,03107;881,275
31,86;5,04104;881,387
31,88;5,05103;881,488
31,9;5,06125;881,598
31,92;5,0714;881,71
31,94;5,08136;881,823
31,96;5,0914;881,926
31,98;5,10137;882,034
32;5,11151;882,125
32,02;5,12147;882,22
32,04;5,13146;882,312
32,06;5,14118;882,428
32,08;5,15135;882,553
32,1;5,16119;882,702
32,12;5,17144;882,848
32,14;5,1815;882,979
32,16;5,19171;883,087
32,18;5,20175;883,17
32,2;5,21178;883,25
32,22;5,22171;883,334
32,24;5,23185;883,432
32,26;5,24169;883,53
32,28;5,25172;883,64
32,3;5,26147;883,739
32,32;5,27175;883,839
32,34;5,28154;883,946
32,36;5,2914;884,05
32,38;5,30159;884,158
32,4;5,31182;884,27
32,42;5,3214;884,373
32,44;5,33186;884,474
32,46;5,34135;884,588
32,48;5,35143;884,69
32,5;5,36164;884,787
32,52;5,37133;884,885
32,54;5,38128;884,988
32,56;5,39128;885,103
32,58;5,40129;885,242
32,6;5,41128;885,378
32,62;5,42155;885,513
32,64;5,43157;885,627
32,66;5,44189;885,709
32,68;5,45206;885,767
32,7;5,46194;885,841
32,72;5,47194;885,911
32,74;5,48195;885,991
32,76;5,4922;886,073
32,78;5,50213;886,162
32,8;5,51201;886,241
32,82;5,52187;886,326
32,84;5,53202;886,428
32,86;5,54194;886,54
32,88;5,552;886,658
32,9;5,56216;886,768
32,92;5,57209;886,881
32,94;5,58232;886,971
32,96;5,59228;887,059
32,98;5,60232;887,146
33;5,61227;887,235
33,02;5,62241;887,324
33,04;5,63279;887,438
33,06;5,64264;887,561
33,08;5,65307;887,678
33,1;5,66314;887,798
33,12;5,67352;887,922
33,14;5,68399;888,015
33,16;5,69416;888,095
33,18;5,7044;888,179
33,2;5,71469;888,267
33,22;5,72479;888,35
33,24;5,73507;888,432
33,26;5,74537;888,508
33,28;5,75538;888,589
33,3;5,76537;888,663
33,32;5,77582;888,741
33,34;5,78588;888,843
33,36;5,79614;888,964
33,38;5,80663;889,083
33,4;5,81723;889,191
33,42;5,82744;889,284
33,44;5,83751;889,363
33,46;5,84808;889,428
33,48;5,85848;889,491
33,5;5,86849;889,564
33,52;5,87902;889,645
33,54;5,88904;889,731
33,56;5,89935;889,829
33,58;5,90951;889,932
33,6;5,91984;890,032
33,62;5,93027;890,138
33,64;5,94055;890,227
33,66;5,95122;890,311
33,68;5,96154;890,39
33,7;5,97165;890,474
33,72;5,98194;890,556
33,74;5,99197;890,634
33,76;6,00272;890,708
33,78;6,01259;890,78
33,8;6,02275;890,851
33,82;6,03335;890,934
33,84;6,0439;891,046
33,86;6,05371;891,148
33,88;6,06454;891,25
33,9;6,07475;891,344
33,92;6,08483;891,412
33,94;6,09535;891,475
33,96;6,10562;891,546
33,98;6,11573;891,617
34;6,12613;891,689
34,02;6,13639;891,779
34,04;6,1469;891,863
34,06;6,15679;891,947
34,08;6,1672;892,037
34,1;6,17736;892,135
34,12;6,18814;892,231
34,14;6,19896;892,332
34,16;6,20873;892,433
34,18;6,2196;892,54
34,2;6,23019;892,644
34,22;6,24023;892,725
34,24;6,25134;892,789
34,26;6,26146;892,846
34,28;6,27208;892,896
34,3;6,28253;892,956
34,32;6,29315;893,029
34,34;6,30332;893,113
34,36;6,31386;893,213
34,38;6,32409;893,305
34,4;6,3348;893,383
34,42;6,34563;893,455
34,44;6,35558;893,526
34,46;6,36616;893,595
34,48;6,37656;893,654
34,5;6,38708;893,708
34,52;6,3972;893,769
34,54;6,40729;893,827
34,56;6,41772;893,876
34,58;6,4283;893,943
34,6;6,43869;894,023
34,62;6,4492;894,103
34,64;6,45958;894,191
34,66;6,47044;894,274
34,68;6,48091;894,353
34,7;6,49127;894,431
34,72;6,50174;894,507
34,74;6,51226;894,563
34,76;6,52289;894,619
34,78;6,53322;894,683
34,8;6,54389;894,754
34,82;6,55386;894,835
34,84;6,56514;894,935
34,86;6,57558;895,04
34,88;6,58642;895,128
34,9;6,59747;895,203
34,92;6,6079;895,263
34,94;6,61879;895,322
34,96;6,62961;895,392
34,98;6,63973;895,457
35;6,65092;895,52
35,02;6,66126;895,578
35,04;6,67144;895,634
35,06;6,68282;895,696
35,08;6,69284;895,785
35,1;6,70303;895,876
35,12;6,71523;895,979
35,14;6,72518;896,069
35,16;6,73592;896,142
35,18;6,74742;896,198
35,2;6,75745;896,251
35,22;6,76829;896,307
35,24;6,77946;896,368
35,26;6,79007;896,439
35,28;6,80015;896,512
35,3;6,81125;896,589
35,32;6,82243;896,663
35,34;6,83245;896,739
35,36;6,84336;896,796
35,38;6,85429;896,86
35,4;6,86515;896,911
35,42;6,87559;896,971
35,44;6,88684;897,045
35,46;6,89689;897,118
35,48;6,90805;897,17
35,5;6,91895;897,224
35,52;6,92952;897,274
35,54;6,94006;897,314
35,56;6,95077;897,375
35,58;6,96128;897,464
35,6;6,97229;897,568
35,62;6,98297;897,664
35,64;6,99385;897,743
35,66;7,00464;897,803
35,68;7,0155;897,858
35,7;7,02625;897,897
35,72;7,03711;897,94
35,74;7,04768;898,006
35,76;7,0587;898,081
35,78;7,06982;898,146
35,8;7,08023;898,217
35,82;7,09121;898,29
35,84;7,10221;898,351
35,86;7,11292;898,419
35,88;7,12433;898,484
35,9;7,13479;898,549
35,92;7,14594;898,612
35,94;7,15698;898,668
35,96;7,16753;898,717
35,98;7,17869;898,753
36;7,18953;898,786
36,02;7,20024;898,825
36,04;7,21127;898,882
36,06;7,22178;898,935
36,08;7,23273;899,019
36,1;7,24383;899,119
36,12;7,25436;899,205
36,14;7,26621;899,258
36,16;7,27705;899,302
36,18;7,28784;899,339
36,2;7,2993;899,365
36,22;7,3101;899,403
36,24;7,32088;899,467
36,26;7,33227;899,539
36,28;7,34294;899,609
36,3;7,35388;899,675
36,32;7,3651;899,74
36,34;7,37651;899,794
36,36;7,38739;899,862
36,38;7,39823;899,921
36,4;7,41005;899,979
36,42;7,42095;900,037
36,44;7,43184;900,099
36,46;7,44321;900,14
36,48;7,4543;900,178
36,5;7,465;900,217
36,52;7,47658;900,263
36,54;7,48695;900,307
36,56;7,49813;900,387
36,58;7,50922;900,479
36,6;7,52081;900,575
36,62;7,53179;900,643
36,64;7,54304;900,703
36,66;7,55426;900,725
36,68;7,56592;900,748
36,7;7,5762;900,773
36,72;7,58793;900,822
36,74;7,59898;900,863
36,76;7,60969;900,907
36,78;7,62129;900,955
36,8;7,63229;900,986
36,82;7,6431;901,033
36,84;7,654;901,096
36,86;7,66546;901,166
36,88;7,67661;901,236
36,9;7,68784;901,307
36,92;7,69904;901,345
36,94;7,71043;901,381
36,96;7,72146;901,407
36,98;7,73286;901,42
37;7,74362;901,443
37,02;7,75511;901,48
37,04;7,76607;901,538
37,06;7,777;901,602
37,08;7,78801;901,679
37,1;7,79946;901,748
37,12;7,81028;901,814
37,14;7,82172;901,852
37,16;7,83313;901,896
37,18;7,8442;901,939
37,2;7,85581;901,993
37,22;7,86707;902,04
37,24;7,87832;902,079
37,26;7,89017;902,114
37,28;7,90062;902,135
37,3;7,91236;902,157
37,32;7,92344;902,202
37,34;7,93455;902,278
37,36;7,94616;902,347
37,38;7,95725;902,423
37,4;7,96882;902,47
37,42;7,98012;902,492
37,44;7,99156;902,506
37,46;8,00235;902,512
37,48;8,01429;902,513
37,5;8,02557;902,547
37,52;8,03674;902,579
37,54;8,04786;902,607
37,56;8,0595;902,666
37,58;8,07037;902,727
37,6;8,08182;902,784
37,62;8,09328;902,848
37,64;8,1048;902,912
37,66;8,11584;902,949
37,68;8,12737;902,986
37,7;8,1386;903,023
37,72;8,14977;903,054
37,74;8,16094;903,075
37,76;8,17219;903,101
37,78;8,18339;903,127
37,8;8,1947;903,16
37,82;8,20602;903,221
37,84;8,21734;903,302
37,86;8,22879;903,378
37,88;8,24033;903,443
37,9;8,25167;903,488
37,92;8,26301;903,52
37,94;8,27447;903,539
37,96;8,28585;903,567
37,98;8,2974;903,6
38;8,30849;903,634
38,02;8,31991;903,665
38,04;8,33138;903,695
38,06;8,34238;903,719
38,08;8,35369;903,763
38,1;8,36551;903,804
38,12;8,37649;903,834
38,14;8,38843;903,87
38,16;8,39976;903,912
38,18;8,41096;903,943
38,2;8,42234;903,972
38,22;8,43372;903,997
38,24;8,44531;904,005
38,26;8,45649;904,019
38,28;8,46763;904,032
38,3;8,47912;904,065
38,32;8,49018;904,118
38,34;8,50183;904,181
38,36;8,51332;904,234
38,38;8,52418;904,28
38,4;8,53627;904,307
38,42;8,548;904,331
38,44;8,55922;904,368
38,46;8,57083;904,394
38,48;8,58248;904,419
38,5;8,59362;904,457
38,52;8,60543;904,477
38,54;8,61678;904,479
38,56;8,62792;904,497
38,58;8,63977;904,521
38,6;8,65158;904,547
38,62;8,66332;904,594
38,64;8,67519;904,641
38,66;8,68674;904,675
38,68;8,69893;904,706
38,7;8,71021;904,729
38,72;8,72195;904,736
38,74;8,73417;904,737
38,76;8,7451;904,753
38,78;8,75681;904,771
38,8;8,76876;904,8
38,82;8,77992;904,834
38,84;8,79169;904,88
38,86;8,80371;904,924
38,88;8,81541;904,957
38,9;8,82732;904,977
38,92;8,83922;904,994
38,94;8,85099;905,029
38,96;8,86264;905,054
38,98;8,87428;905,078
39;8,88638;905,093
39,02;8,8976;905,108
39,04;8,90917;905,112
39,06;8,92135;905,127
39,08;8,93276;905,164
39,1;8,94453;905,22
39,12;8,95674;905,273
39,14;8,96844;905,302
39,16;8,98025;905,31
39,18;8,99201;905,31
39,2;9,00408;905,296
39,22;9,01527;905,289
39,24;9,02752;905,296
39,26;9,0393;905,312
39,28;9,05106;905,333
39,3;9,06267;905,368
39,32;9,07442;905,412
39,34;9,08642;905,458
39,36;9,09821;905,498
39,38;9,11007;905,52
39,4;9,1218;905,528
39,42;9,13375;905,538
39,44;9,14594;905,557
39,46;9,15738;905,574
39,48;9,16978;905,593
39,5;9,18103;905,617
39,52;9,19316;905,629
39,54;9,20508;905,637
39,56;9,21683;905,658
39,58;9,22847;905,7
39,6;9,24041;905,739
39,62;9,25279;905,776
39,64;9,26455;905,801
39,66;9,27674;905,798
39,68;9,28886;905,782
39,7;9,3005;905,775
39,72;9,31283;905,765
39,74;9,3249;905,762
39,76;9,33679;905,797
39,78;9,34819;905,825
39,8;9,3606;905,845
39,82;9,37218;905,874
39,84;9,3843;905,906
39,86;9,39657;905,922
39,88;9,4089;905,941
39,9;9,42109;905,973
39,92;9,43341;905,992
39,94;9,44563;906,001
39,96;9,45771;905,995
39,98;9,46989;905,983
40;9,48221;905,954
40,02;9,49393;905,925
40,04;9,50616;905,928
40,06;9,51816;905,948
40,08;9,53036;905,988
40,1;9,54275;906,038
40,12;9,55497;906,082
40,14;9,56751;906,082
40,16;9,57958;906,072
40,18;9,59195;906,053
40,2;9,60394;906,035
40,22;9,6163;906,037
40,24;9,62825;906,05
40,26;9,64062;906,057
40,28;9,65281;906,058
40,3;9,66496;906,062
40,32;9,67692;906,056
40,34;9,68912;906,064
40,36;9,70139;906,09
40,38;9,71382;906,117
40,4;9,72572;906,131
40,42;9,73796;906,134
40,44;9,75054;906,135
40,46;9,76268;906,113
40,48;9,77483;906,087
40,5;9,78678;906,063
40,52;9,79928;906,044
40,54;9,81133;906,035
40,56;9,82367;906,057
40,58;9,83586;906,08
40,6;9,84815;906,087
40,62;9,86094;906,088
40,64;9,87349;906,062
40,66;9,88577;906,012
40,68;9,8981;905,968
40,7;9,91049;905,942
40,72;9,92323;905,881
40,74;9,9358;905,777
40,76;9,94905;905,555
40,78;9,9626;905,138
40,8;9,9765;904,499
40,82;9,99269;903,683
40,84;10,0087;902,669
40,86;10,0245;901,286
