"s";"%";"MPa"
0;0;5,57864
0,02;0,000175026;5,56127
0,04;0,000655675;5,56184
0,06;0,000531137;5,55841
0,08;-0,000149782;5,56483
0,1;-0,00132313;5,57743
0,12;-0,00188254;5,58777
0,14;-0,0023679;5,58485
0,16;-0,00189197;5,58205
0,18;-0,0017782;5,58698
0,2;-0,000204983;5,57909
0,22;0,000209695;5,56775
0,24;0,000526425;5,57054
0,26;0,000771798;5,58374
0,28;0,000457424;5,5829
0,3;-0,00138069;5,5945
0,32;-0,00147089;5,60404
0,34;-0,00188254;5,59523
0,36;-0,0018132;5,58203
0,38;-0,00162303;5,57855
0,4;-0,000399531;5,57214
0,42;0,000511615;5,56895
0,44;0,000637499;5,58383
0,46;0,000887921;5,59734
0,48;0,000688661;5,61378
0,5;-0,000776174;5,63522
0,52;-0,00108112;5,68123
0,54;-0,00141973;5,74137
0,56;-0,00153821;5,82346
0,58;-0,0011481;5,92367
0,6;0,000212051;6,03968
0,62;0,000872775;6,1661
0,64;0,00126692;6,30499
0,66;0,00159779;6,4651
0,68;0,00152475;6,63101
0,7;0,000390106;6,82126
0,72;0,000277013;7,02493
0,74;-0,000177046;7,24155
0,76;-0,000213397;7,46413
0,78;5,14981e-005;7,7049
0,8;0,00113262;7,95468
0,82;0,0020468;8,22856
0,84;0,00285798;8,51145
0,86;0,0031222;8,80713
0,88;0,00310941;9,12988
0,9;0,00265198;9,47212
0,92;0,00246114;9,81743
0,94;0,0020468;10,1893
0,96;0,00200001;10,5755
0,98;0,00225245;10,9802
1;0,00319625;11,4085
1,02;0,00431406;11,8493
1,04;0,00531272;12,2977
1,06;0,00585261;12,7681
1,08;0,00589939;13,2434
1,1;0,00569138;13,7169
1,12;0,00548572;14,207
1,14;0,00513533;14,6971
1,16;0,00515385;15,1891
1,18;0,00556852;15,6841
1,2;0,00657762;16,1725
1,22;0,00744164;16,6605
1,24;0,00895259;17,1601
1,26;0,0089122;17,6551
1,28;0,00950931;18,1476
1,3;0,00937905;18,6465
1,32;0,00901284;19,1491
1,34;0,00861095;19,6466
1,36;0,00865942;20,1399
1,38;0,00924744;20,6278
1,4;0,0100862;21,1332
1,42;0,0104033;21,6305
1,44;0,0127611;22,1279
1,46;0,0127281;22,6364
1,48;0,0127705;23,1497
1,5;0,0128614;23,6562
1,52;0,0127712;24,1727
1,54;0,0126265;24,6809
1,56;0,0126608;25,1847
1,58;0,0126887;25,6809
1,6;0,0133908;26,1699
1,62;0,0138244;26,6501
1,64;0,0159233;27,1389
1,66;0,0158796;27,637
1,68;0,0163841;28,1419
1,7;0,0165551;28,6378
1,72;0,0163572;29,1303
1,74;0,0160674;29,6165
1,76;0,0159907;30,0966
1,78;0,0159526;30,5821
1,8;0,0163966;31,0681
1,82;0,0172276;31,5531
1,84;0,018613;32,0538
1,86;0,01865;32,5418
1,88;0,0197544;33,0237
1,9;0,0197642;33,5293
1,92;0,0196107;34,0323
1,94;0,0193518;34,5241
1,96;0,0194942;35,0065
1,98;0,0193909;35,4968
2;0,0201199;35,9692
2,02;0,0209597;36,4513
2,04;0,021886;36,9338
2,06;0,0221613;37,4346
2,08;0,023265;37,9212
2,1;0,0232351;38,4113
2,12;0,0231351;38,9074
2,14;0,023088;39,3996
2,16;0,0230722;39,8854
2,18;0,0229261;40,3638
2,2;0,0232115;40,8467
2,22;0,0240456;41,3123
2,24;0,0243458;41,788
2,26;0,0256693;42,268
2,28;0,0260981;42,7477
2,3;0,026025;43,2334
2,32;0,0260853;43,7263
2,34;0,0259786;44,2166
2,36;0,0259446;44,693
2,38;0,0259029;45,1824
2,4;0,0260675;45,661
2,42;0,0266494;46,1375
2,44;0,0273428;46,606
2,46;0,0285091;47,0905
2,48;0,0288191;47,5613
2,5;0,0289917;48,0303
2,52;0,0291422;48,504
2,54;0,029048;48,9799
2,56;0,0290079;49,4525
2,58;0,0289988;49,926
2,6;0,0291701;50,4104
2,62;0,0299621;50,8872
2,64;0,0306175;51,3565
2,66;0,0317497;51,8244
2,68;0,0320204;52,3131
2,7;0,0320692;52,7869
2,72;0,0327272;53,2615
2,74;0,0325256;53,746
2,76;0,0324297;54,2331
2,78;0,0324401;54,7142
2,8;0,0324808;55,1948
2,82;0,0326888;55,6795
2,84;0,0339972;56,1593
2,86;0,0343856;56,6413
2,88;0,0356434;57,1127
2,9;0,0355539;57,5819
2,92;0,0356926;58,0554
2,94;0,0355596;58,5291
2,96;0,0354539;58,9918
2,98;0,035466;59,4565
3;0,0354893;59,9379
3,02;0,0355946;60,3981
3,04;0,036742;60,865
3,06;0,0373728;61,3342
3,08;0,0380281;61,8097
3,1;0,0380467;62,2594
3,12;0,0390648;62,7232
3,14;0,0388454;63,1812
3,16;0,0387643;63,6462
3,18;0,0387898;64,1113
3,2;0,0387774;64,5823
3,22;0,0388208;65,0512
3,24;0,0397939;65,5106
3,26;0,040113;65,9622
3,28;0,0413203;66,4066
3,3;0,0413987;66,8506
3,32;0,041839;67,2893
3,34;0,0416818;67,7317
3,36;0,0416673;68,1884
3,38;0,0416367;68,6421
3,4;0,0416583;69,103
3,42;0,0417185;69,56
3,44;0,0430433;70,0225
3,46;0,0430561;70,4818
3,48;0,0443651;70,9357
3,5;0,044455;71,3818
3,52;0,044529;71,8291
3,54;0,0445314;72,2706
3,56;0,0445543;72,7059
3,58;0,0444641;73,1453
3,6;0,0445024;73,584
3,62;0,0445391;74,031
3,64;0,0458198;74,4813
3,66;0,0458404;74,9193
3,68;0,0471292;75,3675
3,7;0,047218;75,8129
3,72;0,0472362;76,2565
3,74;0,0472971;76,7009
3,76;0,0474301;77,1537
3,78;0,0472571;77,597
3,8;0,0473823;78,0511
3,82;0,0474358;78,5037
3,84;0,0481376;78,9516
3,86;0,0484281;79,394
3,88;0,049765;79,8382
3,9;0,0498333;80,2785
3,92;0,0502803;80,7246
3,94;0,0505981;81,1664
3,96;0,0505708;81,615
3,98;0,0503456;82,0685
4;0,0506314;82,5199
4,02;0,0506095;82,9624
4,04;0,0508781;83,4009
4,06;0,0516748;83,8404
4,08;0,0523927;84,2844
4,1;0,0528535;84,7263
4,12;0,0530319;85,1786
4,14;0,0533318;85,6203
4,16;0,0533604;86,0666
4,18;0,0532022;86,4972
4,2;0,0534039;86,9205
4,22;0,0533894;87,3477
4,24;0,0534183;87,7943
4,26;0,0546364;88,2211
4,28;0,0553463;88,6506
4,3;0,0554241;89,0933
4,32;0,0562376;89,5262
4,34;0,0562413;89,9533
4,36;0,0562181;90,3922
4,38;0,0561225;90,8165
4,4;0,0562649;91,2498
4,42;0,0562053;91,6717
4,44;0,0562847;92,0943
4,46;0,0571272;92,511
4,48;0,0575998;92,9432
4,5;0,0581053;93,3582
4,52;0,059003;93,7918
4,54;0,058997;94,2217
4,56;0,0590081;94,6523
4,58;0,0589818;95,0867
4,6;0,0590252;95,5129
4,62;0,0589801;95,9274
4,64;0,0591807;96,3517
4,66;0,0598617;96,7701
4,68;0,0603379;97,1798
4,7;0,0607644;97,6006
4,72;0,061994;98,0276
4,74;0,0618199;98,4407
4,76;0,0618721;98,8783
4,78;0,0618862;99,3165
4,8;0,0618711;99,7459
4,82;0,0618485;100,165
4,84;0,061997;100,584
4,86;0,0630111;100,999
4,88;0,0632817;101,419
4,9;0,0634561;101,834
4,92;0,065304;102,251
4,94;0,0649367;102,683
4,96;0,0649462;103,093
4,98;0,0650384;103,507
5;0,0649852;103,947
5,02;0,0649024;104,372
5,04;0,0651767;104,788
5,06;0,065167;105,22
5,08;0,0657987;105,652
5,1;0,0665288;106,066
5,12;0,0671532;106,492
5,14;0,0671741;106,926
5,16;0,067621;107,345
5,18;0,0676187;107,757
5,2;0,0676015;108,168
5,22;0,0676012;108,585
5,24;0,0678089;108,986
5,26;0,0678328;109,399
5,28;0,0686396;109,81
5,3;0,0689529;110,235
5,32;0,0698954;110,645
5,34;0,069889;111,082
5,36;0,0705245;111,51
5,38;0,0704612;111,93
5,4;0,0704087;112,348
5,42;0,0704255;112,771
5,44;0,0706662;113,184
5,46;0,0706621;113,592
5,48;0,0712973;113,993
5,5;0,0719708;114,384
5,52;0,0723309;114,791
5,54;0,072885;115,186
5,56;0,0733824;115,589
5,58;0,0732875;115,999
5,6;0,0732734;116,428
5,62;0,0733249;116,845
5,64;0,0733777;117,27
5,66;0,0734265;117,687
5,68;0,074854;118,109
5,7;0,0749341;118,522
5,72;0,0753501;118,936
5,74;0,0758506;119,341
5,76;0,0762041;119,766
5,78;0,0761017;120,183
5,8;0,0762017;120,6
5,82;0,0761835;121,005
5,84;0,0761633;121,412
5,86;0,0762068;121,818
5,88;0,0772273;122,226
5,9;0,0772825;122,627
5,92;0,0780721;123,027
5,94;0,0785312;123,439
5,96;0,0786982;123,835
5,98;0,0786315;124,236
6;0,0789429;124,642
6,02;0,078924;125,051
6,04;0,0788783;125,447
6,06;0,0789399;125,843
6,08;0,0800112;126,241
6,1;0,0799244;126,632
6,12;0,080848;127,037
6,14;0,0809163;127,442
6,16;0,0809964;127,841
6,18;0,0812162;128,246
6,2;0,0817332;128,64
6,22;0,0815659;129,021
6,24;0,0816137;129,408
6,26;0,0816561;129,807
6,28;0,082502;130,198
6,3;0,0824956;130,6
6,32;0,0836827;130,999
6,34;0,0837312;131,397
6,36;0,0838628;131,787
6,38;0,0838924;132,168
6,4;0,0846595;132,56
6,42;0,0844327;132,963
6,44;0,0844566;133,359
6,46;0,084502;133,742
6,48;0,0845845;134,13
6,5;0,0846104;134,516
6,52;0,086159;134,897
6,54;0,0861291;135,285
6,56;0,0862681;135,679
6,58;0,0864875;136,077
6,6;0,0867417;136,469
6,62;0,0866582;136,855
6,64;0,0868484;137,243
6,66;0,0868527;137,632
6,68;0,0868928;138,013
6,7;0,0872863;138,401
6,72;0,0883505;138,793
6,74;0,0883092;139,183
6,76;0,0889806;139,572
6,78;0,0889975;139,959
6,8;0,089125;140,339
6,82;0,0891294;140,715
6,84;0,0891964;141,084
6,86;0,0893697;141,464
6,88;0,0896181;141,846
6,9;0,0901712;142,228
6,92;0,0906633;142,614
6,94;0,0910002;142,997
6,96;0,0916959;143,37
6,98;0,0918322;143,759
7;0,0918316;144,153
7,02;0,0918511;144,546
7,04;0,092191;144,943
7,06;0,092116;145,334
7,08;0,0924048;145,713
7,1;0,0927753;146,081
7,12;0,0930958;146,451
7,14;0,0932281;146,821
7,16;0,0943748;147,203
7,18;0,0943031;147,573
7,2;0,0944176;147,95
7,22;0,0944176;148,326
7,24;0,0944469;148,708
7,26;0,0944024;149,084
7,28;0,0950847;149,461
7,3;0,0953018;149,836
7,32;0,0955997;150,206
7,34;0,0957892;150,574
7,36;0,0967727;150,938
7,38;0,09677;151,306
7,4;0,0969097;151,674
7,42;0,0968908;152,038
7,44;0,0969652;152,403
7,46;0,0969491;152,76
7,48;0,0971231;153,134
7,5;0,0977178;153,501
7,52;0,0979154;153,875
7,54;0,0983062;154,24
7,56;0,0993971;154,609
7,58;0,0993604;154,967
7,6;0,0994974;155,335
7,62;0,0996424;155,695
7,64;0,0996576;156,059
7,66;0,0996414;156,428
7,68;0,100248;156,794
7,7;0,100323;157,161
7,72;0,10056;157,528
7,74;0,100808;157,895
7,76;0,101813;158,261
7,78;0,101786;158,621
7,8;0,102312;158,986
7,82;0,102237;159,351
7,84;0,102334;159,726
7,86;0,102319;160,102
7,88;0,102782;160,478
7,9;0,102782;160,845
7,92;0,103226;161,213
7,94;0,103449;161,575
7,96;0,103823;161,942
7,98;0,103995;162,31
8;0,104678;162,685
8,02;0,104765;163,045
8,04;0,104817;163,412
8,06;0,104814;163,776
8,08;0,104854;164,139
8,1;0,104832;164,495
8,12;0,105802;164,868
8,14;0,105867;165,229
8,16;0,106632;165,602
8,18;0,106766;165,978
8,2;0,107467;166,35
8,22;0,107405;166,715
8,24;0,107439;167,081
8,26;0,107481;167,431
8,28;0,107499;167,79
8,3;0,107481;168,151
8,32;0,108283;168,514
8,34;0,10845;168,874
8,36;0,10857;169,24
8,38;0,10958;169,592
8,4;0,10996;169,96
8,42;0,10989;170,321
8,44;0,110027;170,686
8,46;0,110187;171,051
8,48;0,110182;171,425
8,5;0,110204;171,776
8,52;0,111191;172,128
8,54;0,111215;172,49
8,56;0,111541;172,834
8,58;0,111899;173,181
8,6;0,112152;173,542
8,62;0,112241;173,898
8,64;0,112637;174,255
8,66;0,112744;174,603
8,68;0,112758;174,947
8,7;0,112792;175,286
8,72;0,11349;175,637
8,74;0,113485;175,972
8,76;0,114318;176,326
8,78;0,114403;176,67
8,8;0,114503;177,016
8,82;0,114731;177,358
8,84;0,115571;177,713
8,86;0,115441;178,062
8,88;0,115475;178,415
8,9;0,115531;178,758
8,92;0,11557;179,097
8,94;0,115673;179,434
8,96;0,11666;179,775
8,98;0,116882;180,115
9;0,116943;180,46
9,02;0,117503;180,811
9,04;0,117861;181,148
9,06;0,117761;181,491
9,08;0,117929;181,833
9,1;0,117949;182,168
9,12;0,117972;182,496
9,14;0,118661;182,828
9,16;0,119278;183,167
9,18;0,119328;183,506
9,2;0,119683;183,837
9,22;0,119797;184,168
9,24;0,119936;184,511
9,26;0,119886;184,83
9,28;0,120313;185,16
9,3;0,120314;185,506
9,32;0,120341;185,852
9,34;0,120716;186,191
9,36;0,121915;186,539
9,38;0,121888;186,883
9,4;0,122146;187,228
9,42;0,12229;187,576
9,44;0,122467;187,944
9,46;0,122461;188,325
9,48;0,12292;188,704
9,5;0,122928;189,09
9,52;0,122996;189,497
9,54;0,123277;189,899
9,56;0,12396;190,303
9,58;0,124011;190,715
9,6;0,124883;191,138
9,62;0,12503;191,553
9,64;0,125221;191,978
9,66;0,125259;192,415
9,68;0,125951;192,862
9,7;0,125914;193,314
9,72;0,126374;193,779
9,74;0,12653;194,245
9,76;0,127333;194,73
9,78;0,127386;195,21
9,8;0,128375;195,705
9,82;0,128347;196,189
9,84;0,128851;196,681
9,86;0,129125;197,168
9,88;0,129166;197,669
9,9;0,129221;198,175
9,92;0,130368;198,69
9,94;0,130487;199,209
9,96;0,130522;199,731
9,98;0,131278;200,262
10;0,131792;200,791
10,02;0,132065;201,335
10,04;0,132589;201,879
10,06;0,132866;202,426
10,08;0,133274;202,98
10,1;0,133452;203,556
10,12;0,134123;204,134
10,14;0,134445;204,723
10,16;0,134791;205,31
10,18;0,135117;205,906
10,2;0,13597;206,49
10,22;0,136331;207,09
10,24;0,136838;207,686
10,26;0,13742;208,298
10,28;0,137484;208,92
10,3;0,137686;209,558
10,32;0,138635;210,192
10,34;0,138695;210,842
10,36;0,139302;211,502
10,38;0,139689;212,165
10,4;0,14053;212,814
10,42;0,140758;213,481
10,44;0,141909;214,158
10,46;0,142027;214,831
10,48;0,142671;215,513
10,5;0,142774;216,205
10,52;0,143851;216,904
10,54;0,143816;217,595
10,56;0,144438;218,302
10,58;0,144851;219,007
10,6;0,145598;219,732
10,62;0,145904;220,45
10,64;0,147108;221,177
10,66;0,147134;221,907
10,68;0,147988;222,628
10,7;0,148243;223,359
10,72;0,148592;224,097
10,74;0,148756;224,834
10,76;0,150215;225,582
10,78;0,150518;226,341
10,8;0,151203;227,091
10,82;0,151394;227,843
10,84;0,152534;228,61
10,86;0,152629;229,367
10,88;0,153341;230,125
10,9;0,153624;230,898
10,92;0,15446;231,68
10,94;0,154466;232,462
10,96;0,155392;233,249
10,98;0,155944;234,054
11;0,156505;234,842
11,02;0,157185;235,623
11,04;0,158217;236,411
11,06;0,158253;237,205
11,08;0,159144;238,004
11,1;0,159468;238,814
11,12;0,160068;239,642
11,14;0,16026;240,465
11,16;0,16173;241,291
11,18;0,161913;242,118
11,2;0,163109;242,971
11,22;0,163767;243,819
11,24;0,164425;244,673
11,26;0,164622;245,531
11,28;0,165885;246,402
11,3;0,165979;247,255
11,32;0,16623;248,116
11,34;0,166967;248,981
11,36;0,168383;249,852
11,38;0,168365;250,717
11,4;0,169311;251,587
11,42;0,169962;252,453
11,44;0,170854;253,34
11,46;0,171105;254,219
11,48;0,172111;255,118
11,5;0,172243;256,018
11,52;0,173238;256,928
11,54;0,173551;257,82
11,56;0,174662;258,733
11,58;0,175008;259,63
11,6;0,176162;260,528
11,62;0,176856;261,426
11,64;0,177562;262,334
11,66;0,178024;263,219
11,68;0,178758;264,109
11,7;0,178984;265,003
11,72;0,179904;265,897
11,74;0,180602;266,789
11,76;0,181262;267,699
11,78;0,181682;268,604
11,8;0,183173;269,524
11,82;0,183661;270,438
11,84;0,184537;271,35
11,86;0,185331;272,27
11,88;0,18607;273,188
11,9;0,186147;274,078
11,92;0,187385;274,972
11,94;0,187635;275,86
11,96;0,187928;276,747
11,98;0,188716;277,634
12;0,18997;278,545
12,02;0,189992;279,441
12,04;0,191245;280,36
12,06;0,192087;281,268
12,08;0,192476;282,182
12,1;0,193134;283,09
12,12;0,194189;284,014
12,14;0,194488;284,929
12,16;0,195353;285,854
12,18;0,196028;286,777
12,2;0,196518;287,696
12,22;0,197441;288,623
12,24;0,198484;289,537
12,26;0,198926;290,458
12,28;0,199563;291,389
12,3;0,200309;292,325
12,32;0,201274;293,259
12,34;0,201659;294,201
12,36;0,202467;295,126
12,38;0,20318;296,04
12,4;0,204062;296,951
12,42;0,204393;297,85
12,44;0,205757;298,728
12,46;0,205985;299,613
12,48;0,206938;300,498
12,5;0,207433;301,371
12,52;0,208471;302,246
12,54;0,208535;303,129
12,56;0,209989;304,011
12,58;0,210149;304,898
12,6;0,210851;305,788
12,62;0,211565;306,674
12,64;0,212824;307,56
12,66;0,212947;308,428
12,68;0,214215;309,293
12,7;0,214377;310,158
12,72;0,215497;311,035
12,74;0,215595;311,92
12,76;0,216789;312,821
12,78;0,216886;313,712
12,8;0,218195;314,619
12,82;0,218584;315,519
12,84;0,219869;316,428
12,86;0,219967;317,341
12,88;0,221439;318,272
12,9;0,22161;319,183
12,92;0,222501;320,103
12,94;0,222968;321,013
12,96;0,224157;321,921
12,98;0,224259;322,836
13;0,225353;323,749
13,02;0,22612;324,664
13,04;0,227072;325,578
13,06;0,227477;326,488
13,08;0,22887;327,395
13,1;0,229054;328,321
13,12;0,229931;329,243
13,14;0,230466;330,169
13,16;0,231494;331,104
13,18;0,231762;332,029
13,2;0,233077;332,951
13,22;0,233564;333,862
13,24;0,234638;334,77
13,26;0,235487;335,653
13,28;0,236474;336,541
13,3;0,2367;337,422
13,32;0,237664;338,304
13,34;0,23811;339,188
13,36;0,238984;340,106
13,38;0,23933;341,024
13,4;0,240568;341,95
13,42;0,241226;342,892
13,44;0,24222;343,844
13,46;0,242729;344,785
13,48;0,244282;345,735
13,5;0,244415;346,679
13,52;0,245502;347,613
13,54;0,246073;348,537
13,56;0,246719;349,466
13,58;0,247163;350,375
13,6;0,248599;351,286
13,62;0,249087;352,193
13,64;0,249857;353,108
13,66;0,25066;354,015
13,68;0,251759;354,939
13,7;0,25194;355,852
13,72;0,253224;356,774
13,74;0,253674;357,692
13,76;0,254225;358,609
13,78;0,254954;359,517
13,8;0,256013;360,45
13,82;0,256596;361,371
13,84;0,257792;362,297
13,86;0,258373;363,224
13,88;0,259381;364,16
13,9;0,259824;365,099
13,92;0,261136;366,054
13,94;0,261425;367
13,96;0,262252;367,967
13,98;0,262877;368,925
14;0,264138;369,88
14,02;0,264473;370,847
14,04;0,265652;371,822
14,06;0,266395;372,774
14,08;0,267014;373,733
14,1;0,267788;374,69
14,12;0,268782;375,637
14,14;0,269263;376,59
14,16;0,270222;377,55
14,18;0,270891;378,502
14,2;0,271669;379,459
14,22;0,272251;380,409
14,24;0,273485;381,35
14,26;0,273711;382,286
14,28;0,274485;383,225
14,3;0,275171;384,168
14,32;0,276317;385,115
14,34;0,276381;386,065
14,36;0,277624;387,019
14,38;0,27827;387,984
14,4;0,278784;388,956
14,42;0,279571;389,928
14,44;0,280551;390,905
14,46;0,281168;391,887
14,48;0,282243;392,849
14,5;0,282775;393,8
14,52;0,283941;394,741
14,54;0,284045;395,673
14,56;0,285596;396,605
14,58;0,285975;397,544
14,6;0,286582;398,487
14,62;0,287254;399,426
14,64;0,28859;400,36
14,66;0,288807;401,305
14,68;0,289883;402,255
14,7;0,290618;403,193
14,72;0,291182;404,147
14,74;0,291834;405,122
14,76;0,293146;406,092
14,78;0,293401;407,049
14,8;0,294176;408,014
14,82;0,295082;408,979
14,84;0,296056;409,923
14,86;0,296357;410,881
14,88;0,297888;411,854
14,9;0,298087;412,819
14,92;0,299315;413,797
14,94;0,299739;414,77
14,96;0,300907;415,736
14,98;0,301002;416,707
15;0,302323;417,673
15,02;0,302767;418,626
15,04;0,303858;419,596
15,06;0,30413;420,557
15,08;0,305603;421,509
15,1;0,306062;422,464
15,12;0,3068;423,413
15,14;0,307657;424,347
15,16;0,308636;425,293
15,18;0,308784;426,242
15,2;0,310054;427,204
15,22;0,310488;428,178
15,24;0,311408;429,167
15,26;0,311908;430,148
15,28;0,313514;431,143
15,3;0,313594;432,131
15,32;0,314768;433,105
15,34;0,315526;434,072
15,36;0,316485;435,014
15,38;0,316566;435,924
15,4;0,318023;436,833
15,42;0,318242;437,748
15,44;0,319281;438,671
15,46;0,319894;439,604
15,48;0,321325;440,567
15,5;0,321404;441,513
15,52;0,322707;442,46
15,54;0,323356;443,391
15,56;0,323897;444,324
15,58;0,324429;445,249
15,6;0,325899;446,187
15,62;0,326052;447,128
15,64;0,326953;448,084
15,66;0,327741;449,034
15,68;0,328758;449,991
15,7;0,329253;450,947
15,72;0,330827;451,893
15,74;0,331005;452,827
15,76;0,332163;453,774
15,78;0,332612;454,689
15,8;0,333933;455,619
15,82;0,334132;456,548
15,84;0,33537;457,484
15,86;0,335903;458,401
15,88;0,336933;459,338
15,9;0,337456;460,263
15,92;0,338851;461,194
15,94;0,339298;462,143
15,96;0,340201;463,102
15,98;0,340907;464,082
16;0,341805;465,076
16,02;0,342444;466,071
16,04;0,343775;467,046
16,06;0,344321;468,034
16,08;0,345505;469,003
16,1;0,346106;469,948
16,12;0,347496;470,88
16,14;0,347878;471,835
16,16;0,349079;472,793
16,18;0,349577;473,763
16,2;0,350533;474,742
16,22;0,35114;475,726
16,24;0,352864;476,705
16,26;0,352995;477,654
16,28;0,35428;478,602
16,3;0,355185;479,54
16,32;0,356241;480,496
16,34;0,356619;481,444
16,36;0,358038;482,419
16,38;0,358579;483,398
16,4;0,35938;484,395
16,42;0,360248;485,363
16,44;0,361564;486,334
16,46;0,361672;487,286
16,48;0,362933;488,221
16,5;0,363852;489,146
16,52;0,364657;490,089
16,54;0,365242;491,014
16,56;0,366824;491,943
16,58;0,36706;492,876
16,6;0,368034;493,82
16,62;0,368933;494,766
16,64;0,36983;495,748
16,66;0,370414;496,74
16,68;0,372013;497,74
16,7;0,372395;498,74
16,72;0,373604;499,739
16,74;0,374264;500,713
16,76;0,375332;501,686
16,78;0,375979;502,648
16,8;0,376869;503,605
16,82;0,377903;504,568
16,84;0,378778;505,54
16,86;0,379364;506,503
16,88;0,380913;507,481
16,9;0,381228;508,435
16,92;0,382297;509,38
16,94;0,38331;510,321
16,96;0,384507;511,287
16,98;0,384685;512,24
17;0,386616;513,225
17,02;0,386782;514,223
17,04;0,388023;515,243
17,06;0,388648;516,252
17,08;0,389791;517,263
17,1;0,390277;518,255
17,12;0,391502;519,228
17,14;0,392136;520,184
17,16;0,393217;521,143
17,18;0,393712;522,108
17,2;0,395225;523,08
17,22;0,395807;524,062
17,24;0,396544;525,042
17,26;0,397462;526,025
17,28;0,398726;527,02
17,3;0,398955;528,028
17,32;0,40048;529,046
17,34;0,401193;530,067
17,36;0,402146;531,092
17,38;0,402961;532,09
17,4;0,404452;533,087
17,42;0,404684;534,077
17,44;0,405986;535,074
17,46;0,406693;536,055
17,48;0,4078;537,055
17,5;0,40816;538,04
17,52;0,409669;539,008
17,54;0,410482;539,973
17,56;0,411312;540,956
17,58;0,411986;541,939
17,6;0,413501;542,947
17,62;0,41378;543,984
17,64;0,415115;545,031
17,66;0,415799;546,068
17,68;0,41684;547,104
17,7;0,417276;548,12
17,72;0,418832;549,126
17,74;0,419478;550,115
17,76;0,420559;551,116
17,78;0,421472;552,117
17,8;0,422668;553,13
17,82;0,422837;554,139
17,84;0,424185;555,156
17,86;0,425141;556,149
17,88;0,425727;557,156
17,9;0,426481;558,174
17,92;0,428031;559,196
17,94;0,428572;560,233
17,96;0,429877;561,298
17,98;0,431129;562,341
18;0,431754;563,388
18,02;0,432431;564,437
18,04;0,433814;565,476
18,06;0,434218;566,499
18,08;0,43531;567,532
18,1;0,436339;568,55
18,12;0,437253;569,584
18,14;0,437985;570,635
18,16;0,439453;571,715
18,18;0,440522;572,817
18,2;0,441165;573,949
18,22;0,442036;575,068
18,24;0,443309;576,181
18,26;0,443925;577,271
18,28;0,444974;578,329
18,3;0,446094;579,369
18,32;0,44693;580,416
18,34;0,447473;581,453
18,36;0,449142;582,475
18,38;0,44999;583,515
18,4;0,450607;584,539
18,42;0,451887;585,557
18,44;0,45279;586,587
18,46;0,453132;587,64
18,48;0,454805;588,698
18,5;0,455635;589,782
18,52;0,45622;590,881
18,54;0,45741;591,966
18,56;0,458723;593,036
18,58;0,459249;594,096
18,6;0,460325;595,154
18,62;0,461452;596,171
18,64;0,462267;597,168
18,66;0,46291;598,183
18,68;0,464232;599,215
18,7;0,465061;600,244
18,72;0,465879;601,305
18,74;0,46719;602,404
18,76;0,468515;603,501
18,78;0,469291;604,584
18,8;0,470686;605,662
18,82;0,471617;606,736
18,84;0,472457;607,807
18,86;0,473206;608,888
18,88;0,474787;609,968
18,9;0,475286;611,042
18,92;0,476344;612,095
18,94;0,477642;613,147
18,96;0,478533;614,2
18,98;0,479372;615,258
19;0,480716;616,35
19,02;0,481863;617,475
19,04;0,482902;618,597
19,06;0,484207;619,706
19,08;0,485489;620,806
19,1;0,486177;621,894
19,12;0,487452;622,963
19,14;0,488943;624,03
19,16;0,489625;625,1
19,18;0,490761;626,186
19,2;0,492338;627,27
19,22;0,492901;628,369
19,24;0,494181;629,481
19,26;0,495492;630,595
19,28;0,496695;631,715
19,3;0,497611;632,826
19,32;0,499352;633,924
19,34;0,500215;635,027
19,36;0,501312;636,133
19,38;0,502591;637,225
19,4;0,503947;638,304
19,42;0,504849;639,379
19,44;0,506175;640,446
19,46;0,507305;641,518
19,48;0,508176;642,6
19,5;0,509526;643,712
19,52;0,510994;644,848
19,54;0,511865;645,973
19,56;0,513316;647,086
19,58;0,514471;648,174
19,6;0,515688;649,244
19,62;0,516677;650,311
19,64;0,518179;651,394
19,66;0,519251;652,475
19,68;0,520526;653,579
19,7;0,521685;654,686
19,72;0,523395;655,772
19,74;0,524249;656,843
19,76;0,525869;657,936
19,78;0,527;659,018
19,8;0,528515;660,098
19,82;0,529294;661,194
19,84;0,531098;662,29
19,86;0,532379;663,367
19,88;0,533016;664,445
19,9;0,534586;665,504
19,92;0,536387;666,544
19,94;0,537;667,576
19,96;0,538646;668,62
19,98;0,539962;669,664
20;0,541101;670,746
20,02;0,542469;671,844
20,04;0,544148;672,944
20,06;0,545191;674,021
20,08;0,546866;675,092
20,1;0,548236;676,145
20,12;0,549391;677,194
20,14;0,550531;678,247
20,16;0,552433;679,308
20,18;0,553391;680,37
20,2;0,554937;681,427
20,22;0,556348;682,488
20,24;0,55786;683,561
20,26;0,558956;684,625
20,28;0,560849;685,706
20,3;0,562082;686,784
20,32;0,563521;687,851
20,34;0,565004;688,903
20,36;0,566964;689,961
20,38;0,567994;690,983
20,4;0,569914;691,987
20,42;0,57151;692,992
20,44;0,572863;693,984
20,46;0,574117;694,986
20,48;0,576008;696,026
20,5;0,577198;697,089
20,52;0,578853;698,142
20,54;0,580467;699,186
20,56;0,582347;700,214
20,58;0,58363;701,214
20,6;0,585668;702,211
20,62;0,587151;703,207
20,64;0,588766;704,231
20,66;0,590245;705,249
20,68;0,592261;706,272
20,7;0,593466;707,289
20,72;0,59515;708,308
20,74;0,596918;709,322
20,76;0,598734;710,353
20,78;0,600362;711,378
20,8;0,602717;712,403
20,82;0,604453;713,419
20,84;0,605967;714,421
20,86;0,607794;715,396
20,88;0,609701;716,361
20,9;0,611115;717,306
20,92;0,612917;718,252
20,94;0,61495;719,216
20,96;0,616486;720,203
20,98;0,618414;721,195
21;0,62075;722,202
21,02;0,622283;723,213
21,04;0,624543;724,202
21,06;0,626528;725,169
21,08;0,628439;726,131
21,1;0,630168;727,099
21,12;0,63241;728,054
21,14;0,634404;729,015
21,16;0,636351;729,965
21,18;0,638427;730,905
21,2;0,640717;731,833
21,22;0,642368;732,761
21,24;0,644636;733,712
21,26;0,646659;734,682
21,28;0,648762;735,672
21,3;0,6508;736,647
21,32;0,653437;737,609
21,34;0,655268;738,524
21,36;0,657834;739,443
21,38;0,659883;740,344
21,4;0,662408;741,232
21,42;0,664404;742,136
21,44;0,667018;743,061
21,46;0,668829;743,958
21,48;0,671381;744,871
21,5;0,67367;745,798
21,52;0,67632;746,723
21,54;0,678401;747,629
21,56;0,681164;748,542
21,58;0,68366;749,428
21,6;0,686109;750,31
21,62;0,688468;751,193
21,64;0,691363;752,058
21,66;0,693378;752,909
21,68;0,696018;753,763
21,7;0,698606;754,614
21,72;0,701045;755,467
21,74;0,703717;756,339
21,76;0,707096;757,228
21,78;0,709565;758,103
21,8;0,712554;758,973
21,82;0,715429;759,811
21,84;0,718558;760,641
21,86;0,720977;761,464
21,88;0,724079;762,289
21,9;0,7269;763,1
21,92;0,729751;763,921
21,94;0,732721;764,72
21,96;0,736092;765,521
21,98;0,738814;766,329
22;0,742081;767,136
22,02;0,74523;767,955
22,04;0,748413;768,773
22,06;0,7515;769,566
22,08;0,755247;770,359
22,1;0,758048;771,135
22,12;0,761514;771,886
22,14;0,764828;772,618
22,16;0,768406;773,358
22,18;0,77143;774,084
22,2;0,775532;774,838
22,22;0,778665;775,593
22,24;0,782263;776,37
22,26;0,785968;777,143
22,28;0,78986;777,91
22,3;0,793234;778,643
22,32;0,797606;779,371
22,34;0,801134;780,092
22,36;0,805232;780,803
22,38;0,809038;781,505
22,4;0,813612;782,202
22,42;0,817155;782,89
22,44;0,821359;783,568
22,46;0,825332;784,233
22,48;0,829805;784,905
22,5;0,833633;785,578
22,52;0,838611;786,253
22,54;0,842718;786,929
22,56;0,847338;787,598
22,58;0,851514;788,243
22,6;0,856577;788,879
22,62;0,860523;789,497
22,64;0,865497;790,089
22,66;0,869909;790,666
22,68;0,874862;791,26
22,7;0,879203;791,845
22,72;0,884563;792,434
22,74;0,888985;793,053
22,76;0,894123;793,678
22,78;0,899151;794,273
22,8;0,904629;794,861
22,82;0,909529;795,432
22,84;0,915158;795,982
22,86;0,920212;796,531
22,88;0,925549;797,093
22,9;0,930906;797,648
22,92;0,936749;798,189
22,94;0,941561;798,701
22,96;0,947244;799,201
22,98;0,952774;799,695
23;0,958408;800,199
23,02;0,964261;800,712
23,04;0,970733;801,225
23,06;0,976275;801,725
23,08;0,982629;802,202
23,1;0,988599;802,665
23,12;0,994723;803,102
23,14;1,00058;803,546
23,16;1,00689;803,989
23,18;1,01259;804,424
23,2;1,01903;804,862
23,22;1,02485;805,317
23,24;1,03149;805,756
23,26;1,03753;806,185
23,28;1,0444;806,617
23,3;1,05093;807,022
23,32;1,05748;807,419
23,34;1,06429;807,832
23,36;1,07127;808,251
23,38;1,07766;808,653
23,4;1,08509;809,049
23,42;1,09179;809,436
23,44;1,09902;809,802
23,46;1,10574;810,166
23,48;1,1129;810,542
23,5;1,1199;810,932
23,52;1,12713;811,314
23,54;1,13431;811,68
23,56;1,14243;812,03
23,58;1,1491;812,358
23,6;1,15707;812,668
23,62;1,16436;812,984
23,64;1,17182;813,302
23,66;1,1793;813,62
23,68;1,18733;813,959
23,7;1,19437;814,285
23,72;1,20211;814,608
23,74;1,20945;814,92
23,76;1,21717;815,244
23,78;1,22465;815,545
23,8;1,23297;815,858
23,82;1,24024;816,153
23,84;1,24821;816,456
23,86;1,25633;816,73
23,88;1,26419;817,002
23,9;1,27185;817,255
23,92;1,28065;817,523
23,94;1,28772;817,783
23,96;1,29593;818,067
23,98;1,30375;818,346
24;1,31238;818,665
24,02;1,31995;818,952
24,04;1,32857;819,241
24,06;1,33689;819,494
24,08;1,3452;819,739
24,1;1,35345;819,958
24,12;1,36237;820,203
24,14;1,36998;820,44
24,16;1,37919;820,696
24,18;1,38715;820,956
24,2;1,39518;821,207
24,22;1,40408;821,448
24,24;1,41243;821,698
24,26;1,42068;821,942
24,28;1,42978;822,186
24,3;1,4382;822,439
24,32;1,44674;822,672
24,34;1,45521;822,905
24,36;1,46414;823,132
24,38;1,47246;823,336
24,4;1,48129;823,527
24,42;1,49003;823,742
24,44;1,49861;823,954
24,46;1,50723;824,186
24,48;1,51622;824,447
24,5;1,52479;824,712
24,52;1,53401;824,961
24,54;1,54298;825,19
24,56;1,55206;825,394
24,58;1,56075;825,582
24,6;1,56998;825,78
24,62;1,57876;825,98
24,64;1,58775;826,186
24,66;1,59696;826,394
24,68;1,60599;826,6
24,7;1,61478;826,791
24,72;1,62425;826,987
24,74;1,63292;827,194
24,76;1,64202;827,405
24,78;1,65115;827,618
24,8;1,66039;827,836
24,82;1,66932;828,044
24,84;1,67852;828,237
24,86;1,68794;828,421
24,88;1,69688;828,604
24,9;1,70601;828,778
24,92;1,71548;828,962
24,94;1,72407;829,173
24,96;1,73328;829,394
24,98;1,74255;829,618
25;1,75174;829,853
25,02;1,76116;830,077
25,04;1,77069;830,266
25,06;1,77993;830,452
25,08;1,78945;830,646
25,1;1,79876;830,825
25,12;1,80802;831,008
25,14;1,8174;831,196
25,16;1,82674;831,371
25,18;1,83597;831,533
25,2;1,84525;831,709
25,22;1,8549;831,893
25,24;1,864;832,092
25,26;1,87338;832,305
25,28;1,88296;832,522
25,3;1,89224;832,724
25,32;1,90181;832,9
25,34;1,91118;833,067
25,36;1,92035;833,236
25,38;1,92966;833,387
25,4;1,939;833,556
25,42;1,94823;833,733
25,44;1,95746;833,921
25,46;1,96675;834,108
25,48;1,97609;834,312
25,5;1,98552;834,502
25,52;1,99487;834,694
25,54;2,00462;834,887
25,56;2,01381;835,069
25,58;2,02335;835,257
25,6;2,03282;835,453
25,62;2,0421;835,636
25,64;2,05151;835,803
25,66;2,06078;835,965
25,68;2,07009;836,119
25,7;2,07909;836,266
25,72;2,08858;836,446
25,74;2,09796;836,636
25,76;2,10719;836,844
25,78;2,11668;837,04
25,8;2,12615;837,23
25,82;2,13539;837,395
25,84;2,14477;837,55
25,86;2,15413;837,698
25,88;2,16331;837,85
25,9;2,1727;838,007
25,92;2,18193;838,174
25,94;2,1911;838,34
25,96;2,20046;838,518
25,98;2,20981;838,704
26;2,21918;838,89
26,02;2,22862;839,072
26,04;2,23841;839,265
26,06;2,24766;839,443
26,08;2,25714;839,623
26,1;2,26661;839,8
26,12;2,27593;839,966
26,14;2,28542;840,114
26,16;2,29478;840,267
26,18;2,3041;840,417
26,2;2,31326;840,579
26,22;2,32283;840,761
26,24;2,33204;840,955
26,26;2,34139;841,144
26,28;2,35097;841,326
26,3;2,36042;841,479
26,32;2,36977;841,632
26,34;2,37919;841,778
26,36;2,38852;841,92
26,38;2,39769;842,065
26,4;2,40719;842,227
26,42;2,41633;842,375
26,44;2,42547;842,53
26,46;2,43482;842,681
26,48;2,44395;842,846
26,5;2,45327;843,016
26,52;2,46265;843,204
26,54;2,4723;843,388
26,56;2,48153;843,573
26,58;2,49104;843,733
26,6;2,50036;843,895
26,62;2,50953;844,043
26,64;2,51909;844,184
26,66;2,52836;844,323
26,68;2,5377;844,489
26,7;2,54684;844,639
26,72;2,55609;844,801
26,74;2,56521;844,965
26,76;2,57477;845,134
26,78;2,5841;845,273
26,8;2,59339;845,418
26,82;2,60274;845,546
26,84;2,61183;845,681
26,86;2,62099;845,821
26,88;2,63003;845,972
26,9;2,63931;846,11
26,92;2,64794;846,248
26,94;2,65682;846,385
26,96;2,66576;846,517
26,98;2,67443;846,66
27;2,68352;846,816
27,02;2,69264;846,976
27,04;2,70157;847,123
27,06;2,71054;847,257
27,08;2,71949;847,379
27,1;2,72816;847,505
27,12;2,73701;847,617
27,14;2,74568;847,727
27,16;2,75419;847,853
27,18;2,76264;847,979
27,2;2,7711;848,096
27,22;2,77957;848,215
27,24;2,7877;848,341
27,26;2,79627;848,445
27,28;2,80434;848,53
27,3;2,81248;848,585
27,32;2,82048;848,635
27,34;2,82829;848,669
27,36;2,83566;848,664
27,38;2,84301;848,591
27,4;2,84971;848,414
27,42;2,85577;848,017
27,44;2,86095;847,176
27,46;2,86463;845,429
27,48;2,8659;842,226
27,5;2,86479;837,559
27,52;2,85942;831,95
27,54;2,85308;826,071
27,56;2,8489;820,744
27,58;2,84625;816,732
27,6;2,8449;814,216
27,62;2,84426;812,861
27,64;2,84399;812,265
27,66;2,84402;812,153
27,68;2,84411;812,363
27,7;2,8446;812,776
27,72;2,84512;813,34
27,74;2,84574;814,018
27,76;2,84647;814,775
27,78;2,84745;815,575
27,8;2,84804;816,435
27,82;2,84913;817,322
27,84;2,8499;818,227
27,86;2,85061;819,147
27,88;2,85169;820,069
27,9;2,85252;820,981
27,92;2,85341;821,902
27,94;2,85443;822,841
27,96;2,85531;823,788
27,98;2,85633;824,785
28;2,85745;825,824
28,02;2,85847;826,855
28,04;2,85972;827,878
28,06;2,86085;828,89
28,08;2,86201;829,887
28,1;2,86306;830,868
28,12;2,86437;831,86
28,14;2,86568;832,846
28,16;2,86698;833,846
28,18;2,86842;834,838
28,2;2,87003;835,816
28,22;2,87151;836,793
28,24;2,87339;837,767
28,26;2,87536;838,703
28,28;2,87737;839,608
28,3;2,87963;840,494
28,32;2,882;841,324
28,34;2,88448;842,102
28,36;2,88727;842,841
28,38;2,89033;843,525
28,4;2,89343;844,154
28,42;2,89673;844,751
28,44;2,90034;845,315
28,46;2,904;845,87
28,48;2,90807;846,412
28,5;2,9124;846,911
28,52;2,91677;847,375
28,54;2,92152;847,79
28,56;2,92649;848,154
28,58;2,93147;848,489
28,6;2,9369;848,826
28,62;2,94248;849,142
28,64;2,94816;849,459
28,66;2,95406;849,758
28,68;2,96033;850,023
28,7;2,96639;850,265
28,72;2,97284;850,51
28,74;2,97958;850,742
28,76;2,98634;850,975
28,78;2,99338;851,208
28,8;3,00071;851,429
28,82;3,00777;851,619
28,84;3,01511;851,783
28,86;3,02246;851,928
28,88;3,02996;852,072
28,9;3,03754;852,207
28,92;3,04522;852,36
28,94;3,05272;852,54
28,96;3,06057;852,721
28,98;3,06834;852,904
29;3,0764;853,086
29,02;3,08437;853,255
29,04;3,09258;853,394
29,06;3,10063;853,537
29,08;3,10879;853,688
29,1;3,11699;853,829
29,12;3,12527;853,972
29,14;3,13342;854,122
29,16;3,14191;854,273
29,18;3,15003;854,407
29,2;3,1583;854,549
29,22;3,16684;854,701
29,24;3,17536;854,871
29,26;3,184;855,047
29,28;3,19281;855,217
29,3;3,20171;855,374
29,32;3,21038;855,52
29,34;3,21912;855,638
29,36;3,22784;855,747
29,38;3,23649;855,863
29,4;3,24532;855,991
29,42;3,25393;856,13
29,44;3,2628;856,279
29,46;3,27165;856,429
29,48;3,28054;856,58
29,5;3,28965;856,734
29,52;3,29866;856,872
29,54;3,30776;857,009
29,56;3,31668;857,14
29,58;3,32553;857,273
29,6;3,33443;857,411
29,62;3,34351;857,536
29,64;3,35238;857,653
29,66;3,36164;857,773
29,68;3,3703;857,899
29,7;3,37938;858,026
29,72;3,38831;858,186
29,74;3,39729;858,364
29,76;3,40648;858,535
29,78;3,41573;858,694
29,8;3,42473;858,841
29,82;3,43398;858,97
29,84;3,44311;859,098
29,86;3,45218;859,235
29,88;3,46143;859,36
29,9;3,47072;859,496
29,92;3,47975;859,632
29,94;3,48877;859,762
29,96;3,49814;859,901
29,98;3,50707;860,057
30;3,51647;860,201
30,02;3,52604;860,348
30,04;3,53523;860,494
30,06;3,54458;860,629
30,08;3,55379;860,764
30,1;3,56293;860,892
30,12;3,57216;861,006
30,14;3,58142;861,127
30,16;3,59055;861,251
30,18;3,59975;861,375
30,2;3,60898;861,522
30,22;3,6184;861,68
30,24;3,6276;861,837
30,26;3,63716;861,983
30,28;3,64671;862,124
30,3;3,65601;862,249
30,32;3,66552;862,38
30,34;3,67488;862,506
30,36;3,68409;862,641
30,38;3,69369;862,776
30,4;3,70287;862,912
30,42;3,71185;863,033
30,44;3,72129;863,153
30,46;3,73031;863,272
30,48;3,73981;863,404
30,5;3,74917;863,544
30,52;3,75865;863,695
30,54;3,76808;863,848
30,56;3,77742;863,988
30,58;3,78697;864,111
30,6;3,79595;864,233
30,62;3,80535;864,352
30,64;3,81461;864,46
30,66;3,82367;864,588
30,68;3,83289;864,725
30,7;3,84192;864,866
30,72;3,85122;865,013
30,74;3,86051;865,173
30,76;3,86992;865,325
30,78;3,87924;865,467
30,8;3,88879;865,604
30,82;3,89805;865,729
30,84;3,90768;865,855
30,86;3,91705;865,99
30,88;3,92643;866,117
30,9;3,9358;866,225
30,92;3,94516;866,344
30,94;3,95444;866,463
30,96;3,96371;866,584
30,98;3,97319;866,72
31;3,98287;866,867
31,02;3,9922;867,012
31,04;4,00196;867,148
31,06;4,01143;867,264
31,08;4,0209;867,377
31,1;4,03031;867,492
31,12;4,03978;867,606
31,14;4,0493;867,717
31,16;4,05868;867,836
31,18;4,06791;867,966
31,2;4,07731;868,095
31,22;4,08645;868,224
31,24;4,09586;868,359
31,26;4,1054;868,496
31,28;4,11479;868,617
31,3;4,12458;868,732
31,32;4,13396;868,868
31,34;4,14346;869,004
31,36;4,15279;869,13
31,38;4,16245;869,255
31,4;4,17193;869,388
31,42;4,18133;869,499
31,44;4,19066;869,624
31,46;4,20008;869,766
31,48;4,20955;869,919
31,5;4,21908;870,07
31,52;4,22869;870,209
31,54;4,23841;870,329
31,56;4,24785;870,439
31,58;4,25718;870,536
31,6;4,26667;870,625
31,62;4,27608;870,729
31,64;4,28539;870,842
31,66;4,29487;870,963
31,68;4,30386;871,094
31,7;4,31334;871,22
31,72;4,32251;871,353
31,74;4,33187;871,474
31,76;4,34143;871,597
31,78;4,35081;871,72
31,8;4,36021;871,862
31,82;4,36953;871,991
31,84;4,37905;872,113
31,86;4,38853;872,229
31,88;4,39785;872,326
31,9;4,40759;872,411
31,92;4,41691;872,515
31,94;4,42601;872,639
31,96;4,43544;872,765
31,98;4,44487;872,916
32;4,4542;873,085
32,02;4,464;873,221
32,04;4,47349;873,331
32,06;4,48298;873,439
32,08;4,49256;873,537
32,1;4,50208;873,632
32,12;4,5116;873,747
32,14;4,5211;873,868
32,16;4,53047;873,987
32,18;4,53954;874,104
32,2;4,54899;874,216
32,22;4,55835;874,324
32,24;4,56775;874,454
32,26;4,57728;874,576
32,28;4,58689;874,697
32,3;4,59619;874,82
32,32;4,60577;874,931
32,34;4,61534;875,037
32,36;4,62456;875,146
32,38;4,6342;875,249
32,4;4,6436;875,362
32,42;4,65292;875,472
32,44;4,66232;875,592
32,46;4,67199;875,728
32,48;4,68138;875,873
32,5;4,69087;875,999
32,52;4,70075;876,122
32,54;4,71027;876,218
32,56;4,71972;876,306
32,58;4,72949;876,403
32,6;4,73873;876,507
32,62;4,74834;876,616
32,64;4,75813;876,74
32,66;4,76742;876,854
32,68;4,77709;876,949
32,7;4,78652;877,051
32,72;4,79602;877,168
32,74;4,80555;877,278
32,76;4,815;877,403
32,78;4,82476;877,542
32,8;4,83412;877,662
32,82;4,84356;877,762
32,84;4,85337;877,861
32,86;4,86244;877,941
32,88;4,8722;878,02
32,9;4,88176;878,108
32,92;4,89097;878,225
32,94;4,90035;878,355
32,96;4,90981;878,506
32,98;4,91931;878,644
33;4,92877;878,786
33,02;4,93846;878,891
33,04;4,94821;878,996
33,06;4,95742;879,091
33,08;4,96696;879,193
33,1;4,97621;879,29
33,12;4,98566;879,394
33,14;4,99499;879,49
33,16;5,00435;879,569
33,18;5,01359;879,648
33,2;5,0231;879,748
33,22;5,03242;879,859
33,24;5,04198;879,976
33,26;5,0513;880,12
33,28;5,06083;880,241
33,3;5,07031;880,336
33,32;5,07952;880,429
33,34;5,08898;880,519
33,36;5,09839;880,592
33,38;5,10785;880,696
33,4;5,11765;880,801
33,42;5,12662;880,916
33,44;5,13639;881,04
33,46;5,14553;881,157
33,48;5,15498;881,281
33,5;5,16443;881,404
33,52;5,17384;881,51
33,54;5,18336;881,607
33,56;5,19331;881,715
33,58;5,20207;881,816
33,6;5,21198;881,92
33,62;5,22121;882,023
33,64;5,23068;882,112
33,66;5,24006;882,197
33,68;5,24979;882,272
33,7;5,25894;882,363
33,72;5,26869;882,485
33,74;5,27799;882,619
33,76;5,28776;882,749
33,78;5,29726;882,868
33,8;5,30707;882,972
33,82;5,31644;883,05
33,84;5,32575;883,134
33,86;5,33534;883,206
33,88;5,34477;883,295
33,9;5,35383;883,389
33,92;5,36394;883,485
33,94;5,37252;883,579
33,96;5,38247;883,69
33,98;5,39192;883,804
34;5,40168;883,916
34,02;5,41133;884,032
34,04;5,4214;884,152
34,06;5,43084;884,273
34,08;5,44022;884,381
34,1;5,45011;884,478
34,12;5,45983;884,567
34,14;5,46921;884,655
34,16;5,47921;884,744
34,18;5,48881;884,844
34,2;5,49816;884,953
34,22;5,50826;885,07
34,24;5,51776;885,18
34,26;5,52764;885,281
34,28;5,53762;885,367
34,3;5,54695;885,438
34,32;5,55696;885,522
34,34;5,56631;885,6
34,36;5,576;885,672
34,38;5,58564;885,758
34,4;5,59516;885,858
34,42;5,60466;885,936
34,44;5,61421;886,024
34,46;5,62386;886,126
34,48;5,63374;886,236
34,5;5,64316;886,357
34,52;5,65342;886,48
34,54;5,66283;886,587
34,56;5,67262;886,695
34,58;5,68242;886,781
34,6;5,69194;886,858
34,62;5,70154;886,931
34,64;5,71164;887,017
34,66;5,72063;887,111
34,68;5,73055;887,216
34,7;5,74;887,316
34,72;5,74958;887,423
34,74;5,75942;887,534
34,76;5,76916;887,628
34,78;5,77906;887,712
34,8;5,78857;887,8
34,82;5,7983;887,894
34,84;5,80825;887,985
34,86;5,8174;888,079
34,88;5,8275;888,169
34,9;5,83673;888,24
34,92;5,84615;888,315
34,94;5,85591;888,397
34,96;5,86521;888,49
34,98;5,87502;888,602
35;5,88505;888,729
35,02;5,89447;888,829
35,04;5,90456;888,917
35,06;5,91408;888,991
35,08;5,92387;889,058
35,1;5,93359;889,128
35,12;5,94329;889,209
35,14;5,95307;889,297
35,16;5,96291;889,395
35,18;5,97224;889,498
35,2;5,98251;889,609
35,22;5,99168;889,717
35,24;6,00177;889,816
35,26;6,01147;889,899
35,28;6,02135;889,981
35,3;6,03141;890,065
35,32;6,04112;890,164
35,34;6,05081;890,258
35,36;6,06103;890,354
35,38;6,0704;890,421
35,4;6,08037;890,493
35,42;6,08976;890,562
35,44;6,09959;890,648
35,46;6,10933;890,758
35,48;6,11908;890,897
35,5;6,12898;891,012
35,52;6,13901;891,124
35,54;6,14885;891,216
35,56;6,15894;891,293
35,58;6,16805;891,358
35,6;6,17845;891,44
35,62;6,18773;891,517
35,64;6,19778;891,609
35,66;6,20749;891,71
35,68;6,21712;891,806
35,7;6,22717;891,895
35,72;6,23702;891,992
35,74;6,24659;892,08
35,76;6,25719;892,164
35,78;6,26672;892,248
35,8;6,27691;892,329
35,82;6,28662;892,394
35,84;6,29656;892,471
35,86;6,3067;892,525
35,88;6,31594;892,578
35,9;6,32607;892,635
35,92;6,33585;892,717
35,94;6,34499;892,793
35,96;6,35539;892,898
35,98;6,36487;893,014
36;6,37466;893,131
36,02;6,38488;893,205
36,04;6,39487;893,267
36,06;6,40466;893,33
36,08;6,41461;893,386
36,1;6,42434;893,451
36,12;6,43456;893,55
36,14;6,44392;893,642
36,16;6,45433;893,733
36,18;6,46362;893,827
36,2;6,47351;893,919
36,22;6,48351;894,004
36,24;6,49327;894,095
36,26;6,50334;894,174
36,28;6,5135;894,256
36,3;6,52307;894,328
36,32;6,53342;894,398
36,34;6,54256;894,467
36,36;6,55276;894,528
36,38;6,56258;894,582
36,4;6,57213;894,641
36,42;6,58198;894,716
36,44;6,59164;894,816
36,46;6,60135;894,926
36,48;6,61144;895,029
36,5;6,62079;895,111
36,52;6,63093;895,172
36,54;6,64036;895,219
36,56;6,64988;895,269
36,58;6,65989;895,337
36,6;6,66911;895,423
36,62;6,679;895,511
36,64;6,68885;895,605
36,66;6,69843;895,696
36,68;6,70858;895,775
36,7;6,71813;895,857
36,72;6,72815;895,961
36,74;6,73806;896,057
36,76;6,74797;896,145
36,78;6,75812;896,232
36,8;6,76783;896,307
36,82;6,77799;896,36
36,84;6,78777;896,418
36,86;6,7976;896,46
36,88;6,80773;896,516
36,9;6,81723;896,597
36,92;6,827;896,681
36,94;6,83667;896,763
36,96;6,84648;896,881
36,98;6,85658;896,979
37;6,86675;897,059
37,02;6,87657;897,126
37,04;6,88709;897,194
37,06;6,89634;897,25
37,08;6,90663;897,318
37,1;6,91651;897,381
37,12;6,92618;897,448
37,14;6,93632;897,515
37,16;6,94613;897,571
37,18;6,95601;897,638
37,2;6,96592;897,727
37,22;6,97591;897,832
37,24;6,98612;897,935
37,26;6,9958;898,045
37,28;7,00618;898,125
37,3;7,01625;898,187
37,32;7,02605;898,237
37,34;7,03629;898,279
37,36;7,04651;898,315
37,38;7,05628;898,384
37,4;7,06693;898,456
37,42;7,07652;898,529
37,44;7,08695;898,617
37,46;7,09669;898,699
37,48;7,10702;898,778
37,5;7,11745;898,841
37,52;7,12739;898,903
37,54;7,13752;898,958
37,56;7,14826;899,028
37,58;7,15775;899,09
37,6;7,1684;899,165
37,62;7,17835;899,223
37,64;7,18845;899,277
37,66;7,19806;899,328
37,68;7,20837;899,387
37,7;7,21841;899,466
37,72;7,22848;899,58
37,74;7,2385;899,684
37,76;7,24929;899,782
37,78;7,25905;899,864
37,8;7,26973;899,928
37,82;7,27957;899,971
37,84;7,28998;900,03
37,86;7,30001;900,084
37,88;7,31007;900,149
37,9;7,3203;900,198
37,92;7,3304;900,264
37,94;7,34012;900,322
37,96;7,35095;900,401
37,98;7,36055;900,473
38;7,37108;900,557
38,02;7,38105;900,634
38,04;7,39141;900,717
38,06;7,40132;900,786
38,08;7,41156;900,858
38,1;7,42142;900,907
38,12;7,43177;900,947
38,14;7,44153;900,997
38,16;7,45209;901,058
38,18;7,46173;901,115
38,2;7,47205;901,212
38,22;7,48235;901,309
38,24;7,49247;901,392
38,26;7,50294;901,457
38,28;7,51348;901,527
38,3;7,52353;901,573
38,32;7,53419;901,637
38,34;7,54415;901,697
38,36;7,55464;901,761
38,38;7,56466;901,824
38,4;7,57485;901,892
38,42;7,58501;901,941
38,44;7,59509;901,999
38,46;7,6055;902,073
38,48;7,61599;902,144
38,5;7,62633;902,223
38,52;7,6373;902,308
38,54;7,64726;902,376
38,56;7,6579;902,428
38,58;7,66805;902,477
38,6;7,67813;902,513
38,62;7,68863;902,538
38,64;7,6988;902,591
38,66;7,70881;902,648
38,68;7,71952;902,708
38,7;7,72923;902,785
38,72;7,73992;902,868
38,74;7,75028;902,936
38,76;7,76036;903,005
38,78;7,77137;903,058
38,8;7,78144;903,113
38,82;7,79177;903,174
38,84;7,80278;903,25
38,86;7,81267;903,318
38,88;7,82346;903,386
38,9;7,83354;903,432
38,92;7,84387;903,479
38,94;7,85419;903,528
38,96;7,86431;903,587
38,98;7,87484;903,677
39;7,88562;903,764
39,02;7,89587;903,836
39,04;7,90661;903,891
39,06;7,91674;903,933
39,08;7,92761;903,953
39,1;7,93741;903,979
39,12;7,94805;904,024
39,14;7,95877;904,066
39,16;7,96825;904,123
39,18;7,97879;904,189
39,2;7,98921;904,263
39,22;7,99896;904,329
39,24;8,00976;904,404
39,26;8,01975;904,461
39,28;8,03052;904,523
39,3;8,0407;904,59
39,32;8,05118;904,652
39,34;8,0615;904,714
39,36;8,0718;904,772
39,38;8,08214;904,816
39,4;8,09276;904,86
39,42;8,10244;904,919
39,44;8,11333;904,978
39,46;8,12346;905,057
39,48;8,13387;905,152
39,5;8,14413;905,215
39,52;8,1549;905,267
39,54;8,16536;905,29
39,56;8,17522;905,321
39,58;8,18556;905,341
39,6;8,19697;905,385
39,62;8,20639;905,437
39,64;8,21767;905,531
39,66;8,22754;905,605
39,68;8,23768;905,67
39,7;8,24806;905,733
39,72;8,25885;905,795
39,74;8,26871;905,839
39,76;8,27993;905,886
39,78;8,28989;905,947
39,8;8,30084;906,012
39,82;8,31101;906,069
39,84;8,32193;906,117
39,86;8,33225;906,156
39,88;8,34304;906,189
39,9;8,35322;906,232
39,92;8,36397;906,281
39,94;8,37402;906,349
39,96;8,38506;906,44
39,98;8,395;906,522
40;8,40667;906,596
40,02;8,41617;906,637
40,04;8,42707;906,661
40,06;8,43866;906,675
40,08;8,44759;906,704
40,1;8,45872;906,729
40,12;8,47034;906,779
40,14;8,47931;906,827
40,16;8,49075;906,875
40,18;8,50086;906,917
40,2;8,51126;906,961
40,22;8,52205;907,012
40,24;8,53295;907,071
40,26;8,54342;907,13
40,28;8,5542;907,186
40,3;8,56441;907,241
40,32;8,57592;907,291
40,34;8,58541;907,329
40,36;8,59673;907,36
40,38;8,60706;907,398
40,4;8,61763;907,434
40,42;8,62813;907,486
40,44;8,63879;907,565
40,46;8,64881;907,646
40,48;8,65995;907,716
40,5;8,67053;907,773
40,52;8,68049;907,811
40,54;8,69255;907,834
40,56;8,70241;907,867
40,58;8,7129;907,909
40,6;8,72455;907,97
40,62;8,73482;908,017
40,64;8,74562;908,071
40,66;8,75632;908,111
40,68;8,76679;908,149
40,7;8,77748;908,187
40,72;8,78834;908,251
40,74;8,79893;908,3
40,76;8,8098;908,361
40,78;8,82039;908,423
40,8;8,83118;908,462
40,82;8,84178;908,492
40,84;8,85243;908,52
40,86;8,86305;908,532
40,88;8,87394;908,552
40,9;8,88474;908,605
40,92;8,89507;908,661
40,94;8,90643;908,725
40,96;8,91657;908,822
40,98;8,92862;908,894
41;8,93831;908,941
41,02;8,94993;908,982
41,04;8,96094;909,025
41,06;8,97086;909,054
41,08;8,98253;909,101
41,1;8,99269;909,136
41,12;9,00313;909,178
41,14;9,01447;909,212
41,16;9,02486;909,242
41,18;9,03542;909,269
41,2;9,04709;909,33
41,22;9,05704;909,393
41,24;9,06838;909,467
41,26;9,07911;909,531
41,28;9,08978;909,577
41,3;9,10073;909,603
41,32;9,11134;909,63
41,34;9,12216;909,647
41,36;9,13316;909,662
41,38;9,14362;909,697
41,4;9,15466;909,737
41,42;9,16467;909,788
41,44;9,17567;909,846
41,46;9,18652;909,917
41,48;9,19681;909,982
41,5;9,20892;910,036
41,52;9,2188;910,074
41,54;9,23001;910,107
41,56;9,24159;910,147
41,58;9,25135;910,183
41,6;9,26281;910,21
41,62;9,27337;910,231
41,64;9,28406;910,251
41,66;9,2948;910,27
41,68;9,30591;910,309
41,7;9,31658;910,378
41,72;9,32785;910,447
41,74;9,33845;910,505
41,76;9,35037;910,553
41,78;9,36037;910,581
41,8;9,37146;910,597
41,82;9,38212;910,622
41,84;9,393;910,655
41,86;9,40381;910,681
41,88;9,41485;910,714
41,9;9,42559;910,745
41,92;9,43655;910,788
41,94;9,44706;910,833
41,96;9,45846;910,901
41,98;9,46922;910,963
42;9,48023;911,028
42,02;9,49169;911,082
42,04;9,50248;911,137
42,06;9,51328;911,171
42,08;9,52458;911,203
42,1;9,5351;911,22
42,12;9,54646;911,241
42,14;9,55703;911,258
42,16;9,56832;911,287
42,18;9,57907;911,325
42,2;9,5903;911,391
42,22;9,60106;911,441
42,24;9,61263;911,493
42,26;9,62337;911,528
42,28;9,63481;911,564
42,3;9,64559;911,588
42,32;9,6565;911,617
42,34;9,66748;911,642
42,36;9,67838;911,67
42,38;9,68912;911,69
42,4;9,70016;911,711
42,42;9,71091;911,73
42,44;9,72213;911,768
42,46;9,73307;911,822
42,48;9,7444;911,879
42,5;9,75532;911,933
42,52;9,76684;911,995
42,54;9,77793;912,028
42,56;9,7888;912,065
42,58;9,79984;912,09
42,6;9,81136;912,106
42,62;9,82201;912,122
42,64;9,8337;912,161
42,66;9,84432;912,185
42,68;9,85557;912,229
42,7;9,86647;912,282
42,72;9,87812;912,336
42,74;9,88899;912,377
42,76;9,90044;912,418
42,78;9,91163;912,443
42,8;9,92283;912,478
42,82;9,93364;912,496
42,84;9,94557;912,518
42,86;9,95643;912,537
42,88;9,96704;912,551
42,9;9,97854;912,552
42,92;9,9891;912,575
42,94;9,99956;912,606
42,96;10,0116;912,656
42,98;10,0226;912,713
43;10,0333;912,765
43,02;10,0452;912,789
43,04;10,057;912,815
43,06;10,0673;912,822
43,08;10,0791;912,83
43,1;10,0903;912,841
43,12;10,1007;912,869
43,14;10,1119;912,9
43,16;10,1235;912,938
43,18;10,1336;912,987
43,2;10,1452;913,03
43,22;10,1564;913,072
43,24;10,1673;913,097
43,26;10,1785;913,109
43,28;10,1901;913,127
43,3;10,2011;913,172
43,32;10,2124;913,21
43,34;10,2237;913,248
43,36;10,2345;913,278
43,38;10,2457;913,291
43,4;10,257;913,301
43,42;10,2672;913,308
43,44;10,2793;913,34
43,46;10,2903;913,39
43,48;10,3007;913,444
43,5;10,3132;913,47
43,52;10,3243;913,515
43,54;10,3349;913,521
43,56;10,347;913,545
43,58;10,3576;913,57
43,6;10,3688;913,609
43,62;10,3802;913,636
43,64;10,3916;913,703
43,66;10,4026;913,739
43,68;10,414;913,781
43,7;10,4256;913,818
43,72;10,4368;913,852
43,74;10,448;913,866
43,76;10,4603;913,894
43,78;10,471;913,914
43,8;10,4822;913,949
43,82;10,4938;913,982
43,84;10,5053;913,996
43,86;10,5158;914,006
43,88;10,5277;914,005
43,9;10,539;914,021
43,92;10,5497;914,04
43,94;10,5611;914,094
43,96;10,5737;914,156
43,98;10,5842;914,226
44;10,5961;914,256
44,02;10,608;914,269
44,04;10,619;914,28
44,06;10,6303;914,272
44,08;10,6427;914,272
44,1;10,6535;914,29
44,12;10,6649;914,327
44,14;10,6767;914,35
44,16;10,6883;914,387
44,18;10,6991;914,42
44,2;10,7112;914,451
44,22;10,7227;914,486
44,24;10,7342;914,524
44,26;10,7454;914,549
44,28;10,7576;914,569
44,3;10,7687;914,58
44,32;10,7804;914,588
44,34;10,7917;914,568
44,36;10,8036;914,564
44,38;10,8149;914,561
44,4;10,826;914,575
44,42;10,8376;914,606
44,44;10,8487;914,66
44,46;10,8596;914,705
44,48;10,872;914,751
44,5;10,8828;914,767
44,52;10,8942;914,762
44,54;10,9061;914,761
44,56;10,9171;914,767
44,58;10,9286;914,77
44,6;10,9405;914,786
44,62;10,9511;914,806
44,64;10,9632;914,822
44,66;10,9743;914,841
44,68;10,9856;914,865
44,7;10,9973;914,914
44,72;11,0089;914,956
44,74;11,0204;914,999
44,76;11,0322;915,034
44,78;11,0435;915,056
44,8;11,0553;915,058
44,82;11,0661;915,056
44,84;11,0783;915,044
44,86;11,089;915,025
44,88;11,1005;915,026
44,9;11,1123;915,038
44,92;11,1233;915,082
44,94;11,1346;915,136
44,96;11,1469;915,199
44,98;11,158;915,238
45;11,1702;915,261
45,02;11,1815;915,271
45,04;11,1932;915,281
45,06;11,2048;915,295
45,08;11,2163;915,319
45,1;11,2278;915,333
45,12;11,2394;915,343
45,14;11,2509;915,356
45,16;11,2624;915,367
45,18;11,2738;915,387
45,2;11,2855;915,446
45,22;11,2971;915,502
45,24;11,3091;915,56
45,26;11,3208;915,601
45,28;11,3328;915,623
45,3;11,3446;915,622
45,32;11,3564;915,624
45,34;11,3682;915,601
45,36;11,3803;915,602
45,38;11,3915;915,614
45,4;11,4035;915,626
45,42;11,4151;915,643
45,44;11,4262;915,678
45,46;11,4386;915,692
45,48;11,4507;915,714
45,5;11,462;915,727
45,52;11,4742;915,726
45,54;11,4856;915,724
45,56;11,4973;915,747
45,58;11,5087;915,75
45,6;11,5208;915,758
45,62;11,5322;915,77
45,64;11,5439;915,777
45,66;11,5555;915,776
45,68;11,567;915,808
45,7;11,5788;915,847
45,72;11,591;915,88
45,74;11,6024;915,918
45,76;11,6147;915,946
45,78;11,6266;915,941
45,8;11,6381;915,941
45,82;11,6501;915,934
45,84;11,6621;915,922
45,86;11,6735;915,916
45,88;11,6857;915,922
45,9;11,6969;915,925
45,92;11,7088;915,947
45,94;11,7202;915,979
45,96;11,7324;916,015
45,98;11,7439;916,046
46;11,7564;916,074
46,02;11,7681;916,096
46,04;11,7802;916,117
46,06;11,7918;916,118
46,08;11,8041;916,119
46,1;11,8155;916,125
46,12;11,8278;916,134
46,14;11,8396;916,135
46,16;11,8513;916,157
46,18;11,8635;916,189
46,2;11,8753;916,227
46,22;11,8872;916,253
46,24;11,8999;916,276
46,26;11,9115;916,279
46,28;11,9238;916,282
46,3;11,9356;916,273
46,32;11,9478;916,269
46,34;11,9597;916,26
46,36;11,972;916,265
46,38;11,9837;916,264
46,4;11,9961;916,268
46,42;12,0077;916,275
46,44;12,0204;916,306
46,46;12,032;916,336
46,48;12,0446;916,373
46,5;12,0568;916,409
46,52;12,0691;916,426
46,54;12,0811;916,423
46,56;12,0934;916,423
46,58;12,1051;916,402
46,6;12,1179;916,375
46,62;12,1295;916,371
46,64;12,1418;916,377
46,66;12,1536;916,376
46,68;12,1658;916,404
46,7;12,1779;916,441
46,72;12,1903;916,461
46,74;12,2025;916,484
46,76;12,2151;916,498
46,78;12,2268;916,501
46,8;12,2397;916,514
46,82;12,2514;916,545
46,84;12,2636;916,556
46,86;12,276;916,569
46,88;12,2877;916,581
46,9;12,2996;916,573
46,92;12,3121;916,562
46,94;12,3239;916,578
46,96;12,3366;916,599
46,98;12,3487;916,614
47;12,3617;916,63
47,02;12,3737;916,623
47,04;12,386;916,607
47,06;12,3987;916,582
47,08;12,4107;916,561
47,1;12,4227;916,542
47,12;12,4358;916,549
47,14;12,4467;916,551
47,16;12,4599;916,574
47,18;12,4715;916,596
47,2;12,4836;916,618
47,22;12,4959;916,634
47,24;12,5081;916,645
47,26;12,5203;916,634
47,28;12,5326;916,636
47,3;12,5446;916,634
47,32;12,5573;916,636
47,34;12,5691;916,638
47,36;12,5819;916,646
47,38;12,5938;916,644
47,4;12,6061;916,656
47,42;12,6186;916,672
47,44;12,6305;916,704
47,46;12,6429;916,735
47,48;12,6558;916,76
47,5;12,6676;916,756
47,52;12,6807;916,74
47,54;12,6925;916,718
47,56;12,7051;916,694
47,58;12,7176;916,679
47,6;12,7296;916,685
47,62;12,7422;916,694
47,64;12,7546;916,702
47,66;12,7665;916,725
47,68;12,7791;916,742
47,7;12,791;916,767
47,72;12,804;916,776
47,74;12,8158;916,785
47,76;12,8288;916,792
47,78;12,8414;916,79
47,8;12,8533;916,779
47,82;12,8659;916,776
47,84;12,8787;916,754
47,86;12,8904;916,716
47,88;12,9034;916,689
47,9;12,9149;916,673
47,92;12,9275;916,668
47,94;12,9397;916,687
47,96;12,9523;916,724
47,98;12,9646;916,741
48;12,9773;916,739
48,02;12,9896;916,722
48,04;13,0025;916,705
48,06;13,014;916,681
48,08;13,0273;916,687
48,1;13,0393;916,684
48,12;13,0516;916,692
48,14;13,0641;916,69
48,16;13,0763;916,694
48,18;13,0887;916,693
48,2;13,1019;916,72
48,22;13,1138;916,741
48,24;13,1273;916,766
48,26;13,1392;916,773
48,28;13,1522;916,782
48,3;13,1645;916,775
48,32;13,1774;916,765
48,34;13,1898;916,737
48,36;13,2025;916,728
48,38;13,215;916,715
48,4;13,2281;916,712
48,42;13,2401;916,735
48,44;13,2531;916,767
48,46;13,2658;916,779
48,48;13,2787;916,782
48,5;13,2915;916,762
48,52;13,3044;916,718
48,54;13,3168;916,692
48,56;13,3297;916,677
48,58;13,3424;916,658
48,6;13,3553;916,661
48,62;13,3674;916,663
48,64;13,3806;916,647
48,66;13,3928;916,634
48,68;13,4052;916,636
48,7;13,4178;916,634
48,72;13,4308;916,648
48,74;13,4431;916,657
48,76;13,4561;916,671
48,78;13,4685;916,665
48,8;13,4814;916,656
48,82;13,4937;916,627
48,84;13,5068;916,607
48,86;13,5195;916,569
48,88;13,532;916,571
48,9;13,5446;916,574
48,92;13,558;916,591
48,94;13,5701;916,624
48,96;13,5836;916,661
48,98;13,5964;916,65
49;13,6092;916,648
49,02;13,6217;916,64
49,04;13,6349;916,62
49,06;13,6475;916,594
49,08;13,6602;916,585
49,1;13,6731;916,554
49,12;13,6861;916,531
49,14;13,698;916,5
49,16;13,7115;916,481
49,18;13,7239;916,479
49,2;13,7365;916,5
49,22;13,7498;916,515
49,24;13,7628;916,522
49,26;13,7752;916,514
49,28;13,7886;916,485
49,3;13,8008;916,445
49,32;13,8139;916,401
49,34;13,8263;916,367
49,36;13,8393;916,343
49,38;13,8519;916,342
49,4;13,8646;916,345
49,42;13,8774;916,35
49,44;13,8909;916,369
49,46;13,9034;916,388
49,48;13,9171;916,383
49,5;13,9296;916,373
49,52;13,9431;916,364
49,54;13,9556;916,345
49,56;13,9688;916,33
49,58;13,9816;916,307
49,6;13,9944;916,29
49,62;14,0072;916,268
49,64;14,0206;916,251
49,66;14,0329;916,243
49,68;14,0466;916,259
49,7;14,0592;916,274
49,72;14,0726;916,291
49,74;14,0857;916,29
49,76;14,099;916,268
49,78;14,1117;916,23
49,8;14,1248;916,197
49,82;14,1376;916,159
49,84;14,1507;916,136
49,86;14,1632;916,133
49,88;14,1763;916,119
49,9;14,1891;916,11
49,92;14,2017;916,108
49,94;14,2151;916,113
49,96;14,228;916,105
49,98;14,2408;916,103
50;14,2547;916,1
50,02;14,2674;916,099
50,04;14,2805;916,084
50,06;14,2934;916,057
50,08;14,3067;916,027
50,1;14,3193;915,984
50,12;14,3325;915,94
50,14;14,3452;915,911
50,16;14,3583;915,916
50,18;14,3712;915,933
50,2;14,3846;915,958
50,22;14,3977;915,98
50,24;14,4113;915,976
50,26;14,4245;915,934
50,28;14,438;915,901
50,3;14,4508;915,855
50,32;14,4643;915,805
50,34;14,4772;915,758
50,36;14,4903;915,737
50,38;14,503;915,707
50,4;14,5163;915,688
50,42;14,5294;915,686
50,44;14,5428;915,696
50,46;14,5556;915,709
50,48;14,5694;915,719
50,5;14,5825;915,721
50,52;14,5958;915,7
50,54;14,6089;915,677
50,56;14,6223;915,65
50,58;14,6353;915,609
50,6;14,6492;915,569
50,62;14,6619;915,558
50,64;14,6758;915,552
50,66;14,6885;915,531
50,68;14,7022;915,541
50,7;14,715;915,537
50,72;14,7289;915,509
50,74;14,7422;915,469
50,76;14,7551;915,438
50,78;14,7685;915,398
50,8;14,7821;915,386
50,82;14,7946;915,374
50,84;14,8087;915,344
50,86;14,8215;915,313
50,88;14,8343;915,281
50,9;14,8474;915,241
50,92;14,8612;915,224
50,94;14,8736;915,241
50,96;14,8875;915,255
50,98;14,9013;915,261
51;14,9147;915,242
51,02;14,9278;915,214
51,04;14,9416;915,178
51,06;14,9545;915,134
51,08;14,968;915,098
51,1;14,981;915,088
51,12;14,9944;915,071
51,14;15,0076;915,05
51,16;15,0209;915,048
51,18;15,0341;915,032
51,2;15,048;915,005
51,22;15,0612;914,974
51,24;15,0751;914,94
51,26;15,0885;914,893
51,28;15,1018;914,876
51,3;15,1155;914,855
51,32;15,1287;914,822
51,34;15,1418;914,783
51,36;15,1557;914,749
51,38;15,1686;914,683
51,4;15,182;914,634
51,42;15,1953;914,618
51,44;15,2086;914,617
51,46;15,2221;914,606
51,48;15,2359;914,6
51,5;15,249;914,567
51,52;15,2628;914,525
51,54;15,2764;914,474
51,56;15,2897;914,433
51,58;15,303;914,405
51,6;15,3169;914,395
51,62;15,3301;914,383
51,64;15,3435;914,371
51,66;15,3569;914,358
51,68;15,3708;914,348
51,7;15,384;914,331
51,72;15,398;914,31
51,74;15,4115;914,282
51,76;15,4253;914,257
51,78;15,4387;914,219
51,8;15,4527;914,18
51,82;15,466;914,119
51,84;15,4798;914,057
51,86;15,4934;913,988
51,88;15,5068;913,944
51,9;15,5202;913,913
51,92;15,5339;913,91
51,94;15,5477;913,928
51,96;15,5617;913,95
51,98;15,5751;913,929
52;15,5892;913,892
52,02;15,6031;913,846
52,04;15,6163;913,791
52,06;15,6302;913,733
52,08;15,644;913,705
52,1;15,6575;913,679
52,12;15,6714;913,659
52,14;15,6848;913,623
52,16;15,6988;913,597
52,18;15,7121;913,566
52,2;15,7259;913,539
52,22;15,7397;913,506
52,24;15,7538;913,489
52,26;15,7671;913,451
52,28;15,7811;913,406
52,3;15,7947;913,358
52,32;15,8086;913,296
52,34;15,822;913,218
52,36;15,8359;913,16
52,38;15,8491;913,111
52,4;15,8628;913,085
52,42;15,876;913,079
52,44;15,8898;913,078
52,46;15,9037;913,056
52,48;15,9171;913,021
52,5;15,9313;912,954
52,52;15,945;912,886
52,54;15,9582;912,826
52,56;15,9723;912,786
52,58;15,9859;912,732
52,6;15,9994;912,689
52,62;16,013;912,646
52,64;16,0269;912,604
52,66;16,0406;912,567
52,68;16,0542;912,56
52,7;16,0679;912,543
52,72;16,0821;912,533
52,74;16,0957;912,507
52,76;16,11;912,468
52,78;16,1235;912,406
52,8;16,1375;912,343
52,82;16,1516;912,253
52,84;16,1652;912,171
52,86;16,1788;912,09
52,88;16,193;912,039
52,9;16,2063;912,001
52,92;16,2198;911,984
52,94;16,2339;911,969
52,96;16,2475;911,948
52,98;16,2615;911,891
53;16,2757;911,834
53,02;16,289;911,781
53,04;16,3029;911,72
53,06;16,3171;911,663
53,08;16,3305;911,614
53,1;16,3442;911,56
53,12;16,3582;911,494
53,14;16,3715;911,446
53,16;16,3852;911,415
53,18;16,3989;911,402
53,2;16,4128;911,411
53,22;16,4267;911,412
53,24;16,4406;911,382
53,26;16,4546;911,342
53,28;16,4685;911,284
53,3;16,482;911,192
53,32;16,4967;911,108
53,34;16,51;911,038
53,36;16,5239;910,967
53,38;16,5377;910,902
53,4;16,5516;910,861
53,42;16,5654;910,822
53,44;16,5796;910,796
53,46;16,5937;910,756
53,48;16,608;910,704
53,5;16,6219;910,643
53,52;16,6356;910,569
53,54;16,6494;910,492
53,56;16,6635;910,421
53,58;16,677;910,347
53,6;16,6909;910,27
53,62;16,705;910,209
53,64;16,7191;910,146
53,66;16,7327;910,108
53,68;16,7475;910,099
53,7;16,7615;910,091
53,72;16,7758;910,055
53,74;16,7905;910,019
53,76;16,8048;909,944
53,78;16,8186;909,849
53,8;16,8332;909,765
53,82;16,8473;909,686
53,84;16,8613;909,598
53,86;16,8756;909,521
53,88;16,8898;909,455
53,9;16,9034;909,384
53,92;16,9179;909,327
53,94;16,9321;909,267
53,96;16,9463;909,213
53,98;16,9608;909,16
54;16,975;909,093
54,02;16,9893;909,019
54,04;17,0038;908,945
54,06;17,0174;908,853
54,08;17,032;908,747
54,1;17,0455;908,645
54,12;17,0595;908,551
54,14;17,0733;908,469
54,16;17,0873;908,412
54,18;17,101;908,357
54,2;17,1157;908,3
54,22;17,1294;908,245
54,24;17,1437;908,174
54,26;17,1582;908,093
54,28;17,1726;908,02
54,3;17,1865;907,947
54,32;17,2012;907,847
54,34;17,2156;907,769
54,36;17,2295;907,681
54,38;17,2437;907,583
54,4;17,2579;907,497
54,42;17,272;907,428
54,44;17,2865;907,353
54,46;17,3005;907,291
54,48;17,3152;907,23
54,5;17,3296;907,144
54,52;17,3438;907,051
54,54;17,3582;906,94
54,56;17,3729;906,822
54,58;17,3871;906,692
54,6;17,4018;906,585
54,62;17,416;906,481
54,64;17,4303;906,394
54,66;17,4445;906,32
54,68;17,4594;906,258
54,7;17,4734;906,187
54,72;17,488;906,111
54,74;17,5028;906,016
54,76;17,5172;905,913
54,78;17,5315;905,814
54,8;17,5465;905,711
54,82;17,5609;905,607
54,84;17,5754;905,5
54,86;17,5898;905,373
54,88;17,6043;905,255
54,9;17,6187;905,141
54,92;17,6332;905,045
54,94;17,6476;904,957
54,96;17,6626;904,878
54,98;17,6771;904,769
55;17,6918;904,648
55,02;17,7061;904,515
55,04;17,7208;904,381
55,06;17,7348;904,246
55,08;17,7496;904,116
55,1;17,7637;903,993
55,12;17,7777;903,879
55,14;17,7922;903,773
55,16;17,8067;903,674
55,18;17,8205;903,589
55,2;17,8352;903,499
55,22;17,8499;903,387
55,24;17,8647;903,267
55,26;17,8789;903,146
55,28;17,894;903,032
55,3;17,9085;902,907
55,32;17,9231;902,769
55,34;17,9377;902,624
55,36;17,9522;902,475
55,38;17,9663;902,313
55,4;17,9811;902,18
55,42;17,9955;902,071
55,44;18,01;901,967
55,46;18,0249;901,847
55,48;18,0397;901,722
55,5;18,054;901,554
55,52;18,0688;901,388
55,54;18,0832;901,218
55,56;18,0978;901,055
55,58;18,1122;900,889
55,6;18,1271;900,761
55,62;18,1412;900,61
55,64;18,156;900,468
55,66;18,1698;900,324
55,68;18,1848;900,183
55,7;18,1989;900,024
55,72;18,2137;899,894
55,74;18,2283;899,751
55,76;18,2429;899,601
55,78;18,2572;899,445
55,8;18,2721;899,281
55,82;18,2861;899,084
55,84;18,3011;898,893
55,86;18,3154;898,714
55,88;18,3299;898,563
55,9;18,3444;898,417
55,92;18,359;898,298
55,94;18,3738;898,173
55,96;18,3886;898,035
55,98;18,4032;897,85
56;18,418;897,657
56,02;18,4326;897,454
56,04;18,4475;897,247
56,06;18,4621;897,043
56,08;18,4769;896,858
56,1;18,4917;896,67
56,12;18,5059;896,474
56,14;18,5206;896,285
56,16;18,5351;896,101
56,18;18,5494;895,916
56,2;18,5645;895,743
56,22;18,5788;895,565
56,24;18,5934;895,367
56,26;18,6083;895,169
56,28;18,6227;894,971
56,3;18,6374;894,746
56,32;18,6524;894,525
56,34;18,6666;894,31
56,36;18,6813;894,086
56,38;18,6958;893,869
56,4;18,7105;893,69
56,42;18,7249;893,509
56,44;18,7399;893,332
56,46;18,755;893,126
56,48;18,7696;892,904
56,5;18,7846;892,654
56,52;18,7996;892,4
56,54;18,8141;892,143
56,56;18,829;891,914
56,58;18,8439;891,673
56,6;18,8587;891,423
56,62;18,8735;891,169
56,64;18,8882;890,909
56,66;18,9033;890,648
56,68;18,9179;890,412
56,7;18,9329;890,177
56,72;18,948;889,936
56,74;18,9626;889,696
56,76;18,9777;889,434
56,78;18,9923;889,149
56,8;19,007;888,867
56,82;19,0219;888,575
56,84;19,0369;888,285
56,86;19,0514;888,025
56,88;19,066;887,767
56,9;19,0811;887,515
56,92;19,0959;887,277
56,94;19,1106;887,015
56,96;19,1258;886,72
56,98;19,1408;886,412
57;19,1555;886,101
57,02;19,1702;885,768
57,04;19,185;885,446
57,06;19,2;885,129
57,08;19,2144;884,814
57,1;19,229;884,484
57,12;19,2438;884,164
57,14;19,2579;883,84
57,16;19,2731;883,53
57,18;19,2877;883,215
57,2;19,3023;882,907
57,22;19,3177;882,59
57,24;19,3325;882,252
57,26;19,3471;881,892
57,28;19,3622;881,534
57,3;19,3769;881,155
57,32;19,3919;880,767
57,34;19,4067;880,391
57,36;19,4211;880,03
57,38;19,436;879,663
57,4;19,451;879,31
57,42;19,4655;878,957
57,44;19,4807;878,591
57,46;19,4962;878,204
57,48;19,511;877,804
57,5;19,526;877,392
57,52;19,5414;876,981
57,54;19,5557;876,558
57,56;19,5709;876,118
57,58;19,5859;875,659
57,6;19,6007;875,194
57,62;19,6159;874,719
57,64;19,6309;874,26
57,66;19,646;873,811
57,68;19,6612;873,372
57,7;19,6766;872,901
57,72;19,6919;872,409
57,74;19,7069;871,887
57,76;19,7223;871,34
57,78;19,7372;870,789
57,8;19,7522;870,249
57,82;19,7673;869,705
57,84;19,7821;869,151
57,86;19,7973;868,595
57,88;19,8122;868,033
57,9;19,827;867,456
57,92;19,8424;866,876
57,94;19,8575;866,275
57,96;19,8731;865,653
57,98;19,8884;864,993
58;19,904;864,316
58,02;19,9193;863,591
58,04;19,9349;862,854
58,06;19,9501;862,073
58,08;19,9658;861,269
58,1;19,9811;860,436
58,12;19,9967;859,601
58,14;20,0122;858,734
58,16;20,0278;857,868
58,18;20,0436;856,967
58,2;20,0595;855,972
58,22;20,0751;854,846
58,24;20,0914;853,558
58,26;20,108;852,001
58,28;20,1249;850,08
58,3;20,1426;847,498
