"s";"%";"MPa"
0;0;5,66461
0,02;0,000907884;5,65567
0,04;0,00228443;5,66155
0,06;0,00278621;5,66903
0,08;0,00273168;5,66336
0,1;0,0023132;5,66136
0,12;0,000604475;5,66856
0,14;-4,98433e-005;5,66648
0,16;-0,000562995;5,66549
0,18;-0,00079582;5,66958
0,2;-0,000171943;5,67409
0,22;0,00104136;5,6751
0,24;0,00166691;5,67826
0,26;0,00298759;5,67966
0,28;0,00303007;5,67716
0,3;0,00249451;5,68351
0,32;0,00140565;5,68362
0,34;0,000373657;5,67934
0,36;-0,0003857;5,67473
0,38;-0,000509137;5,67993
0,4;-0,000263935;5,68083
0,42;0,00101359;5,67438
0,44;0,00194891;5,67992
0,46;0,00303509;5,69174
0,48;0,00305717;5,7027
0,5;0,00284341;5,71445
0,52;0,0017221;5,75035
0,54;0,000896175;5,78854
0,56;0,00014217;5,84392
0,58;-1,53879e-005;5,92768
0,6;0,000150533;6,03865
0,62;0,00105474;6,16089
0,64;0,00214125;6,30102
0,66;0,00314849;6,45777
0,68;0,00376668;6,62823
0,7;0,00365796;6,81284
0,72;0,00317391;7,02271
0,74;0,00211382;7,24176
0,76;0,00149296;7,47777
0,78;0,00130529;7,7227
0,8;0,00134476;7,9724
0,82;0,00243362;8,24826
0,84;0,00351914;8,54284
0,86;0,00442334;8,8531
0,88;0,00559148;9,17438
0,9;0,00560386;9,51447
0,92;0,00506595;9,85546
0,94;0,00435644;10,2107
0,96;0,00382254;10,5793
0,98;0,0035479;10,9795
1;0,00370312;11,4014
1,02;0,00462271;11,8393
1,04;0,00559783;12,288
1,06;0,00717275;12,7443
1,08;0,00800737;13,2018
1,1;0,00822983;13,6635
1,12;0,00825726;14,119
1,14;0,00745274;14,5807
1,16;0,00692086;15,0543
1,18;0,00697338;15,5412
1,2;0,00686365;16,006
1,22;0,00750459;16,4916
1,24;0,00884735;16,9894
1,26;0,0100446;17,4825
1,28;0,0111057;17,9638
1,3;0,0116861;18,4739
1,32;0,0113683;18,9802
1,34;0,0111769;19,4921
1,36;0,0107036;19,9985
1,38;0,0103972;20,5142
1,4;0,0104263;21,0328
1,42;0,0109906;21,5494
1,44;0,0120681;22,0604
1,46;0,0135222;22,5846
1,48;0,0143428;23,109
1,5;0,0151855;23,6246
1,52;0,0151888;24,153
1,54;0,0148951;24,6743
1,56;0,0144204;25,1915
1,58;0,0142371;25,708
1,6;0,0138825;26,2293
1,62;0,0148111;26,7346
1,64;0,0157083;27,2458
1,66;0,0167698;27,7684
1,68;0,0179382;28,2883
1,7;0,0186417;28,7964
1,72;0,0189799;29,3171
1,74;0,0189154;29,8375
1,76;0,0183397;30,3434
1,78;0,0178797;30,8466
1,8;0,0179001;31,3737
1,82;0,018154;31,8863
1,84;0,0192566;32,4082
1,86;0,0202046;32,9356
1,88;0,0213232;33,4558
1,9;0,0224111;33,9816
1,92;0,0229229;34,5073
1,94;0,0228352;35,0221
1,96;0,0220127;35,5371
1,98;0,0217949;36,0637
2;0,0217594;36,5702
2,02;0,0219662;37,091
2,04;0,022685;37,6148
2,06;0,0240007;38,1421
2,08;0,025016;38,6617
2,1;0,0262637;39,1806
2,12;0,0264297;39,6928
2,14;0,0264551;40,2114
2,16;0,0258054;40,7206
2,18;0,0259372;41,2303
2,2;0,0256853;41,7538
2,22;0,0257837;42,2692
2,24;0,0263822;42,7836
2,26;0,0274854;43,3018
2,28;0,0286672;43,8042
2,3;0,0298886;44,3156
2,32;0,0299434;44,8375
2,34;0,0300528;45,3495
2,36;0,0302489;45,8477
2,38;0,0297584;46,3646
2,4;0,0295377;46,8636
2,42;0,0297417;47,3685
2,44;0,0298558;47,8748
2,46;0,0310651;48,3904
2,48;0,0325707;48,8964
2,5;0,0329769;49,4024
2,52;0,0338242;49,9006
2,54;0,0342075;50,4073
2,56;0,0340376;50,9143
2,58;0,0338061;51,4194
2,6;0,0335489;51,9207
2,62;0,0334823;52,4207
2,64;0,0336606;52,9028
2,66;0,0350097;53,3958
2,68;0,0356376;53,9078
2,7;0,0366194;54,4111
2,72;0,0376879;54,9149
2,74;0,0379495;55,4362
2,76;0,0378294;55,9426
2,78;0,0376447;56,442
2,8;0,0372487;56,9546
2,82;0,0372182;57,452
2,84;0,0376728;57,9453
2,86;0,038276;58,4461
2,88;0,0391808;58,9402
2,9;0,0402978;59,4335
2,92;0,0410889;59,9463
2,94;0,0416456;60,4466
2,96;0,0415124;60,9356
2,98;0,0411849;61,4372
3;0,0406992;61,935
3,02;0,0408922;62,4216
3,04;0,041104;62,9155
3,06;0,0416493;63,4229
3,08;0,042604;63,9118
3,1;0,0438935;64,3887
3,12;0,0445984;64,8807
3,14;0,0451898;65,362
3,16;0,0451062;65,8385
3,18;0,0449871;66,3206
3,2;0,0448088;66,8041
3,22;0,0447091;67,2757
3,24;0,0447208;67,7561
3,26;0,0452005;68,2329
3,28;0,0460947;68,704
3,3;0,0470795;69,1798
3,32;0,0482199;69,6481
3,34;0,0483283;70,1179
3,36;0,0486243;70,5918
3,38;0,0486598;71,074
3,4;0,0484594;71,5514
3,42;0,0482918;72,0285
3,44;0,0483246;72,5075
3,46;0,0485142;72,9708
3,48;0,0494114;73,4302
3,5;0,0505756;73,8941
3,52;0,0511633;74,3545
3,54;0,0519618;74,8035
3,56;0,0523943;75,268
3,58;0,0521725;75,7326
3,6;0,0520568;76,188
3,62;0,0518203;76,6487
3,64;0,0516898;77,1201
3,66;0,0522334;77,5807
3,68;0,0528128;78,0462
3,7;0,0537384;78,5154
3,72;0,0545389;78,9822
3,74;0,0557368;79,449
3,76;0,0557569;79,9138
3,78;0,0558603;80,3824
3,8;0,0557649;80,8482
3,82;0,0553311;81,3232
3,84;0,0554699;81,7885
3,86;0,0557121;82,2513
3,88;0,0559566;82,7157
3,9;0,0572843;83,1758
3,92;0,0580919;83,6357
3,94;0,0589091;84,0898
3,96;0,0593306;84,5563
3,98;0,0593122;85,0114
4;0,0593165;85,4777
4,02;0,0590158;85,9329
4,04;0,0589462;86,3924
4,06;0,0592168;86,8554
4,08;0,0594901;87,3145
4,1;0,0602719;87,774
4,12;0,0616381;88,2392
4,14;0,0622958;88,7102
4,16;0,0624249;89,1682
4,18;0,0629691;89,6094
4,2;0,0628122;90,037
4,22;0,0626905;90,482
4,24;0,062639;90,9241
4,26;0,0627116;91,3607
4,28;0,0628848;91,8166
4,3;0,063863;92,2825
4,32;0,0646176;92,7203
4,34;0,065371;93,1629
4,36;0,0660641;93,6058
4,38;0,0663668;94,0452
4,4;0,0662779;94,4792
4,42;0,0661461;94,9261
4,44;0,0659795;95,3571
4,46;0,0660491;95,8039
4,48;0,0661969;96,2374
4,5;0,0670871;96,6821
4,52;0,0678652;97,1156
4,54;0,0686406;97,5545
4,56;0,0693735;97,9761
4,58;0,0697104;98,4058
4,6;0,069601;98,8432
4,62;0,069409;99,2809
4,64;0,0693692;99,7081
4,66;0,0693528;100,144
4,68;0,0698897;100,586
4,7;0,0702754;101,021
4,72;0,0710996;101,442
4,74;0,0718981;101,883
4,76;0,0723654;102,33
4,78;0,0728749;102,768
4,8;0,0729151;103,188
4,82;0,07271;103,614
4,84;0,0727833;104,053
4,86;0,0727866;104,469
4,88;0,0729244;104,894
4,9;0,07345;105,333
4,92;0,0742933;105,769
4,94;0,0749951;106,186
4,96;0,0756658;106,616
4,98;0,0762937;107,041
5;0,0761994;107,464
5,02;0,0761823;107,893
5,04;0,0760482;108,331
5,06;0,0759806;108,771
5,08;0,0760445;109,209
5,1;0,0767547;109,63
5,12;0,0771534;110,079
5,14;0,0783985;110,499
5,16;0,0787521;110,912
5,18;0,0794221;111,329
5,2;0,0795208;111,749
5,22;0,0794375;112,153
5,24;0,0793345;112,559
5,26;0,0795228;112,972
5,28;0,0793264;113,392
5,3;0,0799122;113,806
5,32;0,0803333;114,219
5,34;0,0813617;114,645
5,36;0,0817785;115,082
5,38;0,082674;115,5
5,4;0,0826499;115,931
5,42;0,0827526;116,368
5,44;0,0827262;116,803
5,46;0,0826111;117,215
5,48;0,0826556;117,647
5,5;0,0829252;118,08
5,52;0,0834919;118,498
5,54;0,0842205;118,917
5,56;0,0851059;119,339
5,58;0,0857589;119,767
5,6;0,085789;120,193
5,62;0,0858128;120,617
5,64;0,0857161;121,041
5,66;0,0857853;121,473
5,68;0,0859151;121,885
5,7;0,0861817;122,298
5,72;0,0866614;122,713
5,74;0,0875563;123,133
5,76;0,0881541;123,542
5,78;0,0884672;123,953
5,8;0,0890252;124,36
5,82;0,0889981;124,765
5,84;0,089181;125,175
5,86;0,0891252;125,592
5,88;0,0890656;126,005
5,9;0,0893587;126,414
5,92;0,0895935;126,83
5,94;0,0903488;127,241
5,96;0,0911079;127,64
5,98;0,0916247;128,042
6;0,0920191;128,438
6,02;0,092281;128,838
6,04;0,0923673;129,236
6,06;0,092262;129,639
6,08;0,0921897;130,035
6,1;0,0923108;130,442
6,12;0,0926102;130,84
6,14;0,0934284;131,234
6,16;0,093962;131,629
6,18;0,0945922;132,035
6,2;0,094903;132,425
6,22;0,0952991;132,821
6,24;0,0951649;133,214
6,26;0,0951328;133,605
6,28;0,0950147;133,992
6,3;0,0952807;134,386
6,32;0,095743;134,775
6,34;0,0960969;135,163
6,36;0,0967783;135,548
6,38;0,0975019;135,943
6,4;0,0978518;136,338
6,42;0,0981137;136,727
6,44;0,0981438;137,114
6,46;0,0982151;137,506
6,48;0,0979488;137,882
6,5;0,0983261;138,277
6,52;0,0985241;138,659
6,54;0,0988082;139,041
6,56;0,0997003;139,432
6,58;0,100462;139,813
6,6;0,100607;140,186
6,62;0,101114;140,584
6,64;0,101174;140,958
6,66;0,101155;141,337
6,68;0,101145;141,738
6,7;0,101149;142,119
6,72;0,10149;142,5
6,74;0,101752;142,9
6,76;0,102596;143,288
6,78;0,103379;143,667
6,8;0,103394;144,05
6,82;0,103949;144,431
6,84;0,104089;144,812
6,86;0,104116;145,196
6,88;0,10403;145,565
6,9;0,104189;145,948
6,92;0,104238;146,325
6,94;0,104673;146,693
6,96;0,105531;147,064
6,98;0,105901;147,448
7;0,106162;147,829
7,02;0,106822;148,185
7,04;0,107005;148,552
7,06;0,10697;148,912
7,08;0,106907;149,281
7,1;0,106954;149,644
7,12;0,107002;150,021
7,14;0,107455;150,392
7,16;0,107825;150,766
7,18;0,108542;151,124
7,2;0,108951;151,489
7,22;0,109589;151,857
7,24;0,109628;152,215
7,26;0,109608;152,571
7,28;0,10964;152,936
7,3;0,109588;153,283
7,32;0,109957;153,636
7,34;0,110386;153,996
7,36;0,110413;154,363
7,38;0,111317;154,712
7,4;0,111548;155,076
7,42;0,112285;155,428
7,44;0,11232;155,795
7,46;0,112344;156,155
7,48;0,112482;156,523
7,5;0,11249;156,883
7,52;0,112566;157,239
7,54;0,112787;157,593
7,56;0,112877;157,947
7,58;0,114078;158,306
7,6;0,114276;158,662
7,62;0,114924;159,034
7,64;0,115022;159,395
7,66;0,115205;159,748
7,68;0,115309;160,099
7,7;0,115339;160,461
7,72;0,115266;160,806
7,74;0,115386;161,162
7,76;0,11572;161,527
7,78;0,116478;161,892
7,8;0,117039;162,254
7,82;0,117337;162,608
7,84;0,117547;162,958
7,86;0,117873;163,31
7,88;0,118027;163,657
7,9;0,118042;164,009
7,92;0,118008;164,388
7,94;0,118289;164,755
7,96;0,11873;165,111
7,98;0,119038;165,467
8;0,11935;165,826
8,02;0,120108;166,169
8,04;0,120225;166,522
8,06;0,120486;166,881
8,08;0,120561;167,244
8,1;0,120553;167,603
8,12;0,120667;167,98
8,14;0,120776;168,349
8,16;0,121181;168,704
8,18;0,121884;169,06
8,2;0,121894;169,405
8,22;0,122962;169,743
8,24;0,123053;170,096
8,26;0,123052;170,45
8,28;0,123401;170,823
8,3;0,123397;171,189
8,32;0,123418;171,549
8,34;0,123803;171,894
8,36;0,123828;172,254
8,38;0,124358;172,583
8,4;0,124446;172,923
8,42;0,125252;173,265
8,44;0,12557;173,612
8,46;0,125633;173,946
8,48;0,125713;174,298
8,5;0,12632;174,64
8,52;0,126235;174,983
8,54;0,126327;175,333
8,56;0,126363;175,676
8,58;0,126823;176,018
8,6;0,127043;176,371
8,62;0,127742;176,709
8,64;0,127875;177,046
8,66;0,128304;177,398
8,68;0,128452;177,734
8,7;0,128504;178,073
8,72;0,128666;178,411
8,74;0,128634;178,75
8,76;0,128745;179,086
8,78;0,129571;179,421
8,8;0,129605;179,752
8,82;0,130226;180,098
8,83;0,130427;180,267
8,85;0,130876;180,586
8,87;0,13095;180,919
8,89;0,131225;181,255
8,91;0,131285;181,592
8,93;0,131348;181,928
8,95;0,131381;182,269
8,97;0,131647;182,61
8,99;0,131924;182,946
9,01;0,132614;183,278
9,03;0,132888;183,605
9,05;0,133291;183,927
9,07;0,133535;184,246
9,09;0,133724;184,571
9,11;0,133796;184,905
9,13;0,133981;185,23
9,15;0,133871;185,566
9,17;0,134032;185,908
9,19;0,134208;186,247
9,21;0,134977;186,572
9,23;0,135335;186,926
9,25;0,135718;187,29
9,27;0,135877;187,653
9,29;0,136344;188,02
9,31;0,136393;188,411
9,33;0,13648;188,8
9,35;0,136515;189,196
9,37;0,137159;189,602
9,39;0,137293;190,021
9,41;0,137739;190,439
9,43;0,138293;190,854
9,45;0,138579;191,288
9,47;0,138899;191,73
9,49;0,139658;192,178
9,51;0,139628;192,628
9,53;0,139798;193,094
9,55;0,139801;193,56
9,57;0,140314;194,019
9,59;0,140612;194,487
9,61;0,14106;194,965
9,63;0,141607;195,442
9,65;0,142068;195,922
9,67;0,142482;196,422
9,69;0,142846;196,922
9,71;0,14302;197,43
9,73;0,143135;197,946
9,75;0,143391;198,466
9,77;0,143851;198,979
9,79;0,144061;199,51
9,81;0,145038;200,028
9,83;0,145218;200,565
9,85;0,146009;201,105
9,87;0,146381;201,658
9,89;0,146672;202,201
9,91;0,146856;202,779
9,93;0,147346;203,342
9,95;0,147545;203,912
9,97;0,14799;204,486
9,99;0,148337;205,079
10,01;0,149065;205,662
10,03;0,149568;206,262
10,05;0,14996;206,85
10,07;0,150354;207,444
10,09;0,151032;208,04
10,11;0,15122;208,642
10,13;0,151914;209,248
10,15;0,152075;209,887
10,17;0,152169;210,53
10,19;0,153135;211,169
10,21;0,153601;211,821
10,23;0,153978;212,482
10,25;0,155127;213,136
10,27;0,155362;213,796
10,29;0,15602;214,467
10,31;0,156389;215,138
10,33;0,156719;215,811
10,35;0,156898;216,501
10,37;0,157532;217,185
10,39;0,157772;217,883
10,41;0,158508;218,577
10,43;0,158943;219,273
10,45;0,159884;219,962
10,47;0,160349;220,674
10,49;0,160955;221,367
10,51;0,161495;222,078
10,53;0,161946;222,792
10,55;0,162122;223,496
10,57;0,1629;224,197
10,59;0,163226;224,917
10,61;0,163854;225,634
10,63;0,164287;226,361
10,65;0,165093;227,097
10,67;0,165789;227,837
10,69;0,166258;228,569
10,71;0,166463;229,313
10,73;0,167418;230,043
10,75;0,167582;230,783
10,77;0,168287;231,521
10,79;0,168655;232,28
10,81;0,169318;233,022
10,83;0,169931;233,774
10,85;0,170822;234,528
10,87;0,171345;235,296
10,89;0,172026;236,049
10,91;0,17242;236,822
10,93;0,173442;237,598
10,95;0,173654;238,392
10,97;0,174019;239,188
10,99;0,174272;239,989
11,01;0,17533;240,791
11,03;0,175565;241,611
11,05;0,176943;242,425
11,07;0,177422;243,234
11,09;0,17794;244,051
11,11;0,178795;244,87
11,13;0,179572;245,692
11,15;0,179747;246,528
11,17;0,180166;247,365
11,19;0,180661;248,203
11,21;0,181634;249,05
11,23;0,18196;249,897
11,25;0,182767;250,733
11,27;0,183293;251,577
11,29;0,184384;252,443
11,31;0,184745;253,304
11,33;0,185795;254,167
11,35;0,186268;255,047
11,37;0,186601;255,916
11,39;0,187317;256,782
11,41;0,188038;257,656
11,43;0,188618;258,537
11,45;0,189547;259,402
11,47;0,190195;260,298
11,49;0,191313;261,192
11,51;0,191765;262,08
11,53;0,192522;262,957
11,55;0,192975;263,85
11,57;0,19354;264,723
11,59;0,19397;265,602
11,61;0,194962;266,491
11,63;0,19544;267,386
11,65;0,196224;268,273
11,67;0,196908;269,174
11,69;0,198164;270,064
11,71;0,198448;270,936
11,73;0,199099;271,805
11,75;0,199755;272,68
11,77;0,200483;273,546
11,79;0,200954;274,409
11,81;0,201795;275,294
11,83;0,202285;276,18
11,85;0,202989;277,06
11,87;0,204025;277,942
11,89;0,204744;278,828
11,91;0,205295;279,699
11,93;0,206105;280,584
11,95;0,206747;281,472
11,97;0,207298;282,342
11,99;0,207901;283,227
12,01;0,208614;284,105
12,03;0,209104;284,974
12,05;0,210372;285,845
12,07;0,210639;286,74
12,09;0,211647;287,613
12,11;0,212133;288,499
12,13;0,212983;289,396
12,15;0,213478;290,273
12,17;0,214338;291,145
12,19;0,214695;292,015
12,21;0,215452;292,882
12,23;0,216045;293,735
12,25;0,217004;294,588
12,27;0,217365;295,431
12,29;0,218382;296,276
12,31;0,218719;297,12
12,33;0,219435;297,954
12,35;0,219959;298,808
12,37;0,220605;299,659
12,39;0,221057;300,525
12,41;0,221963;301,387
12,43;0,222514;302,26
12,45;0,223333;303,122
12,47;0,223931;303,986
12,49;0,224633;304,844
12,51;0,225078;305,704
12,53;0,225771;306,559
12,55;0,226346;307,422
12,57;0,226966;308,295
12,59;0,227355;309,173
12,61;0,228242;310,046
12,63;0,228724;310,931
12,65;0,229414;311,821
12,67;0,230135;312,706
12,69;0,230869;313,593
12,71;0,231315;314,501
12,73;0,232063;315,396
12,75;0,232441;316,297
12,77;0,23303;317,205
12,79;0,23355;318,12
12,81;0,234679;319,022
12,83;0,234832;319,932
12,85;0,235967;320,832
12,87;0,236386;321,735
12,89;0,237241;322,627
12,91;0,237662;323,528
12,93;0,23823;324,427
12,95;0,238475;325,335
12,97;0,239565;326,234
12,99;0,239643;327,139
13,01;0,240554;328,051
13,03;0,241013;328,959
13,05;0,241842;329,862
13,07;0,242395;330,75
13,09;0,243313;331,634
13,11;0,24349;332,508
13,13;0,244163;333,375
13,15;0,244716;334,242
13,17;0,24514;335,127
13,19;0,245625;336,025
13,21;0,246469;336,92
13,23;0,246919;337,825
13,25;0,247807;338,739
13,27;0,248205;339,648
13,29;0,249056;340,544
13,31;0,249498;341,447
13,33;0,250089;342,345
13,35;0,250344;343,221
13,37;0,250941;344,089
13,39;0,251347;344,956
13,41;0,252265;345,8
13,43;0,252596;346,631
13,45;0,253559;347,467
13,47;0,253866;348,306
13,49;0,254648;349,132
13,51;0,254781;349,967
13,53;0,255511;350,808
13,55;0,255659;351,647
13,57;0,256302;352,477
13,59;0,256599;353,303
13,61;0,257403;354,126
13,63;0,25778;354,948
13,65;0,258505;355,744
13,67;0,259011;356,559
13,69;0,259508;357,382
13,71;0,259779;358,194
13,73;0,260406;359,008
13,75;0,260512;359,856
13,77;0,260994;360,679
13,79;0,261457;361,498
13,81;0,262077;362,324
13,83;0,26246;363,148
13,85;0,263307;363,956
13,87;0,263666;364,777
13,89;0,264329;365,584
13,91;0,264587;366,393
13,93;0,265226;367,216
13,95;0,265373;368,057
13,97;0,265985;368,893
13,99;0,266209;369,752
14,01;0,266908;370,598
14,03;0,267417;371,435
14,05;0,268153;372,243
14,07;0,26854;373,054
14,09;0,269112;373,856
14,11;0,26932;374,684
14,13;0,270106;375,508
14,15;0,270229;376,342
14,17;0,270948;377,189
14,19;0,271214;378,034
14,21;0,27181;378,875
14,23;0,272276;379,738
14,25;0,272847;380,599
14,27;0,273319;381,461
14,29;0,273949;382,321
14,31;0,274239;383,183
14,33;0,275071;384,014
14,35;0,275128;384,863
14,37;0,275615;385,691
14,39;0,276047;386,521
14,41;0,276642;387,346
14,43;0,277158;388,186
14,45;0,277883;389,016
14,47;0,278195;389,866
14,49;0,279103;390,708
14,51;0,279302;391,551
14,53;0,280107;392,386
14,55;0,280322;393,217
14,57;0,280826;394,052
14,59;0,281247;394,886
14,61;0,282054;395,701
14,63;0,282279;396,529
14,65;0,28303;397,348
14,67;0,283592;398,158
14,69;0,284326;398,983
14,71;0,28462;399,824
14,73;0,285443;400,661
14,75;0,285739;401,516
14,77;0,286353;402,367
14,79;0,286947;403,207
14,81;0,287501;404,039
14,83;0,287964;404,86
14,85;0,2887;405,67
14,87;0,289185;406,491
14,89;0,290056;407,315
14,91;0,29045;408,131
14,93;0,291122;408,946
14,95;0,291598;409,765
14,97;0,292273;410,571
14,99;0,292623;411,402
15,01;0,293089;412,239
15,03;0,293708;413,102
15,05;0,294415;413,964
15,07;0,29499;414,85
15,09;0,295748;415,715
15,11;0,29602;416,604
15,13;0,296863;417,465
15,15;0,2972;418,328
15,17;0,297813;419,167
15,19;0,298189;420,004
15,21;0,298916;420,816
15,23;0,299245;421,649
15,25;0,30029;422,484
15,27;0,300548;423,327
15,29;0,301269;424,175
15,31;0,301746;425,042
15,33;0,30242;425,889
15,35;0,302633;426,73
15,37;0,303507;427,571
15,39;0,303646;428,411
15,41;0,304481;429,231
15,43;0,305026;430,063
15,45;0,305509;430,899
15,47;0,306371;431,747
15,49;0,30688;432,607
15,51;0,30725;433,478
15,53;0,308182;434,356
15,55;0,308385;435,236
15,57;0,309375;436,105
15,59;0,309676;436,973
15,61;0,310534;437,84
15,63;0,310972;438,699
15,65;0,311693;439,562
15,67;0,312412;440,434
15,69;0,313115;441,284
15,71;0,313761;442,138
15,73;0,314574;443,002
15,75;0,314869;443,866
15,77;0,315784;444,736
15,79;0,316238;445,643
15,81;0,317038;446,567
15,83;0,31745;447,497
15,85;0,318407;448,423
15,87;0,318884;449,34
15,89;0,319941;450,23
15,91;0,320368;451,099
15,93;0,321165;451,953
15,95;0,321678;452,823
15,97;0,322413;453,699
15,99;0,323067;454,588
16,01;0,323743;455,494
16,03;0,324295;456,404
16,05;0,324997;457,295
16,07;0,325591;458,189
16,09;0,326442;459,071
16,11;0,326685;459,945
16,13;0,327596;460,827
16,15;0,328082;461,722
16,17;0,328989;462,614
16,19;0,329497;463,529
16,21;0,330072;464,453
16,23;0,330626;465,372
16,25;0,331515;466,299
16,27;0,332055;467,229
16,29;0,332784;468,136
16,31;0,333311;469,027
16,33;0,334135;469,927
16,35;0,334652;470,827
16,37;0,33544;471,72
16,39;0,33558;472,626
16,41;0,336634;473,545
16,43;0,336972;474,484
16,45;0,337995;475,422
16,47;0,33854;476,373
16,49;0,339067;477,322
16,51;0,339982;478,299
16,53;0,340774;479,255
16,55;0,341357;480,217
16,57;0,342204;481,167
16,59;0,342844;482,116
16,61;0,343525;483,033
16,63;0,344068;483,957
16,65;0,344936;484,878
16,67;0,345259;485,802
16,69;0,345949;486,725
16,71;0,34671;487,645
16,73;0,347458;488,563
16,75;0,348219;489,468
16,77;0,348887;490,386
16,79;0,349642;491,325
16,81;0,350476;492,269
16,83;0,350904;493,226
16,85;0,35167;494,202
16,87;0,35226;495,187
16,89;0,353164;496,158
16,91;0,353726;497,125
16,93;0,354613;498,075
16,95;0,355089;499,005
16,97;0,355946;499,923
16,99;0,356517;500,852
17,01;0,357357;501,789
17,03;0,357939;502,731
17,05;0,35848;503,685
17,07;0,359213;504,646
17,09;0,359952;505,599
17,11;0,360501;506,568
17,13;0,361195;507,543
17,15;0,362032;508,534
17,17;0,362757;509,538
17,19;0,363486;510,543
17,21;0,364354;511,535
17,23;0,364717;512,521
17,25;0,365664;513,496
17,27;0,366015;514,462
17,29;0,367049;515,436
17,31;0,367388;516,404
17,33;0,368381;517,371
17,35;0,368926;518,335
17,37;0,369931;519,294
17,39;0,37043;520,258
17,41;0,371235;521,226
17,43;0,371798;522,237
17,45;0,372666;523,273
17,47;0,373285;524,307
17,49;0,374172;525,329
17,51;0,374723;526,364
17,53;0,375683;527,359
17,55;0,376093;528,323
17,57;0,376943;529,295
17,59;0,377588;530,276
17,61;0,378382;531,237
17,63;0,378976;532,214
17,65;0,379806;533,194
17,67;0,380374;534,177
17,69;0,381126;535,166
17,71;0,381737;536,187
17,73;0,382601;537,208
17,75;0,383106;538,258
17,77;0,384304;539,304
17,79;0,384857;540,352
17,81;0,385673;541,39
17,83;0,386395;542,433
17,85;0,387025;543,453
17,87;0,387667;544,478
17,89;0,388665;545,491
17,91;0,388978;546,497
17,93;0,39026;547,495
17,95;0,390632;548,508
17,97;0,391756;549,52
17,99;0,39245;550,556
18,01;0,393377;551,605
18,03;0,393845;552,66
18,05;0,394898;553,715
18,07;0,395489;554,775
18,09;0,396368;555,804
18,11;0,397012;556,838
18,13;0,397908;557,9
18,15;0,398405;558,95
18,17;0,399621;559,989
18,19;0,400153;561,048
18,21;0,401073;562,096
18,23;0,401725;563,125
18,25;0,402841;564,161
18,27;0,403491;565,228
18,29;0,404517;566,307
18,31;0,405067;567,412
18,33;0,406193;568,518
18,35;0,406901;569,641
18,37;0,407805;570,734
18,39;0,408567;571,815
18,41;0,409532;572,896
18,43;0,41014;573,977
18,45;0,411347;575,03
18,47;0,411759;576,093
18,49;0,412656;577,169
18,51;0,413414;578,239
18,53;0,414532;579,327
18,55;0,41527;580,45
18,57;0,416301;581,584
18,59;0,417129;582,716
18,61;0,418127;583,835
18,63;0,418899;584,944
18,65;0,419845;586,046
18,67;0,4204;587,153
18,69;0,421658;588,248
18,71;0,422342;589,339
18,73;0,423311;590,403
18,75;0,424003;591,467
18,77;0,425083;592,525
18,79;0,425607;593,61
18,81;0,42695;594,731
18,83;0,427762;595,901
18,85;0,428583;597,067
18,87;0,429776;598,238
18,89;0,430603;599,378
18,91;0,43123;600,505
18,93;0,432453;601,61
18,95;0,432845;602,724
18,97;0,434111;603,839
18,99;0,434978;604,984
19,01;0,435958;606,132
19,03;0,436871;607,293
19,05;0,437828;608,459
19,07;0,438838;609,623
19,09;0,43992;610,786
19,11;0,440669;611,961
19,13;0,44178;613,113
19,15;0,442564;614,266
19,17;0,443731;615,445
19,19;0,444453;616,619
19,21;0,445555;617,754
19,23;0,446309;618,897
19,25;0,447468;620,03
19,27;0,448165;621,143
19,29;0,449339;622,262
19,31;0,450054;623,435
19,33;0,451135;624,622
19,35;0,452003;625,813
19,37;0,453202;626,998
19,39;0,45397;628,164
19,41;0,454997;629,294
19,43;0,455834;630,425
19,45;0,457027;631,57
19,47;0,45782;632,723
19,49;0,458931;633,895
19,51;0,459353;635,081
19,53;0,460729;636,255
19,55;0,461484;637,413
19,57;0,462646;638,581
19,59;0,463307;639,744
19,61;0,46477;640,907
19,63;0,465401;642,073
19,65;0,466701;643,24
19,67;0,467427;644,403
19,69;0,468287;645,552
19,71;0,469234;646,685
19,73;0,470448;647,796
19,75;0,471198;648,901
19,77;0,47213;650,015
19,79;0,473042;651,147
19,81;0,474117;652,3
19,83;0,475077;653,5
19,85;0,476241;654,706
19,87;0,476945;655,891
19,89;0,478235;657,057
19,91;0,479082;658,218
19,93;0,480206;659,356
19,95;0,481001;660,493
19,97;0,481961;661,645
19,99;0,482795;662,802
20,01;0,484035;663,947
20,03;0,484872;665,109
20,05;0,48609;666,287
20,07;0,486765;667,469
20,09;0,488153;668,663
20,11;0,489004;669,867
20,13;0,490113;671,048
20,15;0,490798;672,224
20,17;0,491818;673,383
20,19;0,492839;674,53
20,21;0,494108;675,66
20,23;0,494756;676,796
20,25;0,495992;677,926
20,27;0,496764;679,068
20,29;0,497912;680,223
20,31;0,498783;681,412
20,33;0,499878;682,596
20,35;0,500701;683,763
20,37;0,502035;684,925
20,39;0,502883;686,071
20,41;0,504066;687,201
20,43;0,504709;688,351
20,45;0,506104;689,516
20,47;0,506694;690,665
20,49;0,508162;691,816
20,51;0,508847;692,974
20,53;0,5099;694,113
20,55;0,511071;695,267
20,57;0,512087;696,45
20,59;0,512861;697,652
20,61;0,51445;698,842
20,63;0,514882;700,04
20,65;0,516551;701,211
20,67;0,517534;702,37
20,69;0,518302;703,507
20,71;0,519532;704,641
20,73;0,520391;705,762
20,75;0,521422;706,906
20,77;0,522652;708,043
20,79;0,523338;709,199
20,81;0,524703;710,382
20,83;0,525641;711,563
20,85;0,527059;712,726
20,87;0,527927;713,887
20,89;0,528927;715,023
20,91;0,530128;716,152
20,93;0,531168;717,286
20,95;0,532304;718,426
20,97;0,533496;719,544
20,99;0,534328;720,681
21,01;0,535802;721,796
21,03;0,536641;722,935
21,05;0,537885;724,084
21,07;0,538965;725,277
21,09;0,540282;726,477
21,11;0,541213;727,7
21,13;0,542762;728,871
21,15;0,543376;730,032
21,17;0,544595;731,159
21,19;0,545791;732,276
21,21;0,546988;733,359
21,23;0,548006;734,483
21,25;0,549382;735,605
21,27;0,550122;736,741
21,29;0,551707;737,892
21,31;0,552393;739,075
21,33;0,553921;740,248
21,35;0,554726;741,427
21,37;0,556223;742,605
21,39;0,557396;743,77
21,41;0,558568;744,922
21,43;0,559676;746,08
21,45;0,560908;747,233
21,47;0,561969;748,36
21,49;0,563446;749,478
21,51;0,564285;750,602
21,53;0,565813;751,734
21,55;0,566796;752,891
21,57;0,568275;754,1
21,59;0,569488;755,319
21,61;0,570627;756,529
21,63;0,571807;757,732
21,65;0,573338;758,91
21,67;0,574407;760,063
21,69;0,575912;761,229
21,71;0,577022;762,389
21,73;0,578409;763,538
21,75;0,57948;764,691
21,77;0,580991;765,846
21,79;0,581911;767,011
21,81;0,583494;768,196
21,83;0,584584;769,396
21,85;0,586402;770,587
21,87;0,587404;771,792
21,89;0,58892;772,963
21,91;0,590101;774,118
21,93;0,591508;775,26
21,95;0,592733;776,401
21,97;0,594231;777,516
21,99;0,59522;778,645
22,01;0,596995;779,792
22,03;0,597939;780,953
22,05;0,599741;782,132
22,07;0,600657;783,34
22,09;0,60236;784,541
22,11;0,603739;785,729
22,13;0,605344;786,898
22,15;0,606553;788,054
22,17;0,608107;789,194
22,19;0,609301;790,336
22,21;0,611104;791,452
22,23;0,612103;792,584
22,25;0,613824;793,717
22,27;0,615085;794,849
22,29;0,616681;795,989
22,31;0,618259;797,175
22,33;0,619876;798,364
22,35;0,62105;799,558
22,37;0,623049;800,743
22,39;0,624223;801,905
22,41;0,626014;803,034
22,43;0,627341;804,146
22,45;0,62894;805,229
22,47;0,63039;806,303
22,49;0,631994;807,392
22,51;0,633452;808,497
22,53;0,635113;809,607
22,55;0,636495;810,757
22,57;0,63864;811,935
22,59;0,639807;813,112
22,61;0,642123;814,276
22,63;0,643398;815,438
22,65;0,645207;816,596
22,67;0,646893;817,754
22,69;0,648753;818,908
22,71;0,65022;820,059
22,73;0,652182;821,196
22,75;0,653604;822,317
22,77;0,655633;823,423
22,79;0,657224;824,539
22,81;0,659125;825,681
22,83;0,660737;826,856
22,85;0,662965;828,029
22,87;0,664618;829,187
22,89;0,666685;830,32
22,91;0,668295;831,431
22,93;0,670357;832,507
22,95;0,67215;833,578
22,97;0,674233;834,654
22,99;0,675772;835,733
23,01;0,677895;836,808
23,03;0,679592;837,901
23,05;0,681642;839,004
23,07;0,683349;840,113
23,09;0,6856;841,234
23,11;0,687473;842,361
23,13;0,689918;843,461
23,15;0,691818;844,572
23,17;0,693925;845,683
23,19;0,695754;846,794
23,21;0,698267;847,882
23,23;0,700072;848,977
23,25;0,70222;850,052
23,27;0,704328;851,122
23,29;0,70661;852,191
23,31;0,708914;853,305
23,33;0,711333;854,414
23,35;0,713127;855,516
23,37;0,715917;856,597
23,39;0,717671;857,671
23,41;0,720426;858,701
23,43;0,722281;859,748
23,45;0,724981;860,79
23,47;0,727348;861,835
23,49;0,729845;862,888
23,51;0,732239;863,94
23,53;0,734636;864,975
23,55;0,737142;866,023
23,57;0,739725;867,077
23,59;0,742152;868,119
23,61;0,745079;869,156
23,63;0,747149;870,206
23,65;0,750275;871,24
23,67;0,752537;872,272
23,69;0,755558;873,286
23,71;0,75818;874,29
23,73;0,76108;875,278
23,75;0,763608;876,271
23,77;0,766773;877,273
23,79;0,769474;878,297
23,81;0,772266;879,348
23,83;0,775096;880,402
23,85;0,778245;881,437
23,87;0,780811;882,439
23,89;0,784151;883,417
23,91;0,786639;884,385
23,93;0,79022;885,335
23,95;0,79312;886,294
23,97;0,796415;887,245
23,99;0,799435;888,192
24,01;0,802489;889,115
24,03;0,805636;890,053
24,05;0,809033;890,993
24,07;0,811952;891,949
24,09;0,815364;892,906
24,11;0,818782;893,874
24,13;0,822179;894,806
24,15;0,825726;895,734
24,17;0,829186;896,657
24,19;0,832383;897,564
24,21;0,836456;898,439
24,23;0,83971;899,341
24,25;0,843449;900,223
24,27;0,846882;901,108
24,29;0,850623;902,014
24,31;0,85416;902,943
24,33;0,858391;903,839
24,35;0,861915;904,721
24,37;0,86597;905,58
24,39;0,869776;906,407
24,41;0,874032;907,22
24,43;0,877598;908,036
24,45;0,882027;908,859
24,47;0,885545;909,663
24,49;0,890102;910,467
24,51;0,894032;911,26
24,53;0,898428;912,054
24,55;0,902247;912,858
24,57;0,906859;913,674
24,59;0,911178;914,475
24,61;0,915693;915,272
24,63;0,919935;916,062
24,65;0,924439;916,812
24,67;0,928473;917,548
24,69;0,933579;918,287
24,71;0,937675;919,011
24,73;0,942307;919,728
24,75;0,946966;920,469
24,77;0,951794;921,214
24,79;0,956415;921,965
24,81;0,961747;922,735
24,83;0,966484;923,5
24,85;0,971677;924,226
24,87;0,97692;924,945
24,89;0,982316;925,654
24,91;0,986789;926,337
24,93;0,992626;927,009
24,95;0,997538;927,685
24,97;1,00319;928,338
24,99;1,00857;928,98
25,01;1,0137;929,612
25,03;1,01897;930,246
25,05;1,02508;930,9
25,07;1,0301;931,568
25,09;1,03645;932,229
25,11;1,04174;932,881
25,13;1,04792;933,499
25,15;1,05348;934,094
25,17;1,05971;934,676
25,19;1,06507;935,24
25,21;1,07128;935,807
25,23;1,07735;936,388
25,25;1,08364;936,961
25,27;1,08902;937,535
25,29;1,09582;938,12
25,31;1,10144;938,7
25,33;1,10856;939,266
25,35;1,11468;939,828
25,37;1,12126;940,374
25,39;1,12744;940,901
25,41;1,13457;941,432
25,43;1,14074;941,964
25,45;1,14772;942,476
25,47;1,15391;942,967
25,49;1,16081;943,463
25,51;1,16725;943,944
25,53;1,17479;944,434
25,55;1,18089;944,946
25,57;1,18811;945,466
25,59;1,19504;945,975
25,61;1,2027;946,472
25,63;1,2091;946,955
25,65;1,21675;947,412
25,67;1,22339;947,861
25,69;1,23095;948,295
25,71;1,23818;948,732
25,73;1,24573;949,151
25,75;1,25231;949,579
25,77;1,26014;949,994
25,79;1,26691;950,426
25,81;1,27503;950,86
25,83;1,28199;951,305
25,85;1,29007;951,729
25,87;1,29743;952,163
25,89;1,30554;952,586
25,91;1,31291;952,993
25,93;1,32077;953,392
25,95;1,32791;953,779
25,97;1,33625;954,166
25,99;1,3436;954,559
26,01;1,35185;954,954
26,03;1,35917;955,343
26,05;1,36768;955,746
26,07;1,37509;956,15
26,09;1,3838;956,535
26,11;1,39128;956,91
26,13;1,39978;957,271
26,15;1,40768;957,642
26,17;1,41625;957,988
26,19;1,42384;958,333
26,21;1,43268;958,678
26,23;1,44049;959,036
26,25;1,44893;959,368
26,27;1,45697;959,709
26,29;1,4656;960,052
26,31;1,47334;960,406
26,33;1,48264;960,756
26,35;1,49085;961,116
26,37;1,49951;961,473
26,39;1,50809;961,811
26,41;1,51661;962,136
26,43;1,52512;962,456
26,45;1,5339;962,76
26,47;1,54217;963,049
26,49;1,55086;963,354
26,51;1,55922;963,651
26,53;1,56815;963,951
26,55;1,57623;964,266
26,57;1,58556;964,591
26,59;1,59385;964,901
26,61;1,60324;965,203
26,63;1,61168;965,498
26,65;1,62066;965,782
26,67;1,62914;966,067
26,69;1,63809;966,353
26,71;1,64661;966,631
26,73;1,65561;966,897
26,75;1,66387;967,164
26,77;1,67308;967,428
26,79;1,68133;967,712
26,81;1,6908;968,017
26,83;1,69958;968,323
26,85;1,70863;968,613
26,87;1,71772;968,894
26,89;1,72688;969,157
26,91;1,73573;969,409
26,93;1,74504;969,661
26,95;1,75406;969,914
26,97;1,76314;970,177
26,99;1,77225;970,437
27,01;1,78142;970,702
27,03;1,79037;970,979
27,05;1,80006;971,243
27,07;1,80915;971,501
27,09;1,81875;971,756
27,11;1,82803;971,992
27,13;1,83755;972,22
27,15;1,84678;972,481
27,17;1,85655;972,73
27,19;1,86557;972,966
27,21;1,87531;973,201
27,23;1,88446;973,437
27,25;1,89407;973,646
27,27;1,90298;973,88
27,29;1,91277;974,133
27,31;1,92195;974,399
27,33;1,9317;974,652
27,35;1,94135;974,904
27,37;1,95106;975,135
27,39;1,96048;975,349
27,41;1,97009;975,56
27,43;1,97962;975,779
27,45;1,98925;975,999
27,47;1,9988;976,23
27,49;2,00843;976,479
27,51;2,018;976,716
27,53;2,02772;976,95
27,55;2,03728;977,186
27,57;2,04715;977,407
27,59;2,05674;977,616
27,61;2,06678;977,825
27,63;2,07646;978,039
27,65;2,08613;978,25
27,67;2,096;978,461
27,69;2,10569;978,648
27,71;2,11554;978,846
27,73;2,12537;979,035
27,75;2,13463;979,239
27,77;2,14468;979,445
27,79;2,15408;979,682
27,81;2,16437;979,918
27,83;2,17391;980,147
27,85;2,18414;980,352
27,87;2,19382;980,54
27,89;2,20392;980,727
27,91;2,21354;980,908
27,93;2,22346;981,09
27,95;2,2331;981,293
27,97;2,24319;981,5
27,99;2,25274;981,691
28,01;2,26276;981,884
28,03;2,27224;982,098
28,05;2,28252;982,297
28,07;2,2922;982,508
28,09;2,30257;982,718
28,11;2,31271;982,924
28,13;2,32266;983,114
28,15;2,33294;983,309
28,17;2,34287;983,484
28,19;2,35307;983,65
28,21;2,36309;983,813
28,23;2,37304;983,984
28,25;2,38313;984,152
28,27;2,39308;984,345
28,29;2,40315;984,565
28,31;2,41304;984,783
28,33;2,42336;984,97
28,35;2,4334;985,157
28,37;2,44353;985,323
28,39;2,45364;985,477
28,41;2,46372;985,643
28,43;2,47377;985,828
28,45;2,48416;986
28,47;2,49406;986,185
28,49;2,5043;986,366
28,51;2,51432;986,529
28,53;2,52435;986,705
28,55;2,53439;986,9
28,57;2,54475;987,091
28,59;2,5548;987,286
28,61;2,56526;987,469
28,63;2,57528;987,654
28,65;2,58544;987,812
28,67;2,59562;987,972
28,69;2,6057;988,112
28,71;2,61584;988,268
28,73;2,62611;988,415
28,75;2,63607;988,602
28,77;2,64606;988,776
28,79;2,6563;988,969
28,81;2,66655;989,16
28,83;2,67676;989,348
28,85;2,68721;989,495
28,87;2,69735;989,648
28,89;2,70757;989,804
28,91;2,71772;989,962
28,93;2,72802;990,109
28,95;2,73789;990,269
28,97;2,74837;990,426
28,99;2,75825;990,574
29,01;2,76853;990,723
29,03;2,7786;990,893
29,05;2,78891;991,082
29,07;2,79938;991,28
29,09;2,81006;991,477
29,11;2,82031;991,662
29,13;2,83107;991,824
29,15;2,84126;991,971
29,17;2,85181;992,102
29,19;2,86209;992,223
29,21;2,87255;992,347
29,23;2,8827;992,492
29,25;2,89307;992,628
29,27;2,90328;992,789
29,29;2,91362;992,95
29,31;2,92404;993,122
29,33;2,93463;993,27
29,35;2,94495;993,425
29,37;2,9555;993,557
29,39;2,96574;993,701
29,41;2,976;993,845
29,43;2,9861;993,99
29,45;2,9967;994,106
29,47;3,00654;994,24
29,49;3,01694;994,363
29,51;3,02688;994,494
29,53;3,03729;994,653
29,55;3,04755;994,838
29,57;3,05803;995,014
29,59;3,06833;995,192
29,61;3,07891;995,343
29,63;3,08934;995,482
29,65;3,09977;995,616
29,67;3,11;995,75
29,69;3,12063;995,868
29,71;3,13081;996,01
29,73;3,14129;996,156
29,75;3,15148;996,299
29,77;3,16167;996,444
29,79;3,17184;996,604
29,81;3,18261;996,76
29,83;3,19281;996,898
29,85;3,20367;997,033
29,87;3,21387;997,173
29,89;3,22444;997,314
29,91;3,23466;997,449
29,93;3,24506;997,577
29,95;3,25533;997,708
29,97;3,26568;997,824
29,99;3,27599;997,947
30,01;3,28653;998,08
30,03;3,29666;998,232
30,05;3,30728;998,388
30,07;3,31751;998,55
30,09;3,32834;998,704
30,11;3,3387;998,842
30,13;3,34926;998,974
30,15;3,35962;999,114
30,17;3,37025;999,244
30,19;3,3805;999,363
30,21;3,39123;999,492
30,23;3,40117;999,624
30,25;3,41157;999,747
30,27;3,42197;999,89
30,29;3,43246;1000,04
30,31;3,44294;1000,19
30,33;3,45391;1000,34
30,35;3,46442;1000,49
30,37;3,47523;1000,61
30,39;3,48566;1000,74
30,41;3,496;1000,85
30,43;3,50626;1000,95
30,45;3,51705;1001,04
30,47;3,52717;1001,15
30,49;3,53757;1001,26
30,51;3,54797;1001,39
30,53;3,55821;1001,54
30,55;3,56892;1001,7
30,57;3,57978;1001,85
30,59;3,59;1001,99
30,61;3,60093;1002,12
30,63;3,6117;1002,24
30,65;3,6222;1002,36
30,67;3,63276;1002,49
30,69;3,64386;1002,62
30,71;3,65388;1002,74
30,73;3,66485;1002,84
30,75;3,67511;1002,95
30,77;3,68561;1003,05
30,79;3,69585;1003,18
30,81;3,70686;1003,32
30,83;3,71701;1003,45
30,85;3,728;1003,58
30,87;3,73831;1003,7
30,89;3,74889;1003,8
30,91;3,75929;1003,91
30,93;3,77026;1004,02
30,95;3,78041;1004,13
30,97;3,79139;1004,24
30,99;3,80143;1004,38
31,01;3,81237;1004,49
31,03;3,82239;1004,63
31,05;3,83318;1004,75
31,07;3,84335;1004,88
31,09;3,85444;1004,98
31,11;3,86471;1005,09
31,13;3,8756;1005,19
31,15;3,88599;1005,31
31,17;3,89677;1005,43
31,19;3,90711;1005,54
31,21;3,91823;1005,65
31,23;3,92806;1005,75
31,25;3,93919;1005,85
31,27;3,9491;1005,96
31,29;3,96;1006,11
31,31;3,97029;1006,25
31,33;3,98123;1006,38
31,35;3,99165;1006,5
31,37;4,00288;1006,6
31,39;4,01323;1006,68
31,41;4,02415;1006,77
31,43;4,03453;1006,86
31,45;4,04534;1006,95
31,47;4,05549;1007,06
31,49;4,06633;1007,17
31,51;4,07614;1007,27
31,53;4,08687;1007,37
31,55;4,09721;1007,49
31,57;4,10806;1007,59
31,59;4,11816;1007,7
31,61;4,12922;1007,81
31,63;4,1393;1007,92
31,65;4,15006;1008,02
31,67;4,16046;1008,12
31,69;4,17119;1008,21
31,71;4,18122;1008,3
31,73;4,19233;1008,39
31,75;4,20213;1008,51
31,77;4,21327;1008,63
31,79;4,22347;1008,79
31,81;4,23476;1008,95
31,83;4,24509;1009,09
31,85;4,25653;1009,19
31,87;4,2667;1009,28
31,89;4,27777;1009,35
31,91;4,28816;1009,42
31,93;4,29917;1009,5
31,95;4,3096;1009,6
31,97;4,32058;1009,7
31,99;4,33081;1009,8
32,01;4,34193;1009,91
32,03;4,35218;1010,03
32,05;4,36327;1010,14
32,07;4,37371;1010,27
32,09;4,3848;1010,38
32,11;4,39537;1010,49
32,13;4,40658;1010,6
32,15;4,41657;1010,7
32,17;4,42825;1010,78
32,19;4,43846;1010,87
32,21;4,44952;1010,95
32,23;4,46014;1011,04
32,25;4,47117;1011,14
32,27;4,48163;1011,28
32,29;4,49285;1011,4
32,31;4,50341;1011,51
32,33;4,51463;1011,61
32,35;4,52517;1011,68
32,37;4,53641;1011,73
32,39;4,54669;1011,8
32,41;4,5576;1011,89
32,43;4,56838;1011,98
32,45;4,57925;1012,08
32,47;4,59003;1012,18
32,49;4,60094;1012,27
32,51;4,61114;1012,35
32,53;4,62249;1012,43
32,55;4,63292;1012,54
32,57;4,64414;1012,65
32,59;4,65467;1012,76
32,61;4,66596;1012,88
32,63;4,67626;1012,96
32,65;4,68725;1013,04
32,67;4,69794;1013,12
32,69;4,70878;1013,18
32,71;4,71942;1013,24
32,73;4,73063;1013,34
32,75;4,74097;1013,44
32,77;4,75216;1013,54
32,79;4,76255;1013,66
32,81;4,77409;1013,78
32,83;4,78453;1013,87
32,85;4,79586;1013,95
32,87;4,80663;1014,03
32,89;4,81741;1014,1
32,91;4,82792;1014,17
32,93;4,83904;1014,24
32,95;4,84945;1014,32
32,97;4,86045;1014,4
32,99;4,87075;1014,47
33,01;4,88193;1014,55
33,03;4,89244;1014,66
33,05;4,90358;1014,76
33,07;4,91426;1014,88
33,09;4,92586;1014,99
33,11;4,93629;1015,09
33,13;4,94752;1015,16
33,15;4,95835;1015,23
33,17;4,96921;1015,28
33,19;4,98025;1015,36
33,21;4,99141;1015,43
33,23;5,0019;1015,52
33,25;5,01312;1015,62
33,27;5,0239;1015,73
33,29;5,03546;1015,83
33,31;5,04617;1015,93
33,33;5,05775;1016,03
33,35;5,06852;1016,11
33,37;5,08023;1016,18
33,39;5,09084;1016,25
33,41;5,10209;1016,34
33,43;5,11282;1016,41
33,45;5,12428;1016,46
33,47;5,1351;1016,52
33,49;5,14636;1016,56
33,51;5,15664;1016,62
33,53;5,16811;1016,7
33,55;5,17869;1016,8
33,57;5,19013;1016,89
33,59;5,20065;1016,98
33,61;5,21184;1017,05
33,63;5,22261;1017,11
33,65;5,23378;1017,16
33,67;5,24437;1017,22
33,69;5,25526;1017,3
33,71;5,26572;1017,37
33,73;5,27674;1017,44
33,75;5,28752;1017,53
33,77;5,29848;1017,61
33,79;5,30908;1017,71
33,81;5,32044;1017,8
33,83;5,33125;1017,9
33,85;5,34275;1017,99
33,87;5,35336;1018,09
33,89;5,36466;1018,17
33,91;5,37513;1018,26
33,93;5,38668;1018,33
33,95;5,39756;1018,39
33,97;5,40872;1018,45
33,99;5,41936;1018,52
34,01;5,43086;1018,59
34,03;5,44191;1018,69
34,05;5,4533;1018,78
34,07;5,4643;1018,87
34,09;5,47562;1018,93
34,11;5,48681;1018,99
34,13;5,49832;1019,05
34,15;5,50873;1019,12
34,17;5,52033;1019,17
34,19;5,53118;1019,24
34,21;5,54255;1019,31
34,23;5,55357;1019,37
34,25;5,56459;1019,42
34,27;5,57595;1019,5
34,29;5,58726;1019,57
34,31;5,59844;1019,66
34,33;5,61006;1019,75
34,35;5,6209;1019,85
34,37;5,6328;1019,93
34,39;5,64385;1020,01
34,41;5,65529;1020,07
34,43;5,6666;1020,11
34,45;5,67796;1020,15
34,47;5,68908;1020,21
34,49;5,70086;1020,26
34,51;5,71154;1020,33
34,53;5,72337;1020,41
34,55;5,73455;1020,5
34,57;5,74624;1020,58
34,59;5,75782;1020,66
34,61;5,76913;1020,72
34,63;5,78065;1020,79
34,65;5,79242;1020,85
34,67;5,80365;1020,91
34,69;5,8157;1020,97
34,71;5,82623;1021,03
34,73;5,83794;1021,06
34,75;5,84883;1021,11
34,77;5,86034;1021,17
34,79;5,87169;1021,24
34,81;5,88303;1021,31
34,83;5,8947;1021,39
34,85;5,90661;1021,45
34,87;5,91751;1021,51
34,89;5,92949;1021,56
34,91;5,9401;1021,61
34,93;5,95187;1021,67
34,95;5,96345;1021,75
34,97;5,97468;1021,82
34,99;5,9856;1021,88
35,01;5,99749;1021,96
35,03;6,00861;1022,03
35,05;6,02029;1022,08
35,07;6,03163;1022,15
35,09;6,04331;1022,19
35,11;6,05489;1022,23
35,13;6,0668;1022,29
35,15;6,07756;1022,35
35,17;6,08932;1022,39
35,19;6,10079;1022,43
35,21;6,11191;1022,47
35,23;6,12338;1022,5
35,25;6,13467;1022,55
35,27;6,14579;1022,63
35,29;6,15747;1022,72
35,31;6,16898;1022,81
35,33;6,18085;1022,88
35,35;6,19214;1022,95
35,37;6,20411;1022,98
35,39;6,2153;1023,01
35,41;6,2271;1023,04
35,43;6,23861;1023,1
35,45;6,25032;1023,15
35,47;6,26146;1023,23
35,49;6,27349;1023,3
35,51;6,28454;1023,37
35,53;6,29647;1023,43
35,55;6,308;1023,5
35,57;6,31985;1023,55
35,59;6,33118;1023,61
35,61;6,34347;1023,66
35,63;6,35417;1023,71
35,65;6,36658;1023,76
35,67;6,37787;1023,81
35,69;6,38998;1023,83
35,71;6,40133;1023,85
35,73;6,41289;1023,89
35,75;6,42433;1023,93
35,77;6,43617;1023,99
35,79;6,44758;1024,09
35,81;6,45951;1024,18
35,83;6,47116;1024,25
35,85;6,48311;1024,27
35,87;6,49484;1024,3
35,89;6,50659;1024,31
35,91;6,51804;1024,33
35,93;6,52994;1024,37
35,95;6,54156;1024,42
35,97;6,55334;1024,47
35,99;6,56451;1024,51
36,01;6,5766;1024,56
36,03;6,58815;1024,61
36,05;6,59986;1024,66
36,07;6,61185;1024,72
36,09;6,62372;1024,78
36,11;6,63498;1024,83
36,13;6,64721;1024,88
36,15;6,6588;1024,92
36,17;6,67041;1024,94
36,19;6,68214;1024,96
36,21;6,69409;1024,97
36,23;6,70513;1024,99
36,25;6,71728;1025,04
36,27;6,72849;1025,11
36,29;6,74051;1025,17
36,31;6,75203;1025,24
36,33;6,76418;1025,29
36,35;6,77554;1025,3
36,37;6,78739;1025,31
36,39;6,79885;1025,35
36,41;6,81064;1025,37
36,43;6,82219;1025,41
36,45;6,83363;1025,45
36,47;6,84543;1025,5
36,49;6,85724;1025,52
36,51;6,86843;1025,58
36,53;6,8805;1025,63
36,55;6,89174;1025,7
36,57;6,90376;1025,76
36,59;6,91543;1025,83
36,61;6,92735;1025,86
36,63;6,93877;1025,88
36,65;6,95091;1025,89
36,67;6,96244;1025,9
36,69;6,9744;1025,89
36,71;6,98596;1025,92
36,73;6,99755;1025,96
36,75;7,00895;1026,01
36,77;7,0207;1026,06
36,79;7,03223;1026,13
36,81;7,04437;1026,18
36,83;7,05581;1026,21
36,85;7,06803;1026,24
36,87;7,07974;1026,26
36,89;7,09128;1026,28
36,91;7,10315;1026,31
36,93;7,11488;1026,34
36,95;7,12664;1026,37
36,97;7,13841;1026,39
36,99;7,14992;1026,42
37,01;7,16184;1026,45
37,03;7,17332;1026,51
37,05;7,18532;1026,57
37,07;7,19719;1026,64
37,09;7,20915;1026,68
37,11;7,22079;1026,71
37,13;7,23302;1026,72
37,15;7,24463;1026,73
37,17;7,25659;1026,72
37,19;7,26836;1026,74
37,21;7,2803;1026,76
37,23;7,2919;1026,8
37,25;7,30422;1026,85
37,27;7,3158;1026,91
37,29;7,3282;1026,96
37,31;7,34009;1027
37,33;7,35239;1027,03
37,35;7,36426;1027,05
37,37;7,37642;1027,05
37,39;7,38822;1027,08
37,41;7,40043;1027,1
37,43;7,4123;1027,11
37,45;7,4242;1027,12
37,47;7,43614;1027,14
37,49;7,44811;1027,14
37,51;7,45996;1027,18
37,53;7,47201;1027,24
37,55;7,48394;1027,3
37,57;7,49609;1027,35
37,59;7,50812;1027,39
37,61;7,52034;1027,39
37,63;7,53199;1027,4
37,65;7,54422;1027,41
37,67;7,55629;1027,42
37,69;7,5686;1027,44
37,71;7,58028;1027,46
37,73;7,59239;1027,47
37,75;7,60397;1027,49
37,77;7,61615;1027,52
37,79;7,628;1027,55
37,81;7,64013;1027,59
37,83;7,65218;1027,62
37,85;7,66438;1027,63
37,87;7,67614;1027,66
37,89;7,68819;1027,66
37,91;7,69991;1027,65
37,93;7,71198;1027,65
37,95;7,72376;1027,65
37,97;7,73601;1027,64
37,99;7,74763;1027,66
38,01;7,75983;1027,69
38,03;7,77138;1027,74
38,05;7,78387;1027,79
38,07;7,79569;1027,83
38,09;7,80794;1027,86
38,11;7,81977;1027,87
38,13;7,8322;1027,89
38,15;7,84407;1027,9
38,17;7,85637;1027,9
38,19;7,86817;1027,91
38,21;7,88044;1027,91
38,23;7,89232;1027,91
38,25;7,90454;1027,92
38,27;7,91652;1027,94
38,29;7,92915;1027,98
38,31;7,94111;1028,03
38,33;7,95398;1028,07
38,35;7,96624;1028,09
38,37;7,97847;1028,11
38,39;7,99078;1028,12
38,41;8,00307;1028,12
38,43;8,01563;1028,1
38,45;8,02795;1028,11
38,47;8,03995;1028,13
38,49;8,05272;1028,13
38,51;8,06466;1028,16
38,53;8,07746;1028,2
38,55;8,0897;1028,23
38,57;8,10256;1028,24
38,59;8,11509;1028,25
38,61;8,12796;1028,25
38,63;8,14005;1028,25
38,65;8,15274;1028,25
38,67;8,16515;1028,26
38,69;8,17744;1028,24
38,71;8,18944;1028,22
38,73;8,20181;1028,21
38,75;8,21342;1028,2
38,77;8,22615;1028,21
38,79;8,23816;1028,25
38,81;8,25105;1028,28
38,83;8,26306;1028,31
38,85;8,27575;1028,31
38,87;8,28802;1028,29
38,89;8,30033;1028,26
38,91;8,31226;1028,25
38,93;8,32471;1028,23
38,95;8,33673;1028,23
38,97;8,349;1028,23
38,99;8,36108;1028,24
39,01;8,3735;1028,26
39,03;8,38525;1028,29
39,05;8,39799;1028,3
39,07;8,41008;1028,31
39,09;8,42257;1028,31
39,11;8,43499;1028,3
39,13;8,44726;1028,32
39,15;8,45977;1028,32
39,17;8,47219;1028,31
39,19;8,48447;1028,31
39,21;8,4967;1028,3
39,23;8,50876;1028,28
39,25;8,52129;1028,28
39,27;8,53357;1028,31
39,29;8,54605;1028,34
39,31;8,55854;1028,38
39,33;8,57158;1028,39
39,35;8,58373;1028,38
39,37;8,59635;1028,35
39,39;8,60853;1028,33
39,41;8,62132;1028,31
39,43;8,63346;1028,3
39,45;8,64634;1028,3
39,47;8,65854;1028,31
39,49;8,67124;1028,31
39,51;8,68338;1028,31
39,53;8,69606;1028,31
39,55;8,70831;1028,3
39,57;8,7214;1028,31
39,59;8,73387;1028,31
39,61;8,74673;1028,3
39,63;8,75919;1028,3
39,65;8,77209;1028,29
39,67;8,78445;1028,26
39,69;8,79723;1028,22
39,71;8,80991;1028,2
39,73;8,8222;1028,19
39,75;8,83484;1028,19
39,77;8,84796;1028,2
39,79;8,86034;1028,24
39,81;8,87333;1028,25
39,83;8,88608;1028,24
39,85;8,8986;1028,21
39,87;8,91134;1028,17
39,89;8,92394;1028,12
39,91;8,93653;1028,09
39,93;8,94942;1028,06
39,95;8,96165;1028,05
39,97;8,97484;1028,04
39,99;8,9868;1028,04
40,01;8,99981;1028,03
40,03;9,01223;1028,04
40,05;9,0252;1028,04
40,07;9,03798;1028,04
40,09;9,05089;1028,04
40,11;9,06348;1028,03
40,13;9,0765;1028
40,15;9,08912;1027,97
40,17;9,10222;1027,93
40,19;9,1148;1027,9
40,21;9,1273;1027,86
40,23;9,14024;1027,87
40,25;9,15286;1027,89
40,27;9,1654;1027,93
40,29;9,17865;1027,94
40,31;9,19128;1027,95
40,33;9,20481;1027,91
40,35;9,21745;1027,87
40,37;9,23063;1027,81
40,39;9,24316;1027,78
40,41;9,25607;1027,75
40,43;9,2691;1027,74
40,45;9,2819;1027,72
40,47;9,2948;1027,69
40,49;9,30777;1027,66
40,51;9,32033;1027,64
40,53;9,3335;1027,62
40,55;9,34627;1027,62
40,57;9,35962;1027,61
40,59;9,37234;1027,6
40,61;9,38559;1027,58
40,63;9,39844;1027,54
40,65;9,41168;1027,49
40,67;9,42452;1027,44
40,69;9,43794;1027,38
40,71;9,45073;1027,33
40,73;9,4637;1027,31
40,75;9,4765;1027,32
40,77;9,48993;1027,32
40,79;9,50285;1027,33
40,81;9,51664;1027,32
40,83;9,52956;1027,28
40,85;9,54297;1027,23
40,87;9,55603;1027,18
40,89;9,56921;1027,13
40,91;9,58242;1027,08
40,93;9,59572;1027,04
40,95;9,60867;1026,99
40,97;9,62188;1026,95
40,99;9,63503;1026,92
41,01;9,64845;1026,89
41,03;9,6612;1026,89
41,05;9,67533;1026,89
41,07;9,6883;1026,87
41,09;9,70204;1026,82
41,11;9,71507;1026,77
41,13;9,72853;1026,68
41,15;9,7415;1026,6
41,17;9,75467;1026,52
41,19;9,76799;1026,48
41,21;9,78102;1026,42
41,23;9,7939;1026,39
41,25;9,80758;1026,37
41,27;9,82041;1026,34
41,29;9,83393;1026,32
41,31;9,84707;1026,3
41,33;9,86066;1026,26
41,35;9,87391;1026,23
41,37;9,88736;1026,18
41,39;9,90061;1026,12
41,41;9,91404;1026,04
41,43;9,92705;1025,97
41,45;9,94042;1025,89
41,47;9,95336;1025,82
41,49;9,96674;1025,76
41,51;9,97961;1025,73
41,53;9,99353;1025,71
41,55;10,0069;1025,67
41,57;10,0203;1025,63
41,59;10,0336;1025,56
41,61;10,0472;1025,48
41,63;10,0601;1025,39
41,65;10,0737;1025,33
41,67;10,0867;1025,27
41,69;10,1003;1025,2
41,71;10,1134;1025,15
41,73;10,1267;1025,11
41,75;10,1397;1025,06
41,77;10,1533;1025,04
41,79;10,1663;1025,03
41,81;10,1804;1025
41,83;10,1939;1024,95
41,85;10,2079;1024,9
41,87;10,2213;1024,83
41,89;10,2349;1024,74
41,91;10,2483;1024,65
41,93;10,2619;1024,55
41,95;10,2755;1024,45
41,97;10,2889;1024,36
41,99;10,3021;1024,29
42,01;10,3161;1024,24
42,03;10,3293;1024,21
42,05;10,3432;1024,18
42,07;10,357;1024,14
42,09;10,371;1024,08
42,11;10,3847;1024
42,13;10,3987;1023,92
42,15;10,4122;1023,81
42,17;10,4263;1023,7
42,19;10,4398;1023,6
42,21;10,4531;1023,49
42,23;10,4667;1023,4
42,25;10,4804;1023,33
42,27;10,4942;1023,28
42,29;10,5083;1023,24
42,31;10,5221;1023,2
42,33;10,5364;1023,14
42,35;10,55;1023,07
42,37;10,5643;1022,97
42,39;10,5776;1022,88
42,41;10,5919;1022,76
42,43;10,6055;1022,66
42,45;10,6197;1022,57
42,47;10,6333;1022,5
42,49;10,6472;1022,41
42,51;10,6613;1022,34
42,53;10,6753;1022,28
42,55;10,6897;1022,18
42,57;10,704;1022,07
42,59;10,7177;1021,96
42,61;10,7324;1021,84
42,63;10,7458;1021,71
42,65;10,7603;1021,6
42,67;10,774;1021,48
42,69;10,7877;1021,34
42,71;10,8017;1021,21
42,73;10,8156;1021,11
42,75;10,829;1021,02
42,77;10,8437;1020,93
42,79;10,8575;1020,88
42,81;10,8719;1020,79
42,83;10,8863;1020,68
42,85;10,9004;1020,55
42,87;10,9148;1020,43
42,89;10,9291;1020,29
42,91;10,943;1020,17
42,93;10,9579;1020,05
42,95;10,9715;1019,93
42,97;10,9858;1019,81
42,99;11,0001;1019,7
43,01;11,0142;1019,59
43,03;11,0283;1019,47
43,05;11,0432;1019,37
43,07;11,0572;1019,25
43,09;11,0721;1019,11
43,11;11,0866;1018,99
43,13;11,1008;1018,85
43,15;11,1152;1018,69
43,17;11,1298;1018,52
43,19;11,1439;1018,35
43,21;11,1585;1018,17
43,23;11,1719;1018
43,25;11,1867;1017,88
43,27;11,2006;1017,79
43,29;11,2151;1017,71
43,31;11,2298;1017,61
43,33;11,2446;1017,49
43,35;11,259;1017,33
43,37;11,274;1017,15
43,39;11,2882;1016,99
43,41;11,3029;1016,81
43,43;11,3175;1016,63
43,45;11,3322;1016,48
43,47;11,3462;1016,31
43,49;11,361;1016,12
43,51;11,3753;1015,95
43,53;11,3896;1015,78
43,55;11,4043;1015,6
43,57;11,4186;1015,44
43,59;11,4329;1015,29
43,61;11,4472;1015,14
43,63;11,4618;1014,98
43,65;11,4764;1014,81
43,67;11,4906;1014,62
43,69;11,5051;1014,41
43,71;11,5196;1014,2
43,73;11,5337;1014,01
43,75;11,5482;1013,85
43,77;11,5628;1013,7
43,79;11,577;1013,57
43,81;11,5923;1013,4
43,83;11,6063;1013,22
43,85;11,6215;1013
43,87;11,6356;1012,79
43,89;11,6505;1012,55
43,91;11,6649;1012,34
43,93;11,6796;1012,14
43,95;11,6936;1011,95
43,97;11,7082;1011,74
43,99;11,7225;1011,56
44,01;11,7372;1011,38
44,03;11,7515;1011,19
44,05;11,7665;1011
44,07;11,7809;1010,79
44,09;11,7962;1010,56
44,11;11,8105;1010,33
44,13;11,8253;1010,09
44,15;11,8396;1009,84
44,17;11,8544;1009,58
44,19;11,8689;1009,33
44,21;11,8833;1009,08
44,23;11,8976;1008,84
44,25;11,9123;1008,62
44,27;11,9265;1008,4
44,29;11,9414;1008,17
44,31;11,9559;1007,94
44,33;11,9702;1007,67
44,35;11,985;1007,4
44,37;11,9994;1007,14
44,39;12,0139;1006,9
44,41;12,0287;1006,65
44,43;12,0429;1006,41
44,45;12,0575;1006,17
44,47;12,0721;1005,9
44,49;12,0868;1005,63
44,51;12,1009;1005,39
44,53;12,1159;1005,15
44,55;12,1307;1004,89
44,57;12,1452;1004,64
44,59;12,1602;1004,37
44,61;12,1747;1004,06
44,63;12,1895;1003,73
44,65;12,2044;1003,41
44,67;12,2188;1003,07
44,69;12,234;1002,74
44,71;12,2483;1002,45
44,73;12,263;1002,17
44,75;12,2776;1001,9
44,77;12,2923;1001,62
44,79;12,307;1001,35
44,81;12,322;1001,03
44,83;12,3369;1000,71
44,85;12,352;1000,37
44,87;12,3666;1000,04
44,89;12,3816;999,689
44,91;12,3963;999,336
44,93;12,4111;998,971
44,95;12,4258;998,606
44,97;12,4407;998,235
44,99;12,4551;997,874
45,01;12,4701;997,538
45,03;12,485;997,213
45,05;12,5001;996,877
45,07;12,5147;996,514
45,09;12,5303;996,131
45,11;12,5448;995,725
45,13;12,5601;995,29
45,15;12,5751;994,832
45,17;12,5901;994,391
45,19;12,6051;993,962
45,21;12,6201;993,533
45,23;12,6347;993,115
45,25;12,65;992,71
45,27;12,6649;992,292
45,29;12,6803;991,839
45,31;12,6955;991,37
45,33;12,7106;990,869
45,35;12,7257;990,365
45,37;12,7407;989,848
45,39;12,7558;989,338
45,41;12,7712;988,79
45,43;12,786;988,232
45,45;12,8014;987,65
45,47;12,8164;987,062
45,49;12,832;986,444
45,51;12,8469;985,66
