"s";"%";"MPa"
0;0;5,48627
0,02;-0,000696548;5,48867
0,04;-0,000662562;5,48182
0,06;-0,000120083;5,48146
0,08;0,000800124;5,46508
0,1;0,00190547;5,46819
0,12;0,00227381;5,46441
0,14;0,00230392;5,46579
0,16;0,00202361;5,47176
0,18;0,00119112;5,48296
0,2;0,000160219;5,4733
0,22;-0,00076808;5,47392
0,24;-0,000801742;5,47339
0,26;-0,000279979;5,46508
0,28;0,00142449;5,45666
0,3;0,00203332;5,46692
0,32;0,00240555;5,4676
0,34;0,00245216;5,47005
0,36;0,00222979;5,47216
0,38;0,00164362;5,4855
0,4;0,000718881;5,48902
0,42;-0,000130441;5,49648
0,44;-0,000154393;5,50789
0,46;7,76819e-005;5,52466
0,48;0,000816631;5,53717
0,5;0,00195856;5,56188
0,52;0,00226734;5,60671
0,54;0,00257969;5,68345
0,56;0,00246025;5,7773
0,58;0,00215762;5,89961
0,6;0,00169055;6,05125
0,62;0,000882984;6,21619
0,64;0,000731505;6,37948
0,66;0,000855149;6,56236
0,68;0,00121249;6,75235
0,7;0,00234373;6,94916
0,72;0,00340668;7,1642
0,74;0,00415825;7,41646
0,76;0,00406697;7,6819
0,78;0,00382357;7,97202
0,8;0,00331346;8,27936
0,82;0,00240102;8,60153
0,84;0,00228547;8,92413
0,86;0,00249035;9,26602
0,88;0,00316683;9,62103
0,9;0,00426733;9,99325
0,92;0,00570218;10,3873
0,94;0,00639646;10,812
0,96;0,00630065;11,263
0,98;0,00621941;11,7381
1;0,00595982;12,2346
1,02;0,00544453;12,7435
1,04;0,00539857;13,2583
1,06;0,00560249;13,771
1,08;0,00625145;14,2848
1,1;0,00813653;14,8114
1,12;0,00894346;15,3489
1,14;0,0102142;15,9014
1,16;0,0102734;16,4589
1,18;0,0102051;17,0341
1,2;0,00989182;17,6022
1,22;0,00888358;18,1665
1,24;0,00884635;18,7187
1,26;0,00900463;19,2833
1,28;0,0094267;19,8451
1,3;0,0111749;20,4156
1,32;0,0126337;20,9935
1,34;0,0138012;21,5715
1,36;0,0137749;22,1529
1,38;0,0137626;22,7311
1,4;0,0136157;23,3087
1,42;0,0130551;23,879
1,44;0,0129823;24,465
1,46;0,0131545;25,0577
1,48;0,0140096;25,6399
1,5;0,0155513;26,233
1,52;0,0166246;26,8375
1,54;0,0177076;27,4339
1,56;0,0180118;28,0111
1,58;0,0181177;28,6056
1,6;0,0179439;29,1813
1,62;0,0176364;29,7583
1,64;0,0175972;30,3329
1,66;0,0176403;30,9198
1,68;0,0177623;31,4999
1,7;0,0191535;32,0886
1,72;0,0201394;32,6743
1,74;0,0216894;33,2581
1,76;0,0217464;33,8203
1,78;0,0218775;34,3862
1,8;0,021782;34,9523
1,82;0,0216283;35,5198
1,84;0,0215813;36,072
1,86;0,0215292;36,6388
1,88;0,0217613;37,2095
1,9;0,0230401;37,7812
1,92;0,0244967;38,332
1,94;0,0259694;38,8981
1,96;0,0260885;39,465
1,98;0,0260798;40,0252
2;0,0260286;40,5807
2,02;0,0258759;41,1546
2,04;0,0257975;41,7243
2,06;0,025582;42,3024
2,08;0,0255913;42,8723
2,1;0,0261859;43,4428
2,12;0,0279474;44,0045
2,14;0,0291333;44,5742
2,16;0,0294453;45,124
2,18;0,0298279;45,664
2,2;0,0297434;46,2127
2,22;0,0296298;46,7702
2,24;0,0295894;47,3188
2,26;0,0293622;47,8768
2,28;0,0293919;48,4355
2,3;0,0308747;48,993
2,32;0,0319804;49,5321
2,34;0,0329297;50,0783
2,36;0,0333171;50,6166
2,38;0,0340897;51,1702
2,4;0,0340101;51,7123
2,42;0,0337541;52,2637
2,44;0,0336978;52,8024
2,46;0,0335424;53,3419
2,48;0,0335664;53,8796
2,5;0,0343406;54,4126
2,52;0,0349698;54,9429
2,54;0,0359538;55,4821
2,56;0,0370284;56,0159
2,58;0,0379133;56,5614
2,6;0,0378395;57,1124
2,62;0,0376799;57,6482
2,64;0,0375191;58,1822
2,66;0,0370151;58,7234
2,68;0,0372171;59,2571
2,7;0,0380917;59,7746
2,72;0,0384681;60,3143
2,74;0,0398974;60,8532
2,76;0,0411533;61,3865
2,78;0,0413944;61,9077
2,8;0,0413637;62,4377
2,82;0,0413459;62,9688
2,84;0,0412274;63,4907
2,86;0,0408953;64,0261
2,88;0,0409585;64,5628
2,9;0,0414614;65,0948
2,92;0,0419311;65,6119
2,94;0,0437676;66,1411
2,96;0,0444467;66,6603
2,98;0,0447289;67,1756
3;0,0447364;67,6976
3,02;0,0447344;68,2138
3,04;0,044626;68,731
3,06;0,0444642;69,2406
3,08;0,0444891;69,7607
3,1;0,0445749;70,2787
3,12;0,0452947;70,7933
3,14;0,047218;71,3102
3,16;0,0478977;71,8308
3,18;0,0481159;72,3429
3,2;0,0482518;72,8513
3,22;0,04885;73,3687
3,24;0,0485489;73,8732
3,26;0,0481081;74,375
3,28;0,048102;74,8818
3,3;0,0481693;75,3989
3,32;0,0487512;75,9176
3,34;0,0505467;76,4322
3,36;0,0509772;76,9495
3,38;0,0514831;77,4698
3,4;0,051853;77,9885
3,42;0,0518909;78,4946
3,44;0,0517414;78,998
3,46;0,0517148;79,5206
3,48;0,0516889;80,031
3,5;0,0517517;80,5274
3,52;0,0524534;81,034
3,54;0,053596;81,5578
3,56;0,0541039;82,0688
3,58;0,0555517;82,582
3,6;0,055719;83,0942
3,62;0,0557106;83,6161
3,64;0,0556089;84,1299
3,66;0,0554966;84,6401
3,68;0,0554442;85,1392
3,7;0,0554727;85,6497
3,72;0,0555966;86,1594
3,74;0,056366;86,6671
3,76;0,0577491;87,1708
3,78;0,0587356;87,6878
3,8;0,0588535;88,1985
3,82;0,0588551;88,7102
3,84;0,0588069;89,2189
3,86;0,0588049;89,7245
3,88;0,0587541;90,2337
3,9;0,0587466;90,7458
3,92;0,0588204;91,2553
3,94;0,0602644;91,7626
3,96;0,0607023;92,2632
3,98;0,0623899;92,7628
4;0,0624896;93,2641
4,02;0,0625139;93,7633
4,04;0,0624398;94,2575
4,06;0,0624773;94,7673
4,08;0,0622407;95,2682
4,1;0,0622805;95,7652
4,12;0,0624628;96,264
4,14;0,0636416;96,7744
4,16;0,0640416;97,2679
4,18;0,0651062;97,7597
4,2;0,0655558;98,2452
4,22;0,0655662;98,7409
4,24;0,0655636;99,23
4,26;0,0655636;99,7219
4,28;0,0654733;100,218
4,3;0,0654648;100,72
4,32;0,0658257;101,198
4,34;0,0667922;101,665
4,36;0,0671522;102,141
4,38;0,0684766;102,618
4,4;0,0688942;103,095
4,42;0,0691874;103,578
4,44;0,0691939;104,068
4,46;0,0691408;104,557
4,48;0,0690188;105,046
4,5;0,0690269;105,512
4,52;0,0691502;105,969
4,54;0,0694208;106,426
4,56;0,0704708;106,874
4,58;0,0712829;107,315
4,6;0,0715778;107,783
4,62;0,0719137;108,26
4,64;0,0721847;108,749
4,66;0,0722041;109,233
4,68;0,0720882;109,725
4,7;0,0722083;110,211
4,72;0,0723659;110,691
4,74;0,0725329;111,162
4,76;0,0731877;111,634
4,78;0,0751553;112,113
4,8;0,0751651;112,586
4,82;0,0752916;113,059
4,84;0,0753602;113,54
4,86;0,0753583;114,025
4,88;0,0752803;114,5
4,9;0,0754386;114,981
4,92;0,0754188;115,457
4,94;0,0754978;115,926
4,96;0,0764824;116,401
4,98;0,0779526;116,863
5;0,0781435;117,321
5,02;0,0785617;117,788
5,04;0,0787413;118,254
5,06;0,0787342;118,714
5,08;0,0786727;119,19
5,1;0,0786983;119,666
5,12;0,0786627;120,14
5,14;0,0791323;120,599
5,16;0,0802432;121,062
5,18;0,0806222;121,512
5,2;0,0810155;121,963
5,22;0,0821419;122,402
5,24;0,0821733;122,856
5,26;0,0821784;123,32
5,28;0,0820665;123,781
5,3;0,0821079;124,24
5,32;0,0820833;124,694
5,34;0,0823066;125,153
5,36;0,0827662;125,594
5,38;0,083577;126,041
5,4;0,0838205;126,484
5,42;0,0853123;126,943
5,44;0,0852941;127,399
5,46;0,0852653;127,848
5,48;0,0851744;128,297
5,5;0,0853119;128,756
5,52;0,0852174;129,208
5,54;0,0853369;129,655
5,56;0,0859897;130,109
5,58;0,0866439;130,563
5,6;0,0875861;131,01
5,62;0,088716;131,465
5,64;0,0887533;131,913
5,66;0,0887762;132,369
5,68;0,0887335;132,814
5,7;0,0887636;133,261
5,72;0,0886154;133,707
5,74;0,0887041;134,167
5,76;0,0887937;134,624
5,78;0,0900114;135,076
5,8;0,0901794;135,531
5,82;0,0911695;135,976
5,84;0,0912566;136,407
5,86;0,0912951;136,844
5,88;0,0912705;137,288
5,9;0,0912902;137,729
5,92;0,0912342;138,173
5,94;0,0913035;138,612
5,96;0,0918146;139,041
5,98;0,0929028;139,484
6;0,0931187;139,919
6,02;0,0942243;140,354
6,04;0,094359;140,795
6,06;0,094425;141,242
6,08;0,0945046;141,682
6,1;0,0944664;142,125
6,12;0,0943846;142,566
6,14;0,0945037;143,004
6,16;0,0947167;143,431
6,18;0,0959592;143,862
6,2;0,0961224;144,286
6,22;0,0968412;144,721
6,24;0,0973792;145,16
6,26;0,0977514;145,611
6,28;0,0977204;146,051
6,3;0,0976932;146,504
6,32;0,0976035;146,942
6,34;0,0977291;147,381
6,36;0,0977281;147,813
6,38;0,0987082;148,248
6,4;0,0990578;148,68
6,42;0,0998854;149,114
6,44;0,100964;149,549
6,46;0,101288;149,992
6,48;0,101251;150,428
6,5;0,101218;150,862
6,52;0,100812;151,3
6,54;0,100936;151,747
6,56;0,101004;152,175
6,58;0,101506;152,604
6,6;0,101859;153,034
6,62;0,103111;153,467
6,64;0,103164;153,882
6,66;0,103669;154,308
6,68;0,103977;154,738
6,7;0,103962;155,167
6,72;0,103967;155,595
6,74;0,104027;156,011
6,76;0,104005;156,429
6,78;0,104135;156,841
6,8;0,105828;157,252
6,82;0,106156;157,655
6,84;0,106229;158,069
6,86;0,106705;158,484
6,88;0,106712;158,892
6,9;0,106719;159,306
6,92;0,106684;159,725
6,94;0,106719;160,137
6,96;0,10667;160,544
6,98;0,107163;160,971
7;0,107856;161,387
7,02;0,108566;161,797
7,04;0,10888;162,207
7,06;0,109489;162,614
7,08;0,109551;162,999
7,1;0,109657;163,387
7,12;0,109639;163,778
7,14;0,109605;164,174
7,16;0,109634;164,579
7,18;0,110296;164,99
7,2;0,110598;165,4
7,22;0,11101;165,808
7,24;0,111289;166,214
7,26;0,11249;166,616
7,28;0,112457;167,016
7,3;0,112499;167,419
7,32;0,112416;167,821
7,34;0,112491;168,23
7,36;0,11249;168,636
7,38;0,112786;169,046
7,4;0,113095;169,447
7,42;0,114072;169,85
7,44;0,114449;170,243
7,46;0,11538;170,64
7,48;0,115349;171,044
7,5;0,115314;171,45
7,52;0,115265;171,863
7,54;0,115539;172,268
7,56;0,115389;172,667
7,58;0,115428;173,073
7,6;0,115777;173,468
7,62;0,116653;173,85
7,64;0,116977;174,259
7,66;0,117915;174,667
7,68;0,117882;175,049
7,7;0,117924;175,43
7,72;0,118002;175,816
7,74;0,118179;176,194
7,76;0,118128;176,572
7,78;0,118637;176,951
7,8;0,118714;177,342
7,82;0,119207;177,733
7,84;0,119776;178,122
7,86;0,12083;178,516
7,88;0,120876;178,905
7,9;0,120971;179,3
7,92;0,121085;179,699
7,94;0,1209;180,092
7,96;0,120853;180,481
7,98;0,121429;180,872
8;0,121402;181,263
8,02;0,121616;181,646
8,04;0,122616;182,021
8,06;0,123065;182,391
8,08;0,123115;182,766
8,1;0,123935;183,136
8,12;0,123852;183,503
8,14;0,123804;183,884
8,16;0,1238;184,26
8,18;0,124223;184,646
8,2;0,1241;185,026
8,22;0,12463;185,398
8,24;0,125122;185,782
8,26;0,1256;186,167
8,28;0,125781;186,534
8,3;0,127001;186,901
8,32;0,126401;187,283
8,34;0,126426;187,654
8,36;0,126479;188,025
8,38;0,126598;188,422
8,4;0,126585;188,814
8,42;0,127408;189,225
8,44;0,127604;189,639
8,46;0,127942;190,068
8,48;0,128823;190,483
8,5;0,12902;190,934
8,52;0,128962;191,373
8,54;0,129031;191,835
8,56;0,129307;192,292
8,58;0,129345;192,778
8,6;0,129387;193,247
8,62;0,130393;193,725
8,64;0,130554;194,186
8,66;0,131268;194,669
8,68;0,131695;195,156
8,7;0,131967;195,657
8,72;0,132361;196,168
8,74;0,132506;196,707
8,76;0,132516;197,238
8,78;0,132505;197,78
8,8;0,133307;198,324
8,82;0,134181;198,881
8,84;0,134635;199,437
8,86;0,135408;200,013
8,88;0,135652;200,58
8,9;0,13571;201,173
8,92;0,136501;201,754
8,94;0,13706;202,346
8,96;0,137149;202,935
8,98;0,137189;203,535
9;0,137533;204,126
9,02;0,138073;204,734
9,04;0,138415;205,334
9,06;0,139223;205,96
9,08;0,139365;206,582
9,1;0,140112;207,222
9,12;0,140472;207,855
9,14;0,140875;208,504
9,16;0,141102;209,138
9,18;0,141494;209,787
9,2;0,142171;210,439
9,22;0,142289;211,11
9,24;0,142723;211,766
9,26;0,144283;212,432
9,28;0,144309;213,106
9,3;0,145169;213,784
9,32;0,145414;214,45
9,34;0,145402;215,145
9,36;0,146008;215,828
9,38;0,14661;216,522
9,4;0,146668;217,213
9,42;0,146734;217,911
9,44;0,147859;218,608
9,46;0,148869;219,324
9,48;0,149351;220,047
9,5;0,149795;220,775
9,52;0,150113;221,513
9,54;0,15037;222,248
9,56;0,151067;222,998
9,58;0,151428;223,735
9,6;0,151545;224,476
9,62;0,152495;225,225
9,64;0,1527;225,973
9,66;0,153665;226,726
9,68;0,154272;227,474
9,7;0,155376;228,235
9,72;0,155468;229,003
9,74;0,155926;229,792
9,76;0,15738;230,565
9,78;0,156923;231,362
9,8;0,15627;232,147
9,82;0,159784;232,937
9,84;0,159877;233,731
9,86;0,159174;234,532
9,88;0,161363;235,334
9,9;0,162099;236,157
9,92;0,161537;236,979
9,94;0,163146;237,797
9,96;0,163142;238,63
9,98;0,162316;239,482
10;0,163745;240,323
10,02;0,165079;241,179
10,04;0,164217;242,037
10,06;0,165235;242,9
10,08;0,166572;243,757
10,1;0,166582;244,63
10,12;0,167454;245,501
10,14;0,168658;246,379
10,16;0,168424;247,265
10,18;0,168616;248,154
10,2;0,169684;249,025
10,22;0,170955;249,913
10,24;0,170241;250,795
10,26;0,170854;251,668
10,28;0,173966;252,54
10,3;0,174356;253,424
10,32;0,172444;254,279
10,34;0,175992;255,142
10,36;0,176025;256,015
10,38;0,174489;256,886
10,4;0,176903;257,768
10,42;0,177311;258,671
10,44;0,175901;259,576
10,46;0,178656;260,485
10,48;0,179793;261,404
10,5;0,178921;262,326
10,52;0,180371;263,239
10,54;0,181895;264,167
10,56;0,181198;265,082
10,58;0,181679;266,006
10,6;0,183318;266,917
10,62;0,182417;267,834
10,64;0,183336;268,747
10,66;0,185168;269,666
10,68;0,185649;270,574
10,7;0,185666;271,498
10,72;0,185913;272,42
10,74;0,187962;273,34
10,76;0,18927;274,267
10,78;0,186984;275,197
10,8;0,188578;276,113
10,82;0,191342;277,041
10,84;0,188821;277,962
10,86;0,190985;278,878
10,88;0,193742;279,799
10,9;0,191045;280,726
10,92;0,192967;281,652
10,94;0,196504;282,583
10,96;0,1937;283,523
10,98;0,194875;284,457
11;0,197434;285,386
11,02;0,195728;286,317
11,04;0,196397;287,232
11,06;0,19891;288,146
11,08;0,197959;289,052
11,1;0,198434;289,957
11,12;0,200838;290,837
11,14;0,200416;291,744
11,16;0,19935;292,627
11,18;0,201889;293,498
11,2;0,203483;294,388
11,22;0,200711;295,278
11,24;0,203506;296,136
11,26;0,207218;297,011
11,28;0,202912;297,903
11,3;0,206492;298,763
11,32;0,210093;299,624
11,34;0,204858;300,505
11,36;0,208204;301,361
11,38;0,21185;302,221
11,4;0,20709;303,083
11,42;0,21013;303,956
11,44;0,212327;304,822
11,46;0,209459;305,709
11,48;0,211005;306,591
11,5;0,214481;307,488
11,52;0,211915;308,38
11,54;0,213165;309,28
11,56;0,215609;310,167
11,58;0,214749;311,071
11,6;0,213989;311,972
11,62;0,216935;312,876
11,64;0,215811;313,79
11,66;0,216075;314,72
11,68;0,217523;315,621
11,7;0,219405;316,538
11,72;0,216877;317,472
11,74;0,219001;318,376
11,76;0,22277;319,292
11,78;0,219055;320,219
11,8;0,220085;321,127
11,82;0,225293;322,039
11,84;0,221306;322,971
11,86;0,222503;323,889
11,88;0,226781;324,814
11,9;0,224056;325,756
11,92;0,22449;326,68
11,94;0,229244;327,609
11,96;0,226862;328,549
11,98;0,226499;329,493
12;0,229873;330,43
12,02;0,229401;331,38
12,04;0,228349;332,323
12,06;0,230858;333,254
12,08;0,231287;334,183
12,1;0,230398;335,124
12,12;0,232422;336,04
12,14;0,233803;336,982
12,16;0,232257;337,92
12,18;0,2343;338,863
12,2;0,236778;339,815
12,22;0,233634;340,777
12,24;0,23609;341,719
12,26;0,239893;342,692
12,28;0,23561;343,655
12,3;0,239683;344,6
12,32;0,242593;345,558
12,34;0,23833;346,515
12,36;0,24176;347,437
12,38;0,24519;348,362
12,4;0,241082;349,286
12,42;0,243619;350,2
12,44;0,24588;351,118
12,46;0,243056;352,057
12,48;0,244724;352,989
12,5;0,248035;353,924
12,52;0,245671;354,866
12,54;0,246784;355,8
12,56;0,24925;356,711
12,58;0,248464;357,641
12,6;0,248066;358,571
12,62;0,250052;359,504
12,64;0,249735;360,447
12,66;0,249965;361,398
12,68;0,252436;362,355
12,7;0,252154;363,315
12,72;0,252042;364,276
12,74;0,256017;365,242
12,76;0,254783;366,215
12,78;0,254119;367,185
12,8;0,258033;368,138
12,82;0,256919;369,099
12,84;0,25595;370,051
12,86;0,260396;371,007
12,88;0,25886;371,952
12,9;0,258341;372,915
12,92;0,261847;373,876
12,94;0,261909;374,847
12,96;0,260655;375,834
12,98;0,263538;376,818
13;0,263285;377,805
13,02;0,263396;378,792
13,04;0,264578;379,761
13,06;0,265682;380,705
13,08;0,265097;381,654
13,1;0,266236;382,598
13,12;0,268074;383,541
13,14;0,267438;384,5
13,16;0,267834;385,48
13,18;0,269629;386,469
13,2;0,269519;387,457
13,22;0,270557;388,462
13,24;0,271462;389,465
13,26;0,271497;390,47
13,28;0,273441;391,465
13,3;0,2743;392,471
13,32;0,274092;393,456
13,34;0,27617;394,437
13,36;0,276593;395,411
13,38;0,276443;396,396
13,4;0,278399;397,37
13,42;0,278652;398,347
13,44;0,278666;399,333
13,46;0,280194;400,311
13,48;0,280329;401,289
13,5;0,280468;402,258
13,52;0,282159;403,229
13,54;0,282459;404,182
13,56;0,282613;405,155
13,58;0,283454;406,13
13,6;0,285052;407,112
13,62;0,284893;408,108
13,64;0,285468;409,117
13,66;0,286669;410,111
13,68;0,286781;411,1
13,7;0,286931;412,105
13,72;0,289424;413,1
13,74;0,289618;414,099
13,76;0,290178;415,095
13,78;0,292639;416,081
13,8;0,29239;417,05
13,82;0,292735;418,027
13,84;0,29478;419,001
13,86;0,294901;419,987
13,88;0,295275;420,981
13,9;0,29685;421,977
13,92;0,296939;422,94
13,94;0,296991;423,892
13,96;0,298823;424,825
13,98;0,299561;425,753
14;0,299735;426,687
14,02;0,300133;427,626
14,04;0,301222;428,563
14,06;0,301351;429,515
14,08;0,301784;430,467
14,1;0,303475;431,399
14,12;0,303644;432,318
14,14;0,304319;433,228
14,16;0,305777;434,095
14,18;0,306068;434,921
14,2;0,306529;435,72
14,22;0,307657;436,488
14,24;0,307712;437,226
14,26;0,308088;437,929
14,28;0,308721;438,599
14,3;0,309764;439,231
14,32;0,309882;439,809
14,34;0,310637;440,325
14,36;0,311393;440,793
14,38;0,311403;441,206
14,4;0,311636;441,532
14,42;0,312163;441,779
14,44;0,312157;441,896
14,46;0,312185;441,83
14,48;0,312259;441,283
14,5;0,312232;432,848
14,52;0,311798;415,449
14,54;0,280574;396,95
14,56;0,251253;378,152
14,58;0,250394;359,596
14,6;0,249092;348,797
14,62;0,248771;346,831
14,64;0,248263;345,898
14,66;0,247711;345,231
14,68;0,247699;344,571
14,7;0,247079;343,849
14,72;0,246266;343,065
14,74;0,245907;342,233
14,76;0,245549;341,384
14,78;0,244451;340,553
14,8;0,244292;339,755
14,82;0,243667;338,983
14,84;0,242944;338,232
14,86;0,242627;337,493
14,88;0,242359;336,775
14,9;0,241791;336,044
14,92;0,241388;335,327
14,94;0,24093;334,619
14,96;0,24049;333,921
14,98;0,24003;333,228
15;0,239451;332,565
15,02;0,239138;331,94
15,04;0,238751;331,336
15,06;0,238319;330,771
15,08;0,238031;330,221
15,1;0,237788;329,671
15,12;0,237373;329,135
15,14;0,237142;328,608
15,16;0,237015;328,084
15,18;0,236616;327,597
15,2;0,236428;327,136
15,22;0,236073;326,676
15,24;0,235919;326,225
15,26;0,235691;325,784
15,28;0,235494;325,329
15,3;0,23524;324,877
15,32;0,235099;324,428
15,34;0,234962;323,999
15,36;0,23462;323,587
15,38;0,234418;323,185
15,4;0,234331;322,783
15,42;0,234002;322,403
15,44;0,233743;322,022
15,46;0,233636;321,641
15,48;0,233468;321,277
15,5;0,233379;320,945
15,52;0,233334;320,628
15,54;0,233294;320,323
15,56;0,233146;320,026
15,58;0,233045;319,714
15,6;0,232958;319,388
15,62;0,232775;319,046
15,64;0,232586;318,689
15,66;0,232377;318,339
15,68;0,232319;318,004
15,7;0,232183;317,684
15,72;0,232149;317,377
15,74;0,232105;317,082
15,76;0,23203;316,786
15,78;0,231866;316,497
15,8;0,231811;316,201
15,82;0,231734;315,913
15,84;0,231477;315,64
15,86;0,231412;315,38
15,88;0,23137;315,137
15,9;0,231282;314,919
15,92;0,231244;314,684
15,94;0,231207;314,448
15,96;0,231007;314,209
15,98;0,230826;313,96
16;0,230804;313,695
16,02;0,230736;313,465
16,04;0,230563;313,237
16,06;0,230466;313,014
16,08;0,230408;312,785
16,1;0,230275;312,577
16,12;0,230236;312,368
16,14;0,230193;312,182
16,16;0,230142;312,002
16,18;0,230123;311,833
16,2;0,230103;311,667
16,22;0,23004;311,485
16,24;0,229986;311,273
16,26;0,229877;311,055
16,28;0,22973;310,828
16,3;0,229603;310,606
16,32;0,229503;310,397
16,34;0,229367;310,216
16,36;0,229328;310,029
16,38;0,229298;309,844
16,4;0,229199;309,65
16,42;0,229038;309,448
16,44;0,228968;309,246
16,46;0,228889;309,064
16,48;0,228829;308,904
16,5;0,228687;308,754
16,52;0,228673;308,614
16,54;0,228663;308,477
16,56;0,228619;308,32
16,58;0,228613;308,141
16,6;0,228585;307,954
16,62;0,228492;307,782
16,64;0,228469;307,598
16,66;0,228467;307,426
16,68;0,228434;307,279
16,7;0,228437;307,137
16,72;0,228422;306,986
16,74;0,228406;306,849
16,76;0,228405;306,719
16,78;0,228421;306,592
16,8;0,228401;306,458
16,82;0,228409;306,324
16,84;0,228406;306,162
16,86;0,228405;306,012
16,88;0,22838;305,843
16,9;0,228404;305,692
16,92;0,228393;305,539
16,94;0,228403;305,415
16,96;0,228403;305,262
16,98;0,228406;305,117
17;0,2284;304,965
17,02;0,228407;304,823
17,04;0,228407;304,69
17,06;0,228412;304,586
17,08;0,228409;304,505
17,1;0,228437;304,419
17,12;0,228437;304,312
17,14;0,22845;304,192
17,16;0,228487;304,049
17,18;0,228482;303,897
17,2;0,228469;303,749
17,22;0,228477;303,625
17,24;0,228482;303,497
17,26;0,22848;303,393
17,28;0,228466;303,293
17,3;0,228472;303,2
17,32;0,228466;303,107
17,34;0,228476;303,033
17,36;0,228488;302,946
17,38;0,228497;302,861
17,4;0,228484;302,768
17,42;0,228505;302,659
17,44;0,228488;302,546
17,46;0,228493;302,45
17,48;0,228493;302,332
17,5;0,22849;302,213
17,52;0,228487;302,087
17,54;0,228495;301,969
17,56;0,2285;301,85
17,58;0,228502;301,75
17,6;0,228521;301,672
17,62;0,228546;301,611
17,64;0,228537;301,538
17,66;0,228537;301,448
17,68;0,228548;301,341
17,7;0,228562;301,214
17,72;0,228553;301,086
17,74;0,228557;300,974
17,76;0,228565;300,862
17,78;0,228568;300,757
17,8;0,228566;300,67
17,82;0,228583;300,583
17,84;0,22857;300,481
17,86;0,228573;300,394
17,88;0,228597;300,322
17,9;0,228594;300,253
17,92;0,228599;300,186
17,94;0,228623;300,123
17,96;0,228628;300,047
17,98;0,228644;299,954
18;0,228676;299,872
18,02;0,228691;299,78
18,04;0,228691;299,677
18,06;0,228769;299,588
18,08;0,228908;299,516
18,1;0,228897;299,443
18,12;0,228911;299,393
18,14;0,228922;299,356
18,16;0,228924;299,313
18,18;0,228937;299,263
18,2;0,228968;299,171
18,22;0,228976;299,062
18,24;0,228977;298,956
18,26;0,228984;298,858
18,28;0,228987;298,764
18,3;0,228992;298,681
18,32;0,228987;298,593
18,34;0,228999;298,505
18,36;0,228987;298,427
18,38;0,228995;298,354
18,4;0,22905;298,304
18,42;0,22918;298,267
18,44;0,229215;298,215
18,46;0,22941;298,129
18,48;0,229472;298,041
18,5;0,229502;297,947
18,52;0,229513;297,858
18,54;0,229568;297,769
18,56;0,22958;297,703
18,58;0,229591;297,64
18,6;0,229691;297,582
18,62;0,229754;297,52
18,64;0,229745;297,468
18,66;0,229764;297,412
18,68;0,22977;297,333
18,7;0,229769;297,239
18,72;0,229785;297,147
18,74;0,22977;297,077
18,76;0,229757;297,007
18,78;0,229766;296,958
18,8;0,229777;296,9
18,82;0,229767;296,848
18,84;0,229762;296,784
18,86;0,229774;296,727
18,88;0,229843;296,694
18,9;0,229872;296,695
18,92;0,229897;296,691
18,94;0,229992;296,671
18,96;0,230015;296,646
18,98;0,23012;296,596
19;0,230228;296,537
19,02;0,230317;296,479
19,04;0,230379;296,433
19,06;0,230517;296,395
19,08;0,230584;296,375
19,1;0,230633;296,348
19,12;0,230701;296,306
19,14;0,230727;296,283
19,16;0,230725;296,252
19,18;0,230773;296,199
19,2;0,23106;296,143
19,22;0,231077;296,104
19,24;0,231081;296,055
19,26;0,231124;296,003
19,28;0,231123;295,953
19,3;0,23113;295,903
19,32;0,231362;295,849
19,34;0,231366;295,806
19,36;0,231367;295,79
19,38;0,231401;295,792
19,4;0,231418;295,831
19,42;0,231433;295,857
19,44;0,231525;295,863
19,46;0,231551;295,838
19,48;0,231541;295,814
19,5;0,231543;295,761
19,52;0,231538;295,723
19,54;0,231543;295,703
19,56;0,231546;295,696
19,58;0,231557;295,68
19,6;0,231544;295,67
19,62;0,231559;295,674
19,64;0,231573;295,672
19,66;0,231612;295,673
19,68;0,231666;295,675
19,7;0,23186;295,673
19,72;0,232046;295,654
19,74;0,23208;295,642
19,76;0,232217;295,634
19,78;0,232239;295,618
19,8;0,232404;295,593
19,82;0,232444;295,583
19,84;0,232519;295,566
19,86;0,232571;295,562
19,88;0,232684;295,579
19,9;0,232926;295,606
19,92;0,233031;295,619
19,94;0,233118;295,615
19,96;0,233166;295,598
19,98;0,233417;295,572
20;0,233423;295,572
20,02;0,233546;295,573
20,04;0,233723;295,582
20,06;0,2339;295,591
20,08;0,234014;295,609
20,1;0,234308;295,603
20,12;0,234467;295,619
20,14;0,23452;295,662
20,16;0,234967;295,709
20,18;0,235018;295,742
20,2;0,23508;295,781
20,22;0,235151;295,8
20,24;0,235297;295,8
20,26;0,235368;295,791
20,28;0,235562;295,783
20,3;0,235747;295,765
20,32;0,235765;295,756
20,34;0,23587;295,777
20,36;0,235967;295,808
20,38;0,236129;295,855
20,4;0,236168;295,914
20,42;0,236401;295,835
20,44;0,236589;295,372
20,46;0,236575;294,444
20,48;0,236341;293,119
20,5;0,235398;291,488
20,52;0,234249;289,749
20,54;0,233278;288,179
20,56;0,232608;286,916
20,58;0,23193;285,918
20,6;0,231387;285,11
20,62;0,230862;284,462
20,64;0,230776;283,917
20,66;0,230209;283,462
20,68;0,23015;283,075
20,7;0,23005;282,74
20,72;0,229716;282,442
20,74;0,229521;282,186
20,76;0,229478;281,958
20,78;0,229464;281,752
20,8;0,229343;281,581
20,82;0,229084;281,426
20,84;0,229004;281,291
20,86;0,228938;281,158
20,88;0,228893;281,046
20,9;0,228871;280,939
20,92;0,22877;280,84
20,94;0,228779;280,757
20,96;0,228708;280,679
20,98;0,228724;280,604
21;0,228717;280,539
21,02;0,228711;280,472
21,04;0,228622;280,411
21,06;0,228659;280,371
21,08;0,228644;280,329
21,1;0,228632;280,287
21,12;0,22857;280,261
21,14;0,228629;280,226
21,16;0,228536;280,195
21,18;0,228569;280,172
21,2;0,228542;280,141
21,22;0,228503;280,116
21,24;0,228433;280,098
21,26;0,228481;280,07
21,28;0,228408;280,043
21,3;0,22844;280,033
21,32;0,228401;280,012
21,34;0,228464;279,989
21,36;0,228402;279,973
21,38;0,228468;279,956
21,4;0,228464;279,944
21,42;0,228456;279,936
21,44;0,228424;279,931
21,46;0,22849;279,926
21,48;0,228431;279,923
21,5;0,228424;279,915
21,52;0,228406;279,905
21,54;0,228431;279,904
21,56;0,228392;279,899
21,58;0,228482;279,891
21,6;0,228421;279,887
21,62;0,228395;279,881
21,64;0,228447;279,871
21,66;0,22852;279,87
21,67;0,228489;279,871
21,68;0,228418;279,867
21,69;0,228428;279,868
