<?xml version="1.0" encoding="UTF-8" standalone="no"?>
<!DOCTYPE svg PUBLIC "-//W3C//DTD SVG 1.1//EN"
 "http://www.w3.org/Graphics/SVG/1.1/DTD/svg11.dtd">
<!-- Generated by graphviz version 2.43.0 (0)
 -->
<!-- Title: workflow Pages: 1 -->
<svg width="1113pt" height="784pt"
 viewBox="0.00 0.00 1113.17 783.80" xmlns="http://www.w3.org/2000/svg" xmlns:xlink="http://www.w3.org/1999/xlink">
<g id="graph0" class="graph" transform="scale(1 1) rotate(0) translate(4 779.8)">
<title>workflow</title>
<polygon fill="white" stroke="transparent" points="-4,4 -4,-779.8 1109.17,-779.8 1109.17,4 -4,4"/>
<!-- p0 -->
<g id="node1" class="node">
<title>p0</title>
<ellipse fill="none" stroke="black" cx="878.28" cy="-523.6" rx="118.88" ry="18"/>
<text text-anchor="middle" x="878.28" y="-519.9" font-family="Times,serif" font-size="14.00">PrepareAbox:ParseCopperKey</text>
</g>
<!-- p6 -->
<g id="node2" class="node">
<title>p6</title>
<ellipse fill="none" stroke="black" cx="707.28" cy="-436.6" rx="172.47" ry="18"/>
<text text-anchor="middle" x="707.28" y="-432.9" font-family="Times,serif" font-size="14.00">PrepareAbox:MapToRdf:MapToRdfwithRml</text>
</g>
<!-- p0&#45;&gt;p6 -->
<g id="edge1" class="edge">
<title>p0&#45;&gt;p6</title>
<path fill="none" stroke="black" d="M845.31,-506.21C818.25,-492.76 779.73,-473.61 750.26,-458.96"/>
<polygon fill="black" stroke="black" points="751.54,-455.69 741.03,-454.37 748.43,-461.96 751.54,-455.69"/>
<text text-anchor="middle" x="823.78" y="-476.4" font-family="Times,serif" font-size="14.00">sources</text>
</g>
<!-- p7 -->
<g id="node9" class="node">
<title>p7</title>
<ellipse fill="none" stroke="black" cx="956.28" cy="-436.6" rx="3.5" ry="3.5"/>
<text text-anchor="middle" x="935.28" y="-443.9" font-family="Times,serif" font-size="14.00">flatten</text>
</g>
<!-- p0&#45;&gt;p7 -->
<g id="edge9" class="edge">
<title>p0&#45;&gt;p7</title>
<path fill="none" stroke="black" d="M894.07,-505.4C910.13,-487.9 934.44,-461.4 947.41,-447.27"/>
<polygon fill="black" stroke="black" points="950.15,-449.46 954.33,-439.73 944.99,-444.73 950.15,-449.46"/>
<text text-anchor="middle" x="942.78" y="-476.4" font-family="Times,serif" font-size="14.00">sources</text>
</g>
<!-- p13 -->
<g id="node8" class="node">
<title>p13</title>
<ellipse fill="none" stroke="black" cx="508.28" cy="-349.6" rx="3.5" ry="3.5"/>
<text text-anchor="middle" x="493.78" y="-356.9" font-family="Times,serif" font-size="14.00">mix</text>
</g>
<!-- p6&#45;&gt;p13 -->
<g id="edge8" class="edge">
<title>p6&#45;&gt;p13</title>
<path fill="none" stroke="black" d="M668.44,-419.01C622.71,-399.48 549.34,-368.14 520.49,-355.81"/>
<polygon fill="black" stroke="black" points="521.87,-352.6 511.29,-351.89 519.12,-359.03 521.87,-352.6"/>
<text text-anchor="middle" x="634.78" y="-389.4" font-family="Times,serif" font-size="14.00">aBox</text>
</g>
<!-- p1 -->
<g id="node3" class="node">
<title>p1</title>
<ellipse fill="black" stroke="black" cx="663.28" cy="-757.2" rx="3.6" ry="3.6"/>
<text text-anchor="middle" x="609.68" y="-764.6" font-family="Times,serif" font-size="14.00">Channel.fromPath</text>
</g>
<!-- p2 -->
<g id="node4" class="node">
<title>p2</title>
<ellipse fill="none" stroke="black" cx="663.28" cy="-699.1" rx="3.5" ry="3.5"/>
<text text-anchor="middle" x="642.28" y="-706.4" font-family="Times,serif" font-size="14.00">flatten</text>
</g>
<!-- p1&#45;&gt;p2 -->
<g id="edge2" class="edge">
<title>p1&#45;&gt;p2</title>
<path fill="none" stroke="black" d="M663.28,-753.49C663.28,-746.26 663.28,-726.13 663.28,-712.76"/>
<polygon fill="black" stroke="black" points="666.78,-712.65 663.28,-702.65 659.78,-712.65 666.78,-712.65"/>
<text text-anchor="middle" x="690.28" y="-724.4" font-family="Times,serif" font-size="14.00">mappings</text>
</g>
<!-- p3 -->
<g id="node5" class="node">
<title>p3</title>
<ellipse fill="none" stroke="black" cx="663.28" cy="-655.1" rx="3.5" ry="3.5"/>
<text text-anchor="middle" x="641.28" y="-662.4" font-family="Times,serif" font-size="14.00">branch</text>
</g>
<!-- p2&#45;&gt;p3 -->
<g id="edge3" class="edge">
<title>p2&#45;&gt;p3</title>
<path fill="none" stroke="black" d="M663.28,-695.34C663.28,-690.07 663.28,-678.23 663.28,-668.92"/>
<polygon fill="black" stroke="black" points="666.78,-668.92 663.28,-658.92 659.78,-668.92 666.78,-668.92"/>
</g>
<!-- p4 -->
<g id="node6" class="node">
<title>p4</title>
<ellipse fill="none" stroke="black" cx="851.28" cy="-596.6" rx="171.67" ry="18"/>
<text text-anchor="middle" x="851.28" y="-592.9" font-family="Times,serif" font-size="14.00">PrepareAbox:MapToRdf:MapYarrrmlToRml</text>
</g>
<!-- p3&#45;&gt;p4 -->
<g id="edge4" class="edge">
<title>p3&#45;&gt;p4</title>
<path fill="none" stroke="black" d="M666.24,-653.21C680.09,-649.05 739.98,-631.05 787.93,-616.64"/>
<polygon fill="black" stroke="black" points="789.08,-619.95 797.65,-613.72 787.06,-613.25 789.08,-619.95"/>
</g>
<!-- p5 -->
<g id="node7" class="node">
<title>p5</title>
<ellipse fill="none" stroke="black" cx="707.28" cy="-523.6" rx="3.5" ry="3.5"/>
<text text-anchor="middle" x="692.78" y="-530.9" font-family="Times,serif" font-size="14.00">mix</text>
</g>
<!-- p3&#45;&gt;p5 -->
<g id="edge5" class="edge">
<title>p3&#45;&gt;p5</title>
<path fill="none" stroke="black" d="M663.06,-651.39C662.31,-641.36 660.54,-605.59 670.28,-578.6 676.49,-561.43 689.48,-544.54 698.29,-534.35"/>
<polygon fill="black" stroke="black" points="700.98,-536.59 705.11,-526.83 695.8,-531.89 700.98,-536.59"/>
</g>
<!-- p4&#45;&gt;p5 -->
<g id="edge6" class="edge">
<title>p4&#45;&gt;p5</title>
<path fill="none" stroke="black" d="M817.16,-578.77C785.72,-563.27 740.81,-541.13 719.46,-530.6"/>
<polygon fill="black" stroke="black" points="720.78,-527.35 710.26,-526.07 717.68,-533.63 720.78,-527.35"/>
</g>
<!-- p5&#45;&gt;p6 -->
<g id="edge7" class="edge">
<title>p5&#45;&gt;p6</title>
<path fill="none" stroke="black" d="M707.28,-519.77C707.28,-511.28 707.28,-485.35 707.28,-464.87"/>
<polygon fill="black" stroke="black" points="710.78,-464.77 707.28,-454.77 703.78,-464.77 710.78,-464.77"/>
</g>
<!-- p14 -->
<g id="node15" class="node">
<title>p14</title>
<ellipse fill="none" stroke="black" cx="508.28" cy="-291.1" rx="3.5" ry="3.5"/>
<text text-anchor="middle" x="486.28" y="-298.4" font-family="Times,serif" font-size="14.00">collect</text>
</g>
<!-- p13&#45;&gt;p14 -->
<g id="edge15" class="edge">
<title>p13&#45;&gt;p14</title>
<path fill="none" stroke="black" d="M508.28,-345.87C508.28,-338.59 508.28,-318.31 508.28,-304.85"/>
<polygon fill="black" stroke="black" points="511.78,-304.67 508.28,-294.67 504.78,-304.67 511.78,-304.67"/>
</g>
<!-- p10 -->
<g id="node10" class="node">
<title>p10</title>
<ellipse fill="none" stroke="black" cx="971.28" cy="-349.6" rx="133.78" ry="18"/>
<text text-anchor="middle" x="971.28" y="-345.9" font-family="Times,serif" font-size="14.00">PrepareAbox:CkanCreateResource</text>
</g>
<!-- p7&#45;&gt;p10 -->
<g id="edge10" class="edge">
<title>p7&#45;&gt;p10</title>
<path fill="none" stroke="black" d="M956.78,-432.77C958.28,-424.28 962.86,-398.35 966.47,-377.87"/>
<polygon fill="black" stroke="black" points="969.96,-378.23 968.25,-367.77 963.07,-377.01 969.96,-378.23"/>
</g>
<!-- p8 -->
<g id="node11" class="node">
<title>p8</title>
<ellipse fill="black" stroke="black" cx="901.28" cy="-436.6" rx="3.6" ry="3.6"/>
</g>
<!-- p8&#45;&gt;p10 -->
<g id="edge11" class="edge">
<title>p8&#45;&gt;p10</title>
<path fill="none" stroke="black" d="M900.63,-433.05C898.78,-425.21 894.26,-401.07 904.28,-385.6 907.57,-380.52 911.85,-376.13 916.66,-372.36"/>
<polygon fill="black" stroke="black" points="918.87,-375.08 925.16,-366.56 914.93,-369.3 918.87,-375.08"/>
<text text-anchor="middle" x="931.78" y="-389.4" font-family="Times,serif" font-size="14.00">ownerOrg</text>
</g>
<!-- p9 -->
<g id="node12" class="node">
<title>p9</title>
<ellipse fill="black" stroke="black" cx="1004.28" cy="-436.6" rx="3.6" ry="3.6"/>
</g>
<!-- p9&#45;&gt;p10 -->
<g id="edge12" class="edge">
<title>p9&#45;&gt;p10</title>
<path fill="none" stroke="black" d="M1003.19,-432.77C999.86,-424.21 989.64,-397.88 981.65,-377.3"/>
<polygon fill="black" stroke="black" points="984.83,-375.82 977.95,-367.77 978.31,-378.36 984.83,-375.82"/>
<text text-anchor="middle" x="1017.28" y="-389.4" font-family="Times,serif" font-size="14.00">packageId</text>
</g>
<!-- p11 -->
<g id="node13" class="node">
<title>p11</title>
<ellipse fill="black" stroke="black" cx="307.28" cy="-523.6" rx="3.6" ry="3.6"/>
<text text-anchor="middle" x="253.68" y="-531" font-family="Times,serif" font-size="14.00">Channel.fromPath</text>
</g>
<!-- p12 -->
<g id="node14" class="node">
<title>p12</title>
<ellipse fill="none" stroke="black" cx="307.28" cy="-436.6" rx="209.86" ry="18"/>
<text text-anchor="middle" x="307.28" y="-432.9" font-family="Times,serif" font-size="14.00">CopperKeyIof:BuildGraph:ConvertDiagramToOntology</text>
</g>
<!-- p11&#45;&gt;p12 -->
<g id="edge13" class="edge">
<title>p11&#45;&gt;p12</title>
<path fill="none" stroke="black" d="M307.28,-519.77C307.28,-511.28 307.28,-485.35 307.28,-464.87"/>
<polygon fill="black" stroke="black" points="310.78,-464.77 307.28,-454.77 303.78,-464.77 310.78,-464.77"/>
<text text-anchor="middle" x="355.78" y="-476.4" font-family="Times,serif" font-size="14.00">ontologyDiagram</text>
</g>
<!-- p12&#45;&gt;p13 -->
<g id="edge14" class="edge">
<title>p12&#45;&gt;p13</title>
<path fill="none" stroke="black" d="M346.99,-418.81C393.25,-399.25 467.02,-368.05 496.02,-355.79"/>
<polygon fill="black" stroke="black" points="497.41,-359 505.26,-351.88 494.69,-352.55 497.41,-359"/>
</g>
<!-- p15 -->
<g id="node16" class="node">
<title>p15</title>
<ellipse fill="none" stroke="black" cx="508.28" cy="-232.6" rx="144.07" ry="18"/>
<text text-anchor="middle" x="508.28" y="-228.9" font-family="Times,serif" font-size="14.00">CopperKeyIof:BuildGraph:MergeRdf</text>
</g>
<!-- p14&#45;&gt;p15 -->
<g id="edge16" class="edge">
<title>p14&#45;&gt;p15</title>
<path fill="none" stroke="black" d="M508.28,-287.37C508.28,-282.43 508.28,-271.5 508.28,-260.77"/>
<polygon fill="black" stroke="black" points="511.78,-260.75 508.28,-250.75 504.78,-260.75 511.78,-260.75"/>
</g>
<!-- p16 -->
<g id="node17" class="node">
<title>p16</title>
<ellipse fill="none" stroke="black" cx="508.28" cy="-159.6" rx="155.17" ry="18"/>
<text text-anchor="middle" x="508.28" y="-155.9" font-family="Times,serif" font-size="14.00">CopperKeyIof:BuildGraph:RobotReason</text>
</g>
<!-- p15&#45;&gt;p16 -->
<g id="edge17" class="edge">
<title>p15&#45;&gt;p16</title>
<path fill="none" stroke="black" d="M508.28,-214.41C508.28,-206.39 508.28,-196.65 508.28,-187.67"/>
<polygon fill="black" stroke="black" points="511.78,-187.63 508.28,-177.63 504.78,-187.63 511.78,-187.63"/>
</g>
<!-- p18 -->
<g id="node18" class="node">
<title>p18</title>
<ellipse fill="none" stroke="black" cx="183.28" cy="-72.6" rx="183.07" ry="18"/>
<text text-anchor="middle" x="183.28" y="-68.9" font-family="Times,serif" font-size="14.00">CopperKeyIof:BuildGraph:FusekiUploadDataset</text>
</g>
<!-- p16&#45;&gt;p18 -->
<g id="edge18" class="edge">
<title>p16&#45;&gt;p18</title>
<path fill="none" stroke="black" d="M448.29,-142.91C393.51,-128.58 312.44,-107.38 254.41,-92.2"/>
<polygon fill="black" stroke="black" points="255.14,-88.78 244.58,-89.63 253.37,-95.55 255.14,-88.78"/>
</g>
<!-- p21 -->
<g id="node20" class="node">
<title>p21</title>
<ellipse fill="none" stroke="black" cx="787.28" cy="-72.6" rx="137.58" ry="18"/>
<text text-anchor="middle" x="787.28" y="-68.9" font-family="Times,serif" font-size="14.00">CopperKeyIof:CkanCreateResource</text>
</g>
<!-- p16&#45;&gt;p21 -->
<g id="edge20" class="edge">
<title>p16&#45;&gt;p21</title>
<path fill="none" stroke="black" d="M560.76,-142.61C607.67,-128.32 676.44,-107.37 725.89,-92.3"/>
<polygon fill="black" stroke="black" points="726.97,-95.63 735.51,-89.37 724.93,-88.94 726.97,-95.63"/>
<text text-anchor="middle" x="694.28" y="-112.4" font-family="Times,serif" font-size="14.00">uploadFile</text>
</g>
<!-- p22 -->
<g id="node23" class="node">
<title>p22</title>
<ellipse fill="none" stroke="black" cx="508.28" cy="-72.6" rx="123.48" ry="18"/>
<text text-anchor="middle" x="508.28" y="-68.9" font-family="Times,serif" font-size="14.00">CopperKeyIof:NextflowPublish</text>
</g>
<!-- p16&#45;&gt;p22 -->
<g id="edge23" class="edge">
<title>p16&#45;&gt;p22</title>
<path fill="none" stroke="black" d="M508.28,-141.4C508.28,-129.76 508.28,-114.15 508.28,-100.84"/>
<polygon fill="black" stroke="black" points="511.78,-100.78 508.28,-90.78 504.78,-100.78 511.78,-100.78"/>
<text text-anchor="middle" x="525.28" y="-112.4" font-family="Times,serif" font-size="14.00">inputs</text>
</g>
<!-- p17 -->
<g id="node19" class="node">
<title>p17</title>
<ellipse fill="black" stroke="black" cx="183.28" cy="-159.6" rx="3.6" ry="3.6"/>
</g>
<!-- p17&#45;&gt;p18 -->
<g id="edge19" class="edge">
<title>p17&#45;&gt;p18</title>
<path fill="none" stroke="black" d="M183.28,-155.77C183.28,-147.28 183.28,-121.35 183.28,-100.87"/>
<polygon fill="black" stroke="black" points="186.78,-100.77 183.28,-90.77 179.78,-100.77 186.78,-100.77"/>
<text text-anchor="middle" x="223.28" y="-112.4" font-family="Times,serif" font-size="14.00">databaseName</text>
</g>
<!-- p19 -->
<g id="node21" class="node">
<title>p19</title>
<ellipse fill="black" stroke="black" cx="748.28" cy="-159.6" rx="3.6" ry="3.6"/>
</g>
<!-- p19&#45;&gt;p21 -->
<g id="edge21" class="edge">
<title>p19&#45;&gt;p21</title>
<path fill="none" stroke="black" d="M747.59,-155.72C745.84,-147.78 741.87,-125.07 749.28,-108.6 751.02,-104.74 753.42,-101.11 756.16,-97.76"/>
<polygon fill="black" stroke="black" points="758.73,-100.13 763.06,-90.47 753.65,-95.32 758.73,-100.13"/>
<text text-anchor="middle" x="776.78" y="-112.4" font-family="Times,serif" font-size="14.00">ownerOrg</text>
</g>
<!-- p20 -->
<g id="node22" class="node">
<title>p20</title>
<ellipse fill="black" stroke="black" cx="826.28" cy="-159.6" rx="3.6" ry="3.6"/>
</g>
<!-- p20&#45;&gt;p21 -->
<g id="edge22" class="edge">
<title>p20&#45;&gt;p21</title>
<path fill="none" stroke="black" d="M825.13,-155.87C821.91,-148.32 812.57,-126.5 804.28,-108.6 802.96,-105.75 801.56,-102.78 800.15,-99.83"/>
<polygon fill="black" stroke="black" points="803.21,-98.11 795.71,-90.63 796.91,-101.16 803.21,-98.11"/>
<text text-anchor="middle" x="839.28" y="-112.4" font-family="Times,serif" font-size="14.00">packageId</text>
</g>
<!-- p23 -->
<g id="node24" class="node">
<title>p23</title>
<ellipse fill="black" stroke="black" cx="508.28" cy="-1.8" rx="1.8" ry="1.8"/>
</g>
<!-- p22&#45;&gt;p23 -->
<g id="edge24" class="edge">
<title>p22&#45;&gt;p23</title>
<path fill="none" stroke="black" d="M508.28,-54.59C508.28,-42.06 508.28,-25.34 508.28,-14.34"/>
<polygon fill="black" stroke="black" points="511.78,-14.19 508.28,-4.19 504.78,-14.19 511.78,-14.19"/>
<text text-anchor="middle" x="525.28" y="-25.4" font-family="Times,serif" font-size="14.00">inputs</text>
</g>
</g>
</svg>
