Jul-04 16:02:18.255 [main] DEBUG nextflow.cli.Launcher - $> nextflow run main.nf -params-file config.json
Jul-04 16:02:18.338 [main] INFO  nextflow.cli.CmdRun - N E X T F L O W  ~  version 21.04.3
Jul-04 16:02:18.351 [main] INFO  nextflow.cli.CmdRun - Launching `main.nf` [modest_cray] - revision: e1fdd4b125
Jul-04 16:02:18.361 [main] DEBUG nextflow.config.ConfigBuilder - Found config local: /home/beavis/repositories/continuous-casting/nextflow.config
Jul-04 16:02:18.361 [main] DEBUG nextflow.config.ConfigBuilder - Parsing config file: /home/beavis/repositories/continuous-casting/nextflow.config
Jul-04 16:02:18.386 [main] DEBUG nextflow.config.ConfigBuilder - Applying config profile: `standard`
Jul-04 16:02:18.748 [main] DEBUG nextflow.plugin.PluginsFacade - Setting up plugin manager > mode=prod; plugins-dir=/home/beavis/.nextflow/plugins
Jul-04 16:02:18.749 [main] DEBUG nextflow.plugin.PluginsFacade - Plugins default=[]
Jul-04 16:02:18.750 [main] DEBUG nextflow.plugin.PluginsFacade - Plugins local root: .nextflow/plr/empty
Jul-04 16:02:18.755 [main] INFO  org.pf4j.DefaultPluginStatusProvider - Enabled plugins: []
Jul-04 16:02:18.755 [main] INFO  org.pf4j.DefaultPluginStatusProvider - Disabled plugins: []
Jul-04 16:02:18.758 [main] INFO  org.pf4j.DefaultPluginManager - PF4J version 3.4.1 in 'deployment' mode
Jul-04 16:02:18.764 [main] INFO  org.pf4j.AbstractPluginManager - No plugins
Jul-04 16:02:18.796 [main] DEBUG nextflow.Session - Session uuid: ce684237-d0eb-4af5-aac6-081e554f87c8
Jul-04 16:02:18.796 [main] DEBUG nextflow.Session - Run name: modest_cray
Jul-04 16:02:18.797 [main] DEBUG nextflow.Session - Executor pool size: 16
Jul-04 16:02:18.815 [main] DEBUG nextflow.cli.CmdRun - 
  Version: 21.04.3 build 5560
  Created: 21-07-2021 15:09 UTC (17:09 CEST)
  System: Linux 5.15.0-39-generic
  Runtime: Groovy 3.0.7 on OpenJDK 64-Bit Server VM 11.0.15+10-Ubuntu-0ubuntu0.22.04.1
  Encoding: UTF-8 (UTF-8)
  Process: 1472010@schlepptopVI [127.0.1.1]
  CPUs: 16 - Mem: 31.1 GB (8.4 GB) - Swap: 0 (0)
Jul-04 16:02:18.831 [main] DEBUG nextflow.Session - Work-dir: /home/beavis/repositories/continuous-casting/work [ext2/ext3]
Jul-04 16:02:18.831 [main] DEBUG nextflow.Session - Script base path does not exist or is not a directory: /home/beavis/repositories/continuous-casting/bin
Jul-04 16:02:18.839 [main] DEBUG nextflow.executor.ExecutorFactory - Extension executors providers=[]
Jul-04 16:02:18.847 [main] DEBUG nextflow.Session - Observer factory: DefaultObserverFactory
Jul-04 16:02:18.944 [main] DEBUG nextflow.Session - Session start invoked
Jul-04 16:02:19.158 [main] DEBUG nextflow.script.ScriptRunner - > Launching execution
Jul-04 16:02:19.164 [main] DEBUG nextflow.Session - Workflow process names [dsl1]: mapToRdf
Jul-04 16:02:19.273 [main] DEBUG nextflow.Session - Session aborted -- Cause: Unknown variable 'data'
Jul-04 16:02:19.288 [main] ERROR nextflow.cli.Launcher - @unknown
groovy.lang.MissingPropertyException: Unknown variable 'data'
	at java.base/jdk.internal.reflect.NativeConstructorAccessorImpl.newInstance0(Native Method)
	at java.base/jdk.internal.reflect.NativeConstructorAccessorImpl.newInstance(NativeConstructorAccessorImpl.java:62)
	at java.base/jdk.internal.reflect.DelegatingConstructorAccessorImpl.newInstance(DelegatingConstructorAccessorImpl.java:45)
	at java.base/java.lang.reflect.Constructor.newInstance(Constructor.java:490)
	at org.codehaus.groovy.reflection.CachedConstructor.invoke(CachedConstructor.java:72)
	at org.codehaus.groovy.reflection.CachedConstructor.doConstructorInvoke(CachedConstructor.java:59)
	at org.codehaus.groovy.runtime.callsite.ConstructorSite$ConstructorSiteNoUnwrap.callConstructor(ConstructorSite.java:84)
	at org.codehaus.groovy.runtime.callsite.AbstractCallSite.callConstructor(AbstractCallSite.java:295)
	at nextflow.script.ProcessConfig.getProperty(ProcessConfig.groovy:276)
	at org.codehaus.groovy.runtime.InvokerHelper.getProperty(InvokerHelper.java:194)
	at groovy.lang.Closure.getPropertyTryThese(Closure.java:320)
	at groovy.lang.Closure.getPropertyDelegateFirst(Closure.java:310)
	at groovy.lang.Closure.getProperty(Closure.java:296)
	at org.codehaus.groovy.runtime.callsite.PogoGetPropertySite.getProperty(PogoGetPropertySite.java:49)
	at org.codehaus.groovy.runtime.callsite.AbstractCallSite.callGroovyObjectGetProperty(AbstractCallSite.java:341)
	at Script_bb055915$_runScript_closure1.doCall(Script_bb055915:18)
	at Script_bb055915$_runScript_closure1.doCall(Script_bb055915)
	at java.base/jdk.internal.reflect.NativeMethodAccessorImpl.invoke0(Native Method)
	at java.base/jdk.internal.reflect.NativeMethodAccessorImpl.invoke(NativeMethodAccessorImpl.java:62)
	at java.base/jdk.internal.reflect.DelegatingMethodAccessorImpl.invoke(DelegatingMethodAccessorImpl.java:43)
	at java.base/java.lang.reflect.Method.invoke(Method.java:566)
	at org.codehaus.groovy.reflection.CachedMethod.invoke(CachedMethod.java:107)
	at groovy.lang.MetaMethod.doMethodInvoke(MetaMethod.java:323)
	at org.codehaus.groovy.runtime.metaclass.ClosureMetaClass.invokeMethod(ClosureMetaClass.java:263)
	at groovy.lang.MetaClassImpl.invokeMethod(MetaClassImpl.java:1035)
	at groovy.lang.Closure.call(Closure.java:412)
	at groovy.lang.Closure.call(Closure.java:406)
	at nextflow.script.ProcessFactory.createProcessor(ProcessFactory.groovy:95)
	at nextflow.script.ProcessFactory$createProcessor.call(Unknown Source)
	at org.codehaus.groovy.runtime.callsite.CallSiteArray.defaultCall(CallSiteArray.java:47)
	at org.codehaus.groovy.runtime.callsite.AbstractCallSite.call(AbstractCallSite.java:125)
	at org.codehaus.groovy.runtime.callsite.AbstractCallSite.call(AbstractCallSite.java:148)
	at nextflow.script.BaseScript.process(BaseScript.groovy:115)
	at java.base/jdk.internal.reflect.NativeMethodAccessorImpl.invoke0(Native Method)
	at java.base/jdk.internal.reflect.NativeMethodAccessorImpl.invoke(NativeMethodAccessorImpl.java:62)
	at java.base/jdk.internal.reflect.DelegatingMethodAccessorImpl.invoke(DelegatingMethodAccessorImpl.java:43)
	at java.base/java.lang.reflect.Method.invoke(Method.java:566)
	at org.codehaus.groovy.runtime.callsite.PlainObjectMetaMethodSite.doInvoke(PlainObjectMetaMethodSite.java:43)
	at org.codehaus.groovy.runtime.callsite.PogoMetaMethodSite$PogoCachedMethodSiteNoUnwrapNoCoerce.invoke(PogoMetaMethodSite.java:193)
	at org.codehaus.groovy.runtime.callsite.PogoMetaMethodSite.callCurrent(PogoMetaMethodSite.java:61)
	at org.codehaus.groovy.runtime.callsite.CallSiteArray.defaultCallCurrent(CallSiteArray.java:51)
	at org.codehaus.groovy.runtime.callsite.AbstractCallSite.callCurrent(AbstractCallSite.java:171)
	at org.codehaus.groovy.runtime.callsite.AbstractCallSite.callCurrent(AbstractCallSite.java:194)
	at Script_bb055915.runScript(Script_bb055915:4)
	at nextflow.script.BaseScript.runDsl1(BaseScript.groovy:164)
	at nextflow.script.BaseScript.run(BaseScript.groovy:200)
	at nextflow.script.ScriptParser.runScript(ScriptParser.groovy:221)
	at nextflow.script.ScriptRunner.run(ScriptRunner.groovy:212)
	at nextflow.script.ScriptRunner.execute(ScriptRunner.groovy:120)
	at nextflow.cli.CmdRun.run(CmdRun.groovy:302)
	at nextflow.cli.Launcher.run(Launcher.groovy:475)
	at nextflow.cli.Launcher.main(Launcher.groovy:657)
