Jul-04 15:40:10.772 [main] DEBUG nextflow.cli.Launcher - $> nextflow run main.nf -params-file config.json
Jul-04 15:40:10.843 [main] INFO  nextflow.cli.CmdRun - N E X T F L O W  ~  version 21.04.3
Jul-04 15:40:10.857 [main] INFO  nextflow.cli.CmdRun - Launching `main.nf` [fabulous_mayer] - revision: be8e83fd95
Jul-04 15:40:10.867 [main] DEBUG nextflow.config.ConfigBuilder - Found config local: /home/beavis/repositories/continuous-casting/nextflow.config
Jul-04 15:40:10.867 [main] DEBUG nextflow.config.ConfigBuilder - Parsing config file: /home/beavis/repositories/continuous-casting/nextflow.config
Jul-04 15:40:10.889 [main] DEBUG nextflow.config.ConfigBuilder - Applying config profile: `standard`
Jul-04 15:40:11.252 [main] DEBUG nextflow.plugin.PluginsFacade - Setting up plugin manager > mode=prod; plugins-dir=/home/beavis/.nextflow/plugins
Jul-04 15:40:11.253 [main] DEBUG nextflow.plugin.PluginsFacade - Plugins default=[]
Jul-04 15:40:11.254 [main] DEBUG nextflow.plugin.PluginsFacade - Plugins local root: .nextflow/plr/empty
Jul-04 15:40:11.259 [main] INFO  org.pf4j.DefaultPluginStatusProvider - Enabled plugins: []
Jul-04 15:40:11.260 [main] INFO  org.pf4j.DefaultPluginStatusProvider - Disabled plugins: []
Jul-04 15:40:11.262 [main] INFO  org.pf4j.DefaultPluginManager - PF4J version 3.4.1 in 'deployment' mode
Jul-04 15:40:11.268 [main] INFO  org.pf4j.AbstractPluginManager - No plugins
Jul-04 15:40:11.298 [main] DEBUG nextflow.Session - Session uuid: b404ab46-b12c-4373-9816-5fe877f7ea7a
Jul-04 15:40:11.298 [main] DEBUG nextflow.Session - Run name: fabulous_mayer
Jul-04 15:40:11.299 [main] DEBUG nextflow.Session - Executor pool size: 16
Jul-04 15:40:11.317 [main] DEBUG nextflow.cli.CmdRun - 
  Version: 21.04.3 build 5560
  Created: 21-07-2021 15:09 UTC (17:09 CEST)
  System: Linux 5.15.0-39-generic
  Runtime: Groovy 3.0.7 on OpenJDK 64-Bit Server VM 11.0.15+10-Ubuntu-0ubuntu0.22.04.1
  Encoding: UTF-8 (UTF-8)
  Process: 1407453@schlepptopVI [127.0.1.1]
  CPUs: 16 - Mem: 31.1 GB (9.1 GB) - Swap: 0 (0)
Jul-04 15:40:11.332 [main] DEBUG nextflow.Session - Work-dir: /home/beavis/repositories/continuous-casting/work [ext2/ext3]
Jul-04 15:40:11.332 [main] DEBUG nextflow.Session - Script base path does not exist or is not a directory: /home/beavis/repositories/continuous-casting/bin
Jul-04 15:40:11.339 [main] DEBUG nextflow.executor.ExecutorFactory - Extension executors providers=[]
Jul-04 15:40:11.346 [main] DEBUG nextflow.Session - Observer factory: DefaultObserverFactory
Jul-04 15:40:11.442 [main] DEBUG nextflow.Session - Session start invoked
Jul-04 15:40:11.662 [main] DEBUG nextflow.script.ScriptRunner - > Launching execution
Jul-04 15:40:11.667 [main] DEBUG nextflow.Session - Workflow process names [dsl1]: mapToRdf
Jul-04 15:40:11.794 [main] DEBUG nextflow.executor.ExecutorFactory - << taskConfig executor: null
Jul-04 15:40:11.794 [main] DEBUG nextflow.executor.ExecutorFactory - >> processorType: 'local'
Jul-04 15:40:11.799 [main] DEBUG nextflow.executor.Executor - [warm up] executor > local
Jul-04 15:40:11.804 [main] DEBUG n.processor.LocalPollingMonitor - Creating local task monitor for executor 'local' > cpus=16; memory=31.1 GB; capacity=16; pollInterval=100ms; dumpInterval=5m
Jul-04 15:40:11.858 [main] DEBUG nextflow.script.ScriptRunner - > Await termination 
Jul-04 15:40:11.858 [main] DEBUG nextflow.Session - Session await
Jul-04 15:40:12.242 [Actor Thread 2] DEBUG n.util.BlockingThreadExecutorFactory - Thread pool name=FileTransfer; maxThreads=48; maxQueueSize=144; keepAlive=1m
Jul-04 15:40:12.254 [FileTransfer-thread-1] DEBUG nextflow.file.FilePorter - Local cache found for foreign file http://139.18.211.135:5001/dataset/49b7432c-8cbb-461b-8db1-d75a1bfcd747/resource/da6c5cae-0ad5-4157-8c95-40c9115253ce/download/leg.-3-cuni20-2021_10_07__11_38_22_comlog.txt at /home/beavis/repositories/continuous-casting/work/stage/f9/0940c5a882d869b2daa7567ec7424d/leg.-3-cuni20-2021_10_07__11_38_22_comlog.txt
Jul-04 15:40:12.354 [Task submitter] DEBUG nextflow.executor.LocalTaskHandler - Launch cmd line: /bin/bash -ue .command.run
Jul-04 15:40:12.356 [Task submitter] INFO  nextflow.Session - [49/b1a7b5] Submitted process > mapToRdf
Jul-04 15:40:22.347 [Task monitor] DEBUG n.processor.TaskPollingMonitor - Task completed > TaskHandler[id: 1; name: mapToRdf; status: COMPLETED; exit: 0; error: -; workDir: /home/beavis/repositories/continuous-casting/work/49/b1a7b5fe6f36edc8f32c8699adc0bf]
Jul-04 15:40:22.360 [main] DEBUG nextflow.Session - Session await > all process finished
Jul-04 15:40:22.360 [main] DEBUG nextflow.Session - Session await > all barriers passed
Jul-04 15:40:22.365 [main] DEBUG nextflow.trace.WorkflowStatsObserver - Workflow completed > WorkflowStats[succeededCount=1; failedCount=0; ignoredCount=0; cachedCount=0; pendingCount=0; submittedCount=0; runningCount=0; retriesCount=0; abortedCount=0; succeedDuration=9.9s; failedDuration=0ms; cachedDuration=0ms;loadCpus=0; loadMemory=0; peakRunning=1; peakCpus=1; peakMemory=0; ]
Jul-04 15:40:22.503 [main] DEBUG nextflow.CacheDB - Closing CacheDB done
Jul-04 15:40:22.522 [main] DEBUG nextflow.script.ScriptRunner - > Execution complete -- Goodbye
