Jul-04 17:19:15.707 [main] DEBUG nextflow.cli.Launcher - $> nextflow run main.nf -params-file config.json
Jul-04 17:19:15.799 [main] INFO  nextflow.cli.CmdRun - N E X T F L O W  ~  version 21.04.3
Jul-04 17:19:15.818 [main] INFO  nextflow.cli.CmdRun - Launching `main.nf` [hungry_boyd] - revision: 6f9c32198a
Jul-04 17:19:15.829 [main] DEBUG nextflow.config.ConfigBuilder - Found config local: /home/beavis/repositories/continuous-casting/nextflow.config
Jul-04 17:19:15.830 [main] DEBUG nextflow.config.ConfigBuilder - Parsing config file: /home/beavis/repositories/continuous-casting/nextflow.config
Jul-04 17:19:15.853 [main] DEBUG nextflow.config.ConfigBuilder - Applying config profile: `standard`
Jul-04 17:19:16.275 [main] DEBUG nextflow.plugin.PluginsFacade - Setting up plugin manager > mode=prod; plugins-dir=/home/beavis/.nextflow/plugins
Jul-04 17:19:16.276 [main] DEBUG nextflow.plugin.PluginsFacade - Plugins default=[]
Jul-04 17:19:16.277 [main] DEBUG nextflow.plugin.PluginsFacade - Plugins local root: .nextflow/plr/empty
Jul-04 17:19:16.281 [main] INFO  org.pf4j.DefaultPluginStatusProvider - Enabled plugins: []
Jul-04 17:19:16.282 [main] INFO  org.pf4j.DefaultPluginStatusProvider - Disabled plugins: []
Jul-04 17:19:16.284 [main] INFO  org.pf4j.DefaultPluginManager - PF4J version 3.4.1 in 'deployment' mode
Jul-04 17:19:16.290 [main] INFO  org.pf4j.AbstractPluginManager - No plugins
Jul-04 17:19:16.316 [main] DEBUG nextflow.Session - Session uuid: 00729f37-9868-4c23-b8e9-c8da15cb4cca
Jul-04 17:19:16.316 [main] DEBUG nextflow.Session - Run name: hungry_boyd
Jul-04 17:19:16.316 [main] DEBUG nextflow.Session - Executor pool size: 16
Jul-04 17:19:16.333 [main] DEBUG nextflow.cli.CmdRun - 
  Version: 21.04.3 build 5560
  Created: 21-07-2021 15:09 UTC (17:09 CEST)
  System: Linux 5.15.0-39-generic
  Runtime: Groovy 3.0.7 on OpenJDK 64-Bit Server VM 11.0.15+10-Ubuntu-0ubuntu0.22.04.1
  Encoding: UTF-8 (UTF-8)
  Process: 1648009@schlepptopVI [127.0.1.1]
  CPUs: 16 - Mem: 31.1 GB (15.8 GB) - Swap: 0 (0)
Jul-04 17:19:16.347 [main] DEBUG nextflow.Session - Work-dir: /home/beavis/repositories/continuous-casting/work [ext2/ext3]
Jul-04 17:19:16.347 [main] DEBUG nextflow.Session - Script base path does not exist or is not a directory: /home/beavis/repositories/continuous-casting/bin
Jul-04 17:19:16.354 [main] DEBUG nextflow.executor.ExecutorFactory - Extension executors providers=[]
Jul-04 17:19:16.362 [main] DEBUG nextflow.Session - Observer factory: DefaultObserverFactory
Jul-04 17:19:16.474 [main] DEBUG nextflow.Session - Session start invoked
Jul-04 17:19:16.691 [main] DEBUG nextflow.script.ScriptRunner - > Launching execution
Jul-04 17:19:16.697 [main] DEBUG nextflow.Session - Workflow process names [dsl1]: mapToRdf
Jul-04 17:19:16.813 [main] DEBUG nextflow.executor.ExecutorFactory - << taskConfig executor: null
Jul-04 17:19:16.814 [main] DEBUG nextflow.executor.ExecutorFactory - >> processorType: 'local'
Jul-04 17:19:16.819 [main] DEBUG nextflow.executor.Executor - [warm up] executor > local
Jul-04 17:19:16.825 [main] DEBUG n.processor.LocalPollingMonitor - Creating local task monitor for executor 'local' > cpus=16; memory=31.1 GB; capacity=16; pollInterval=100ms; dumpInterval=5m
Jul-04 17:19:16.889 [main] DEBUG nextflow.script.ScriptRunner - > Await termination 
Jul-04 17:19:16.889 [main] DEBUG nextflow.Session - Session await
Jul-04 17:19:18.157 [Actor Thread 1] DEBUG n.util.BlockingThreadExecutorFactory - Thread pool name=FileTransfer; maxThreads=48; maxQueueSize=144; keepAlive=1m
Jul-04 17:19:18.164 [FileTransfer-thread-1] DEBUG nextflow.file.FilePorter - Local cache found for foreign file http://139.18.211.135:5001/dataset/49b7432c-8cbb-461b-8db1-d75a1bfcd747/resource/da6c5cae-0ad5-4157-8c95-40c9115253ce/download/leg.-3-cuni20-2021_10_07__11_38_22_comlog.txt at /home/beavis/repositories/continuous-casting/work/stage/f9/0940c5a882d869b2daa7567ec7424d/leg.-3-cuni20-2021_10_07__11_38_22_comlog.txt
Jul-04 17:19:18.689 [FileTransfer-thread-2] DEBUG nextflow.file.FilePorter - Local cache found for foreign file https://gitlab.com/kupferdigital/workflows/mappings/-/raw/main/continous-casting-comlog-mapping.yaml at /home/beavis/repositories/continuous-casting/work/stage/3c/0d6bf4831df24b8b86783e15c26a41/continous-casting-comlog-mapping.yaml
Jul-04 17:19:18.823 [Task submitter] DEBUG nextflow.executor.LocalTaskHandler - Launch cmd line: /bin/bash -ue .command.run
Jul-04 17:19:18.826 [Task submitter] INFO  nextflow.Session - [af/ee3cf3] Submitted process > mapToRdf
Jul-04 17:19:27.282 [Task monitor] DEBUG n.processor.TaskPollingMonitor - Task completed > TaskHandler[id: 1; name: mapToRdf; status: COMPLETED; exit: 0; error: -; workDir: /home/beavis/repositories/continuous-casting/work/af/ee3cf3496d3e25dc337ea55b3754e0]
Jul-04 17:19:27.298 [main] DEBUG nextflow.Session - Session await > all process finished
Jul-04 17:19:27.380 [main] DEBUG nextflow.Session - Session await > all barriers passed
Jul-04 17:19:27.386 [main] DEBUG nextflow.trace.WorkflowStatsObserver - Workflow completed > WorkflowStats[succeededCount=1; failedCount=0; ignoredCount=0; cachedCount=0; pendingCount=0; submittedCount=0; runningCount=0; retriesCount=0; abortedCount=0; succeedDuration=8.4s; failedDuration=0ms; cachedDuration=0ms;loadCpus=0; loadMemory=0; peakRunning=1; peakCpus=1; peakMemory=0; ]
Jul-04 17:19:27.531 [main] DEBUG nextflow.CacheDB - Closing CacheDB done
Jul-04 17:19:27.541 [main] DEBUG nextflow.script.ScriptRunner - > Execution complete -- Goodbye
