Jul-04 15:41:06.928 [main] DEBUG nextflow.cli.Launcher - $> nextflow run main.nf -params-file config.json
Jul-04 15:41:07.005 [main] INFO  nextflow.cli.CmdRun - N E X T F L O W  ~  version 21.04.3
Jul-04 15:41:07.020 [main] INFO  nextflow.cli.CmdRun - Launching `main.nf` [focused_wilson] - revision: 4d2ae1ef0c
Jul-04 15:41:07.031 [main] DEBUG nextflow.config.ConfigBuilder - Found config local: /home/beavis/repositories/continuous-casting/nextflow.config
Jul-04 15:41:07.031 [main] DEBUG nextflow.config.ConfigBuilder - Parsing config file: /home/beavis/repositories/continuous-casting/nextflow.config
Jul-04 15:41:07.054 [main] DEBUG nextflow.config.ConfigBuilder - Applying config profile: `standard`
Jul-04 15:41:07.421 [main] DEBUG nextflow.plugin.PluginsFacade - Setting up plugin manager > mode=prod; plugins-dir=/home/beavis/.nextflow/plugins
Jul-04 15:41:07.422 [main] DEBUG nextflow.plugin.PluginsFacade - Plugins default=[]
Jul-04 15:41:07.423 [main] DEBUG nextflow.plugin.PluginsFacade - Plugins local root: .nextflow/plr/empty
Jul-04 15:41:07.428 [main] INFO  org.pf4j.DefaultPluginStatusProvider - Enabled plugins: []
Jul-04 15:41:07.428 [main] INFO  org.pf4j.DefaultPluginStatusProvider - Disabled plugins: []
Jul-04 15:41:07.430 [main] INFO  org.pf4j.DefaultPluginManager - PF4J version 3.4.1 in 'deployment' mode
Jul-04 15:41:07.436 [main] INFO  org.pf4j.AbstractPluginManager - No plugins
Jul-04 15:41:07.464 [main] DEBUG nextflow.Session - Session uuid: ff0051bb-04c3-40a1-92a8-07e2d7673634
Jul-04 15:41:07.465 [main] DEBUG nextflow.Session - Run name: focused_wilson
Jul-04 15:41:07.465 [main] DEBUG nextflow.Session - Executor pool size: 16
Jul-04 15:41:07.483 [main] DEBUG nextflow.cli.CmdRun - 
  Version: 21.04.3 build 5560
  Created: 21-07-2021 15:09 UTC (17:09 CEST)
  System: Linux 5.15.0-39-generic
  Runtime: Groovy 3.0.7 on OpenJDK 64-Bit Server VM 11.0.15+10-Ubuntu-0ubuntu0.22.04.1
  Encoding: UTF-8 (UTF-8)
  Process: 1410948@schlepptopVI [127.0.1.1]
  CPUs: 16 - Mem: 31.1 GB (9.1 GB) - Swap: 0 (0)
Jul-04 15:41:07.498 [main] DEBUG nextflow.Session - Work-dir: /home/beavis/repositories/continuous-casting/work [ext2/ext3]
Jul-04 15:41:07.498 [main] DEBUG nextflow.Session - Script base path does not exist or is not a directory: /home/beavis/repositories/continuous-casting/bin
Jul-04 15:41:07.506 [main] DEBUG nextflow.executor.ExecutorFactory - Extension executors providers=[]
Jul-04 15:41:07.513 [main] DEBUG nextflow.Session - Observer factory: DefaultObserverFactory
Jul-04 15:41:07.605 [main] DEBUG nextflow.Session - Session start invoked
Jul-04 15:41:07.855 [main] DEBUG nextflow.script.ScriptRunner - > Launching execution
Jul-04 15:41:07.861 [main] DEBUG nextflow.Session - Workflow process names [dsl1]: mapToRdf
Jul-04 15:41:07.981 [main] DEBUG nextflow.executor.ExecutorFactory - << taskConfig executor: null
Jul-04 15:41:07.981 [main] DEBUG nextflow.executor.ExecutorFactory - >> processorType: 'local'
Jul-04 15:41:07.985 [main] DEBUG nextflow.executor.Executor - [warm up] executor > local
Jul-04 15:41:07.990 [main] DEBUG n.processor.LocalPollingMonitor - Creating local task monitor for executor 'local' > cpus=16; memory=31.1 GB; capacity=16; pollInterval=100ms; dumpInterval=5m
Jul-04 15:41:08.047 [main] DEBUG nextflow.script.ScriptRunner - > Await termination 
Jul-04 15:41:08.047 [main] DEBUG nextflow.Session - Session await
Jul-04 15:41:08.440 [Actor Thread 1] DEBUG n.util.BlockingThreadExecutorFactory - Thread pool name=FileTransfer; maxThreads=48; maxQueueSize=144; keepAlive=1m
Jul-04 15:41:08.452 [FileTransfer-thread-1] DEBUG nextflow.file.FilePorter - Local cache found for foreign file http://139.18.211.135:5001/dataset/49b7432c-8cbb-461b-8db1-d75a1bfcd747/resource/da6c5cae-0ad5-4157-8c95-40c9115253ce/download/leg.-3-cuni20-2021_10_07__11_38_22_comlog.txt at /home/beavis/repositories/continuous-casting/work/stage/f9/0940c5a882d869b2daa7567ec7424d/leg.-3-cuni20-2021_10_07__11_38_22_comlog.txt
Jul-04 15:41:08.540 [Task submitter] DEBUG nextflow.executor.LocalTaskHandler - Launch cmd line: /bin/bash -ue .command.run
Jul-04 15:41:08.543 [Task submitter] INFO  nextflow.Session - [8a/e43a48] Submitted process > mapToRdf
Jul-04 15:41:18.046 [Task monitor] DEBUG n.processor.TaskPollingMonitor - Task completed > TaskHandler[id: 1; name: mapToRdf; status: COMPLETED; exit: 0; error: -; workDir: /home/beavis/repositories/continuous-casting/work/8a/e43a48c8c73a3fe9a6a00190752174]
Jul-04 15:41:18.064 [main] DEBUG nextflow.Session - Session await > all process finished
Jul-04 15:41:18.065 [main] DEBUG nextflow.Session - Session await > all barriers passed
Jul-04 15:41:18.070 [main] DEBUG nextflow.trace.WorkflowStatsObserver - Workflow completed > WorkflowStats[succeededCount=1; failedCount=0; ignoredCount=0; cachedCount=0; pendingCount=0; submittedCount=0; runningCount=0; retriesCount=0; abortedCount=0; succeedDuration=9.4s; failedDuration=0ms; cachedDuration=0ms;loadCpus=0; loadMemory=0; peakRunning=1; peakCpus=1; peakMemory=0; ]
Jul-04 15:41:18.255 [main] DEBUG nextflow.CacheDB - Closing CacheDB done
Jul-04 15:41:18.273 [main] DEBUG nextflow.script.ScriptRunner - > Execution complete -- Goodbye
