<mxfile host="Electron" modified="2022-07-05T12:25:39.501Z" agent="5.0 (X11; Linux x86_64) AppleWebKit/537.36 (KHTML, like Gecko) draw.io/19.0.3 Chrome/102.0.5005.63 Electron/19.0.3 Safari/537.36" etag="ZnpK1z_DZuIJvZlBVFel" compressed="false" version="19.0.3" type="device" pages="2">
  <diagram id="8EYbdXBYClU8PvUJjr8-" name="Process">
    <mxGraphModel dx="2489" dy="1004" grid="1" gridSize="10" guides="1" tooltips="1" connect="1" arrows="1" fold="1" page="1" pageScale="1" pageWidth="827" pageHeight="1169" math="0" shadow="0">
      <root>
        <mxCell id="0" />
        <mxCell id="1" parent="0" />
        <mxCell id="thum3a6WnivtqRv_4nlt-1" value="" style="endArrow=open;html=1;fontColor=#000099;endFill=0;dashed=1;endSize=8;rounded=0;" parent="1" source="thum3a6WnivtqRv_4nlt-4" target="thum3a6WnivtqRv_4nlt-3" edge="1">
          <mxGeometry width="50" height="50" relative="1" as="geometry">
            <mxPoint x="90" y="150" as="sourcePoint" />
            <mxPoint x="-37.00000000001069" y="80" as="targetPoint" />
          </mxGeometry>
        </mxCell>
        <mxCell id="thum3a6WnivtqRv_4nlt-2" value="&amp;lt;&amp;lt;rdf:type&amp;gt;&amp;gt;" style="text;html=1;align=center;verticalAlign=middle;resizable=0;points=[];fontColor=#000000;labelBackgroundColor=#ffffff;" parent="thum3a6WnivtqRv_4nlt-1" vertex="1" connectable="0">
          <mxGeometry x="-0.3277" relative="1" as="geometry">
            <mxPoint y="-7" as="offset" />
          </mxGeometry>
        </mxCell>
        <mxCell id="thum3a6WnivtqRv_4nlt-3" value="cd:Copper" style="rounded=0;whiteSpace=wrap;html=1;snapToPoint=1;points=[[0.1,0],[0.2,0],[0.3,0],[0.4,0],[0.5,0],[0.6,0],[0.7,0],[0.8,0],[0.9,0],[0,0.1],[0,0.3],[0,0.5],[0,0.7],[0,0.9],[0.1,1],[0.2,1],[0.3,1],[0.4,1],[0.5,1],[0.6,1],[0.7,1],[0.8,1],[0.9,1],[1,0.1],[1,0.3],[1,0.5],[1,0.7],[1,0.9]];" parent="1" vertex="1">
          <mxGeometry x="40" y="40" width="120" height="30" as="geometry" />
        </mxCell>
        <mxCell id="thum3a6WnivtqRv_4nlt-4" value="&lt;u&gt;cd:rawCopper&lt;/u&gt;" style="rounded=0;whiteSpace=wrap;html=1;snapToPoint=1;points=[[0.1,0],[0.2,0],[0.3,0],[0.4,0],[0.5,0],[0.6,0],[0.7,0],[0.8,0],[0.9,0],[0,0.1],[0,0.3],[0,0.5],[0,0.7],[0,0.9],[0.1,1],[0.2,1],[0.3,1],[0.4,1],[0.5,1],[0.6,1],[0.7,1],[0.8,1],[0.9,1],[1,0.1],[1,0.3],[1,0.5],[1,0.7],[1,0.9]];" parent="1" vertex="1">
          <mxGeometry x="40" y="120" width="120" height="30" as="geometry" />
        </mxCell>
        <mxCell id="thum3a6WnivtqRv_4nlt-5" value="" style="endArrow=open;html=1;fontColor=#000099;endFill=0;dashed=1;entryX=0.5;entryY=1;entryDx=0;entryDy=0;endSize=8;exitX=0.5;exitY=0;exitDx=0;exitDy=0;rounded=0;" parent="1" source="thum3a6WnivtqRv_4nlt-8" target="thum3a6WnivtqRv_4nlt-7" edge="1">
          <mxGeometry width="50" height="50" relative="1" as="geometry">
            <mxPoint x="90" y="390" as="sourcePoint" />
            <mxPoint x="-37.00000000001069" y="320" as="targetPoint" />
          </mxGeometry>
        </mxCell>
        <mxCell id="thum3a6WnivtqRv_4nlt-6" value="&amp;lt;&amp;lt;rdf:type&amp;gt;&amp;gt;" style="text;html=1;align=center;verticalAlign=middle;resizable=0;points=[];fontColor=#000000;labelBackgroundColor=#ffffff;" parent="thum3a6WnivtqRv_4nlt-5" vertex="1" connectable="0">
          <mxGeometry x="-0.3277" relative="1" as="geometry">
            <mxPoint y="-7" as="offset" />
          </mxGeometry>
        </mxCell>
        <mxCell id="thum3a6WnivtqRv_4nlt-7" value="cd:Zinc" style="rounded=0;whiteSpace=wrap;html=1;snapToPoint=1;points=[[0.1,0],[0.2,0],[0.3,0],[0.4,0],[0.5,0],[0.6,0],[0.7,0],[0.8,0],[0.9,0],[0,0.1],[0,0.3],[0,0.5],[0,0.7],[0,0.9],[0.1,1],[0.2,1],[0.3,1],[0.4,1],[0.5,1],[0.6,1],[0.7,1],[0.8,1],[0.9,1],[1,0.1],[1,0.3],[1,0.5],[1,0.7],[1,0.9]];" parent="1" vertex="1">
          <mxGeometry x="40" y="280" width="120" height="30" as="geometry" />
        </mxCell>
        <mxCell id="thum3a6WnivtqRv_4nlt-8" value="&lt;u&gt;cd:rawZinc&lt;/u&gt;" style="rounded=0;whiteSpace=wrap;html=1;snapToPoint=1;points=[[0.1,0],[0.2,0],[0.3,0],[0.4,0],[0.5,0],[0.6,0],[0.7,0],[0.8,0],[0.9,0],[0,0.1],[0,0.3],[0,0.5],[0,0.7],[0,0.9],[0.1,1],[0.2,1],[0.3,1],[0.4,1],[0.5,1],[0.6,1],[0.7,1],[0.8,1],[0.9,1],[1,0.1],[1,0.3],[1,0.5],[1,0.7],[1,0.9]];" parent="1" vertex="1">
          <mxGeometry x="40" y="360" width="120" height="30" as="geometry" />
        </mxCell>
        <mxCell id="thum3a6WnivtqRv_4nlt-43" value="" style="endArrow=open;html=1;fontColor=#000099;endFill=0;dashed=1;entryX=0.5;entryY=1;entryDx=0;entryDy=0;endSize=8;exitX=0.5;exitY=0;exitDx=0;exitDy=0;rounded=0;" parent="1" source="thum3a6WnivtqRv_4nlt-46" target="thum3a6WnivtqRv_4nlt-45" edge="1">
          <mxGeometry width="50" height="50" relative="1" as="geometry">
            <mxPoint x="90" y="630" as="sourcePoint" />
            <mxPoint x="-37.00000000001069" y="560" as="targetPoint" />
          </mxGeometry>
        </mxCell>
        <mxCell id="thum3a6WnivtqRv_4nlt-44" value="&amp;lt;&amp;lt;rdf:type&amp;gt;&amp;gt;" style="text;html=1;align=center;verticalAlign=middle;resizable=0;points=[];fontColor=#000000;labelBackgroundColor=#ffffff;" parent="thum3a6WnivtqRv_4nlt-43" vertex="1" connectable="0">
          <mxGeometry x="-0.3277" relative="1" as="geometry">
            <mxPoint y="-7" as="offset" />
          </mxGeometry>
        </mxCell>
        <mxCell id="thum3a6WnivtqRv_4nlt-45" value="cd:Iron" style="rounded=0;whiteSpace=wrap;html=1;snapToPoint=1;points=[[0.1,0],[0.2,0],[0.3,0],[0.4,0],[0.5,0],[0.6,0],[0.7,0],[0.8,0],[0.9,0],[0,0.1],[0,0.3],[0,0.5],[0,0.7],[0,0.9],[0.1,1],[0.2,1],[0.3,1],[0.4,1],[0.5,1],[0.6,1],[0.7,1],[0.8,1],[0.9,1],[1,0.1],[1,0.3],[1,0.5],[1,0.7],[1,0.9]];" parent="1" vertex="1">
          <mxGeometry x="40" y="520" width="120" height="30" as="geometry" />
        </mxCell>
        <mxCell id="thum3a6WnivtqRv_4nlt-46" value="&lt;u&gt;cd:rawIron&lt;/u&gt;" style="rounded=0;whiteSpace=wrap;html=1;snapToPoint=1;points=[[0.1,0],[0.2,0],[0.3,0],[0.4,0],[0.5,0],[0.6,0],[0.7,0],[0.8,0],[0.9,0],[0,0.1],[0,0.3],[0,0.5],[0,0.7],[0,0.9],[0.1,1],[0.2,1],[0.3,1],[0.4,1],[0.5,1],[0.6,1],[0.7,1],[0.8,1],[0.9,1],[1,0.1],[1,0.3],[1,0.5],[1,0.7],[1,0.9]];" parent="1" vertex="1">
          <mxGeometry x="40" y="600" width="120" height="30" as="geometry" />
        </mxCell>
        <mxCell id="thum3a6WnivtqRv_4nlt-64" value="&lt;u&gt;cd:specimen1&lt;/u&gt;" style="rounded=0;whiteSpace=wrap;html=1;snapToPoint=1;points=[[0.1,0],[0.2,0],[0.3,0],[0.4,0],[0.5,0],[0.6,0],[0.7,0],[0.8,0],[0.9,0],[0,0.1],[0,0.3],[0,0.5],[0,0.7],[0,0.9],[0.1,1],[0.2,1],[0.3,1],[0.4,1],[0.5,1],[0.6,1],[0.7,1],[0.8,1],[0.9,1],[1,0.1],[1,0.3],[1,0.5],[1,0.7],[1,0.9]];" parent="1" vertex="1">
          <mxGeometry x="360" y="360" width="120" height="30" as="geometry" />
        </mxCell>
        <mxCell id="thum3a6WnivtqRv_4nlt-65" value="" style="endArrow=classic;html=1;endSize=8;arcSize=0;rounded=0;" parent="1" source="thum3a6WnivtqRv_4nlt-64" target="thum3a6WnivtqRv_4nlt-4" edge="1">
          <mxGeometry width="50" height="50" relative="1" as="geometry">
            <mxPoint x="-110" y="385" as="sourcePoint" />
            <mxPoint x="50" y="385" as="targetPoint" />
          </mxGeometry>
        </mxCell>
        <mxCell id="thum3a6WnivtqRv_4nlt-66" value="prov:wasDerivedFrom" style="text;html=1;align=center;verticalAlign=middle;resizable=0;points=[];labelBackgroundColor=#ffffff;" parent="thum3a6WnivtqRv_4nlt-65" vertex="1" connectable="0">
          <mxGeometry x="-0.1269" relative="1" as="geometry">
            <mxPoint x="-27" y="-53" as="offset" />
          </mxGeometry>
        </mxCell>
        <mxCell id="thum3a6WnivtqRv_4nlt-67" value="" style="endArrow=classic;html=1;endSize=8;arcSize=0;rounded=0;" parent="1" source="thum3a6WnivtqRv_4nlt-64" target="thum3a6WnivtqRv_4nlt-8" edge="1">
          <mxGeometry width="50" height="50" relative="1" as="geometry">
            <mxPoint x="338" y="370" as="sourcePoint" />
            <mxPoint x="122" y="160" as="targetPoint" />
          </mxGeometry>
        </mxCell>
        <mxCell id="thum3a6WnivtqRv_4nlt-68" value="prov:wasDerivedFrom" style="text;html=1;align=center;verticalAlign=middle;resizable=0;points=[];labelBackgroundColor=#ffffff;" parent="thum3a6WnivtqRv_4nlt-67" vertex="1" connectable="0">
          <mxGeometry x="-0.1269" relative="1" as="geometry">
            <mxPoint x="-13" y="-15" as="offset" />
          </mxGeometry>
        </mxCell>
        <mxCell id="thum3a6WnivtqRv_4nlt-69" value="" style="endArrow=classic;html=1;endSize=8;arcSize=0;rounded=0;" parent="1" source="thum3a6WnivtqRv_4nlt-64" target="thum3a6WnivtqRv_4nlt-46" edge="1">
          <mxGeometry width="50" height="50" relative="1" as="geometry">
            <mxPoint x="290" y="385" as="sourcePoint" />
            <mxPoint x="170" y="385" as="targetPoint" />
          </mxGeometry>
        </mxCell>
        <mxCell id="thum3a6WnivtqRv_4nlt-70" value="prov:wasDerivedFrom" style="text;html=1;align=center;verticalAlign=middle;resizable=0;points=[];labelBackgroundColor=#ffffff;" parent="thum3a6WnivtqRv_4nlt-69" vertex="1" connectable="0">
          <mxGeometry x="-0.1269" relative="1" as="geometry">
            <mxPoint x="-27" y="-12" as="offset" />
          </mxGeometry>
        </mxCell>
        <mxCell id="thum3a6WnivtqRv_4nlt-71" value="&lt;u&gt;cd:castingSpecimen&lt;/u&gt;" style="rounded=0;whiteSpace=wrap;html=1;snapToPoint=1;points=[[0.1,0],[0.2,0],[0.3,0],[0.4,0],[0.5,0],[0.6,0],[0.7,0],[0.8,0],[0.9,0],[0,0.1],[0,0.3],[0,0.5],[0,0.7],[0,0.9],[0.1,1],[0.2,1],[0.3,1],[0.4,1],[0.5,1],[0.6,1],[0.7,1],[0.8,1],[0.9,1],[1,0.1],[1,0.3],[1,0.5],[1,0.7],[1,0.9]];" parent="1" vertex="1">
          <mxGeometry x="340" y="800" width="160" height="30" as="geometry" />
        </mxCell>
        <mxCell id="thum3a6WnivtqRv_4nlt-72" value="" style="endArrow=classic;html=1;endSize=8;arcSize=0;rounded=0;" parent="1" source="thum3a6WnivtqRv_4nlt-64" target="thum3a6WnivtqRv_4nlt-71" edge="1">
          <mxGeometry width="50" height="50" relative="1" as="geometry">
            <mxPoint x="406" y="370" as="sourcePoint" />
            <mxPoint x="134" y="160" as="targetPoint" />
          </mxGeometry>
        </mxCell>
        <mxCell id="thum3a6WnivtqRv_4nlt-73" value="prov:wasGeneratedBy" style="text;html=1;align=center;verticalAlign=middle;resizable=0;points=[];labelBackgroundColor=#ffffff;" parent="thum3a6WnivtqRv_4nlt-72" vertex="1" connectable="0">
          <mxGeometry x="-0.1269" relative="1" as="geometry">
            <mxPoint x="10" y="-15" as="offset" />
          </mxGeometry>
        </mxCell>
        <mxCell id="thum3a6WnivtqRv_4nlt-74" value="" style="endArrow=open;html=1;fontColor=#000099;endFill=0;dashed=1;endSize=8;rounded=0;" parent="1" source="thum3a6WnivtqRv_4nlt-71" target="thum3a6WnivtqRv_4nlt-76" edge="1">
          <mxGeometry width="50" height="50" relative="1" as="geometry">
            <mxPoint x="420" y="800" as="sourcePoint" />
            <mxPoint x="282.9999999999893" y="760" as="targetPoint" />
          </mxGeometry>
        </mxCell>
        <mxCell id="thum3a6WnivtqRv_4nlt-75" value="&amp;lt;&amp;lt;rdf:type&amp;gt;&amp;gt;" style="text;html=1;align=center;verticalAlign=middle;resizable=0;points=[];fontColor=#000000;labelBackgroundColor=#ffffff;" parent="thum3a6WnivtqRv_4nlt-74" vertex="1" connectable="0">
          <mxGeometry x="-0.3277" relative="1" as="geometry">
            <mxPoint y="-7" as="offset" />
          </mxGeometry>
        </mxCell>
        <mxCell id="thum3a6WnivtqRv_4nlt-76" value="cd:ContinuousCasting" style="rounded=0;whiteSpace=wrap;html=1;snapToPoint=1;points=[[0.1,0],[0.2,0],[0.3,0],[0.4,0],[0.5,0],[0.6,0],[0.7,0],[0.8,0],[0.9,0],[0,0.1],[0,0.3],[0,0.5],[0,0.7],[0,0.9],[0.1,1],[0.2,1],[0.3,1],[0.4,1],[0.5,1],[0.6,1],[0.7,1],[0.8,1],[0.9,1],[1,0.1],[1,0.3],[1,0.5],[1,0.7],[1,0.9]];" parent="1" vertex="1">
          <mxGeometry x="240" y="880" width="160" height="30" as="geometry" />
        </mxCell>
        <mxCell id="thum3a6WnivtqRv_4nlt-79" value="&lt;u&gt;cd:castingMachine&lt;/u&gt;" style="rounded=0;whiteSpace=wrap;html=1;snapToPoint=1;points=[[0.1,0],[0.2,0],[0.3,0],[0.4,0],[0.5,0],[0.6,0],[0.7,0],[0.8,0],[0.9,0],[0,0.1],[0,0.3],[0,0.5],[0,0.7],[0,0.9],[0.1,1],[0.2,1],[0.3,1],[0.4,1],[0.5,1],[0.6,1],[0.7,1],[0.8,1],[0.9,1],[1,0.1],[1,0.3],[1,0.5],[1,0.7],[1,0.9]];" parent="1" vertex="1">
          <mxGeometry x="440" y="880" width="160" height="30" as="geometry" />
        </mxCell>
        <mxCell id="thum3a6WnivtqRv_4nlt-80" value="" style="endArrow=classic;html=1;endSize=8;arcSize=0;rounded=0;" parent="1" source="thum3a6WnivtqRv_4nlt-79" target="thum3a6WnivtqRv_4nlt-71" edge="1">
          <mxGeometry width="50" height="50" relative="1" as="geometry">
            <mxPoint x="686" y="1130" as="sourcePoint" />
            <mxPoint x="660" y="770" as="targetPoint" />
          </mxGeometry>
        </mxCell>
        <mxCell id="thum3a6WnivtqRv_4nlt-81" value="prov:used" style="text;html=1;align=center;verticalAlign=middle;resizable=0;points=[];labelBackgroundColor=#ffffff;" parent="thum3a6WnivtqRv_4nlt-80" vertex="1" connectable="0">
          <mxGeometry x="-0.1269" relative="1" as="geometry">
            <mxPoint x="-8" y="-15" as="offset" />
          </mxGeometry>
        </mxCell>
        <mxCell id="qVxClGcw8zsn1alDIrxu-1" value="cd:CopperAlloy" style="rounded=0;whiteSpace=wrap;html=1;snapToPoint=1;points=[[0.1,0],[0.2,0],[0.3,0],[0.4,0],[0.5,0],[0.6,0],[0.7,0],[0.8,0],[0.9,0],[0,0.1],[0,0.3],[0,0.5],[0,0.7],[0,0.9],[0.1,1],[0.2,1],[0.3,1],[0.4,1],[0.5,1],[0.6,1],[0.7,1],[0.8,1],[0.9,1],[1,0.1],[1,0.3],[1,0.5],[1,0.7],[1,0.9]];" parent="1" vertex="1">
          <mxGeometry x="360" y="280.00000000000034" width="120" height="30" as="geometry" />
        </mxCell>
        <mxCell id="qVxClGcw8zsn1alDIrxu-2" value="" style="endArrow=open;html=1;fontColor=#000099;endFill=0;dashed=1;endSize=8;rounded=0;" parent="1" source="thum3a6WnivtqRv_4nlt-64" target="qVxClGcw8zsn1alDIrxu-1" edge="1">
          <mxGeometry width="50" height="50" relative="1" as="geometry">
            <mxPoint x="362" y="385" as="sourcePoint" />
            <mxPoint x="400" y="285" as="targetPoint" />
          </mxGeometry>
        </mxCell>
        <mxCell id="qVxClGcw8zsn1alDIrxu-3" value="&amp;lt;&amp;lt;rdf:type&amp;gt;&amp;gt;" style="text;html=1;align=center;verticalAlign=middle;resizable=0;points=[];fontColor=#000000;labelBackgroundColor=#ffffff;" parent="qVxClGcw8zsn1alDIrxu-2" vertex="1" connectable="0">
          <mxGeometry x="-0.3277" relative="1" as="geometry">
            <mxPoint y="-7" as="offset" />
          </mxGeometry>
        </mxCell>
        <mxCell id="oHHtFG8omZQ2E7RLEWF8-1" value="&lt;div&gt;&lt;b&gt;ckan&lt;/b&gt;:&amp;nbsp;http://139.18.211.135:5001/dataset/&lt;/div&gt;&lt;div&gt;&lt;b&gt;cd: &lt;/b&gt;https://kupferdigital.gitlab.io/ontologies/copper#&lt;br&gt;&lt;/div&gt;&lt;div&gt;&lt;b&gt;om:&lt;/b&gt;&amp;nbsp;http://www.ontology-of-units-of-measure.org/resource/om-2/&lt;br&gt;&lt;/div&gt;&lt;div&gt;&lt;b&gt;dcat:&lt;/b&gt;&amp;nbsp;http://www.w3.org/ns/dcat#&lt;/div&gt;&lt;div&gt;&lt;div&gt;&lt;b&gt;prov: &lt;/b&gt;http://www.w3.org/ns/prov#&lt;/div&gt;&lt;/div&gt;" style="shape=note;whiteSpace=wrap;html=1;backgroundOutline=1;darkOpacity=0.05;" parent="1" vertex="1">
          <mxGeometry x="-330" y="940" width="450" height="100" as="geometry" />
        </mxCell>
        <mxCell id="SW69Wv2g0n2l0y70cjte-1" value="&lt;u&gt;cd:specimen2&lt;/u&gt;" style="rounded=0;whiteSpace=wrap;html=1;snapToPoint=1;points=[[0.1,0],[0.2,0],[0.3,0],[0.4,0],[0.5,0],[0.6,0],[0.7,0],[0.8,0],[0.9,0],[0,0.1],[0,0.3],[0,0.5],[0,0.7],[0,0.9],[0.1,1],[0.2,1],[0.3,1],[0.4,1],[0.5,1],[0.6,1],[0.7,1],[0.8,1],[0.9,1],[1,0.1],[1,0.3],[1,0.5],[1,0.7],[1,0.9]];" vertex="1" parent="1">
          <mxGeometry x="800" y="360" width="120" height="30" as="geometry" />
        </mxCell>
        <mxCell id="SW69Wv2g0n2l0y70cjte-2" value="cd:CopperAlloy" style="rounded=0;whiteSpace=wrap;html=1;snapToPoint=1;points=[[0.1,0],[0.2,0],[0.3,0],[0.4,0],[0.5,0],[0.6,0],[0.7,0],[0.8,0],[0.9,0],[0,0.1],[0,0.3],[0,0.5],[0,0.7],[0,0.9],[0.1,1],[0.2,1],[0.3,1],[0.4,1],[0.5,1],[0.6,1],[0.7,1],[0.8,1],[0.9,1],[1,0.1],[1,0.3],[1,0.5],[1,0.7],[1,0.9]];" vertex="1" parent="1">
          <mxGeometry x="720" y="240.00000000000034" width="120" height="30" as="geometry" />
        </mxCell>
        <mxCell id="SW69Wv2g0n2l0y70cjte-3" value="" style="endArrow=open;html=1;fontColor=#000099;endFill=0;dashed=1;endSize=8;rounded=0;" edge="1" parent="1" source="SW69Wv2g0n2l0y70cjte-1" target="SW69Wv2g0n2l0y70cjte-2">
          <mxGeometry width="50" height="50" relative="1" as="geometry">
            <mxPoint x="780" y="320" as="sourcePoint" />
            <mxPoint x="760" y="245" as="targetPoint" />
          </mxGeometry>
        </mxCell>
        <mxCell id="SW69Wv2g0n2l0y70cjte-4" value="&amp;lt;&amp;lt;rdf:type&amp;gt;&amp;gt;" style="text;html=1;align=center;verticalAlign=middle;resizable=0;points=[];fontColor=#000000;labelBackgroundColor=#ffffff;" vertex="1" connectable="0" parent="SW69Wv2g0n2l0y70cjte-3">
          <mxGeometry x="-0.3277" relative="1" as="geometry">
            <mxPoint y="-7" as="offset" />
          </mxGeometry>
        </mxCell>
        <mxCell id="SW69Wv2g0n2l0y70cjte-5" value="" style="endArrow=classic;html=1;endSize=8;arcSize=0;rounded=0;" edge="1" parent="1" source="SW69Wv2g0n2l0y70cjte-1" target="thum3a6WnivtqRv_4nlt-64">
          <mxGeometry width="50" height="50" relative="1" as="geometry">
            <mxPoint x="370" y="385" as="sourcePoint" />
            <mxPoint x="170" y="385" as="targetPoint" />
          </mxGeometry>
        </mxCell>
        <mxCell id="SW69Wv2g0n2l0y70cjte-6" value="prov:wasDerivedFrom" style="text;html=1;align=center;verticalAlign=middle;resizable=0;points=[];labelBackgroundColor=#ffffff;" vertex="1" connectable="0" parent="SW69Wv2g0n2l0y70cjte-5">
          <mxGeometry x="-0.1269" relative="1" as="geometry">
            <mxPoint x="-13" y="-15" as="offset" />
          </mxGeometry>
        </mxCell>
        <mxCell id="SW69Wv2g0n2l0y70cjte-7" value="cd:Sheet" style="rounded=0;whiteSpace=wrap;html=1;snapToPoint=1;points=[[0.1,0],[0.2,0],[0.3,0],[0.4,0],[0.5,0],[0.6,0],[0.7,0],[0.8,0],[0.9,0],[0,0.1],[0,0.3],[0,0.5],[0,0.7],[0,0.9],[0.1,1],[0.2,1],[0.3,1],[0.4,1],[0.5,1],[0.6,1],[0.7,1],[0.8,1],[0.9,1],[1,0.1],[1,0.3],[1,0.5],[1,0.7],[1,0.9]];" vertex="1" parent="1">
          <mxGeometry x="880" y="240.00000000000034" width="120" height="30" as="geometry" />
        </mxCell>
        <mxCell id="SW69Wv2g0n2l0y70cjte-8" value="" style="endArrow=open;html=1;fontColor=#000099;endFill=0;dashed=1;endSize=8;rounded=0;" edge="1" parent="1" target="SW69Wv2g0n2l0y70cjte-7" source="SW69Wv2g0n2l0y70cjte-1">
          <mxGeometry width="50" height="50" relative="1" as="geometry">
            <mxPoint x="940" y="320" as="sourcePoint" />
            <mxPoint x="920" y="245" as="targetPoint" />
          </mxGeometry>
        </mxCell>
        <mxCell id="SW69Wv2g0n2l0y70cjte-9" value="&amp;lt;&amp;lt;rdf:type&amp;gt;&amp;gt;" style="text;html=1;align=center;verticalAlign=middle;resizable=0;points=[];fontColor=#000000;labelBackgroundColor=#ffffff;" vertex="1" connectable="0" parent="SW69Wv2g0n2l0y70cjte-8">
          <mxGeometry x="-0.3277" relative="1" as="geometry">
            <mxPoint y="-7" as="offset" />
          </mxGeometry>
        </mxCell>
        <mxCell id="SW69Wv2g0n2l0y70cjte-11" value="&lt;u&gt;cd:cutSpecimen&lt;/u&gt;" style="rounded=0;whiteSpace=wrap;html=1;snapToPoint=1;points=[[0.1,0],[0.2,0],[0.3,0],[0.4,0],[0.5,0],[0.6,0],[0.7,0],[0.8,0],[0.9,0],[0,0.1],[0,0.3],[0,0.5],[0,0.7],[0,0.9],[0.1,1],[0.2,1],[0.3,1],[0.4,1],[0.5,1],[0.6,1],[0.7,1],[0.8,1],[0.9,1],[1,0.1],[1,0.3],[1,0.5],[1,0.7],[1,0.9]];" vertex="1" parent="1">
          <mxGeometry x="780" y="800" width="160" height="30" as="geometry" />
        </mxCell>
        <mxCell id="SW69Wv2g0n2l0y70cjte-12" value="" style="endArrow=classic;html=1;endSize=8;arcSize=0;rounded=0;" edge="1" parent="1" source="SW69Wv2g0n2l0y70cjte-1" target="SW69Wv2g0n2l0y70cjte-11">
          <mxGeometry width="50" height="50" relative="1" as="geometry">
            <mxPoint x="860" y="390" as="sourcePoint" />
            <mxPoint x="574" y="160" as="targetPoint" />
          </mxGeometry>
        </mxCell>
        <mxCell id="SW69Wv2g0n2l0y70cjte-13" value="prov:wasGeneratedBy" style="text;html=1;align=center;verticalAlign=middle;resizable=0;points=[];labelBackgroundColor=#ffffff;" vertex="1" connectable="0" parent="SW69Wv2g0n2l0y70cjte-12">
          <mxGeometry x="-0.1269" relative="1" as="geometry">
            <mxPoint x="10" y="-15" as="offset" />
          </mxGeometry>
        </mxCell>
        <mxCell id="SW69Wv2g0n2l0y70cjte-14" value="" style="endArrow=open;html=1;fontColor=#000099;endFill=0;dashed=1;endSize=8;rounded=0;" edge="1" parent="1" source="SW69Wv2g0n2l0y70cjte-11" target="SW69Wv2g0n2l0y70cjte-16">
          <mxGeometry width="50" height="50" relative="1" as="geometry">
            <mxPoint x="860" y="800" as="sourcePoint" />
            <mxPoint x="722.9999999999893" y="760" as="targetPoint" />
          </mxGeometry>
        </mxCell>
        <mxCell id="SW69Wv2g0n2l0y70cjte-15" value="&amp;lt;&amp;lt;rdf:type&amp;gt;&amp;gt;" style="text;html=1;align=center;verticalAlign=middle;resizable=0;points=[];fontColor=#000000;labelBackgroundColor=#ffffff;" vertex="1" connectable="0" parent="SW69Wv2g0n2l0y70cjte-14">
          <mxGeometry x="-0.3277" relative="1" as="geometry">
            <mxPoint y="-7" as="offset" />
          </mxGeometry>
        </mxCell>
        <mxCell id="SW69Wv2g0n2l0y70cjte-16" value="cd:Cut" style="rounded=0;whiteSpace=wrap;html=1;snapToPoint=1;points=[[0.1,0],[0.2,0],[0.3,0],[0.4,0],[0.5,0],[0.6,0],[0.7,0],[0.8,0],[0.9,0],[0,0.1],[0,0.3],[0,0.5],[0,0.7],[0,0.9],[0.1,1],[0.2,1],[0.3,1],[0.4,1],[0.5,1],[0.6,1],[0.7,1],[0.8,1],[0.9,1],[1,0.1],[1,0.3],[1,0.5],[1,0.7],[1,0.9]];" vertex="1" parent="1">
          <mxGeometry x="680" y="880" width="160" height="30" as="geometry" />
        </mxCell>
        <mxCell id="SW69Wv2g0n2l0y70cjte-17" value="&lt;u&gt;cd:cuttingMachine&lt;/u&gt;" style="rounded=0;whiteSpace=wrap;html=1;snapToPoint=1;points=[[0.1,0],[0.2,0],[0.3,0],[0.4,0],[0.5,0],[0.6,0],[0.7,0],[0.8,0],[0.9,0],[0,0.1],[0,0.3],[0,0.5],[0,0.7],[0,0.9],[0.1,1],[0.2,1],[0.3,1],[0.4,1],[0.5,1],[0.6,1],[0.7,1],[0.8,1],[0.9,1],[1,0.1],[1,0.3],[1,0.5],[1,0.7],[1,0.9]];" vertex="1" parent="1">
          <mxGeometry x="880" y="880" width="160" height="30" as="geometry" />
        </mxCell>
        <mxCell id="SW69Wv2g0n2l0y70cjte-18" value="" style="endArrow=classic;html=1;endSize=8;arcSize=0;rounded=0;" edge="1" parent="1" source="SW69Wv2g0n2l0y70cjte-17" target="SW69Wv2g0n2l0y70cjte-11">
          <mxGeometry width="50" height="50" relative="1" as="geometry">
            <mxPoint x="1126" y="1130" as="sourcePoint" />
            <mxPoint x="1100" y="770" as="targetPoint" />
          </mxGeometry>
        </mxCell>
        <mxCell id="SW69Wv2g0n2l0y70cjte-19" value="prov:used" style="text;html=1;align=center;verticalAlign=middle;resizable=0;points=[];labelBackgroundColor=#ffffff;" vertex="1" connectable="0" parent="SW69Wv2g0n2l0y70cjte-18">
          <mxGeometry x="-0.1269" relative="1" as="geometry">
            <mxPoint x="-8" y="-15" as="offset" />
          </mxGeometry>
        </mxCell>
        <object label="CKAN" id="SW69Wv2g0n2l0y70cjte-20">
          <mxCell parent="0" />
        </object>
        <mxCell id="thum3a6WnivtqRv_4nlt-146" value="&lt;u&gt;ckan:comlog-continuous-casting&lt;/u&gt;" style="rounded=0;whiteSpace=wrap;html=1;snapToPoint=1;points=[[0.1,0],[0.2,0],[0.3,0],[0.4,0],[0.5,0],[0.6,0],[0.7,0],[0.8,0],[0.9,0],[0,0.1],[0,0.3],[0,0.5],[0,0.7],[0,0.9],[0.1,1],[0.2,1],[0.3,1],[0.4,1],[0.5,1],[0.6,1],[0.7,1],[0.8,1],[0.9,1],[1,0.1],[1,0.3],[1,0.5],[1,0.7],[1,0.9]];" parent="SW69Wv2g0n2l0y70cjte-20" vertex="1">
          <mxGeometry x="-140" y="800" width="300" height="30" as="geometry" />
        </mxCell>
        <mxCell id="thum3a6WnivtqRv_4nlt-77" value="" style="endArrow=classic;html=1;endSize=8;arcSize=0;rounded=0;" parent="SW69Wv2g0n2l0y70cjte-20" source="thum3a6WnivtqRv_4nlt-146" target="thum3a6WnivtqRv_4nlt-71" edge="1">
          <mxGeometry width="50" height="50" relative="1" as="geometry">
            <mxPoint x="746" y="750" as="sourcePoint" />
            <mxPoint x="1111" y="280" as="targetPoint" />
          </mxGeometry>
        </mxCell>
        <mxCell id="thum3a6WnivtqRv_4nlt-78" value="prov:wasGeneratedBy" style="text;html=1;align=center;verticalAlign=middle;resizable=0;points=[];labelBackgroundColor=#ffffff;" parent="thum3a6WnivtqRv_4nlt-77" vertex="1" connectable="0">
          <mxGeometry x="-0.1269" relative="1" as="geometry">
            <mxPoint y="2" as="offset" />
          </mxGeometry>
        </mxCell>
        <mxCell id="SW69Wv2g0n2l0y70cjte-21" value="Example" style="locked=1;" parent="0" />
        <mxCell id="thum3a6WnivtqRv_4nlt-9" value="&lt;u&gt;cd:massRawCopper&lt;/u&gt;" style="rounded=0;whiteSpace=wrap;html=1;snapToPoint=1;points=[[0.1,0],[0.2,0],[0.3,0],[0.4,0],[0.5,0],[0.6,0],[0.7,0],[0.8,0],[0.9,0],[0,0.1],[0,0.3],[0,0.5],[0,0.7],[0,0.9],[0.1,1],[0.2,1],[0.3,1],[0.4,1],[0.5,1],[0.6,1],[0.7,1],[0.8,1],[0.9,1],[1,0.1],[1,0.3],[1,0.5],[1,0.7],[1,0.9]];" parent="SW69Wv2g0n2l0y70cjte-21" vertex="1">
          <mxGeometry x="-280" y="120" width="160" height="30" as="geometry" />
        </mxCell>
        <mxCell id="thum3a6WnivtqRv_4nlt-10" value="om:Mass" style="rounded=0;whiteSpace=wrap;html=1;snapToPoint=1;points=[[0.1,0],[0.2,0],[0.3,0],[0.4,0],[0.5,0],[0.6,0],[0.7,0],[0.8,0],[0.9,0],[0,0.1],[0,0.3],[0,0.5],[0,0.7],[0,0.9],[0.1,1],[0.2,1],[0.3,1],[0.4,1],[0.5,1],[0.6,1],[0.7,1],[0.8,1],[0.9,1],[1,0.1],[1,0.3],[1,0.5],[1,0.7],[1,0.9]];" parent="SW69Wv2g0n2l0y70cjte-21" vertex="1">
          <mxGeometry x="-260" y="40.00000000000034" width="120" height="30" as="geometry" />
        </mxCell>
        <mxCell id="thum3a6WnivtqRv_4nlt-11" value="" style="endArrow=classic;html=1;endSize=8;arcSize=0;rounded=0;" parent="SW69Wv2g0n2l0y70cjte-21" source="thum3a6WnivtqRv_4nlt-9" target="thum3a6WnivtqRv_4nlt-4" edge="1">
          <mxGeometry width="50" height="50" relative="1" as="geometry">
            <mxPoint x="170" y="-391" as="sourcePoint" />
            <mxPoint x="50" y="-391" as="targetPoint" />
          </mxGeometry>
        </mxCell>
        <mxCell id="thum3a6WnivtqRv_4nlt-12" value="om:hasPhenomenen" style="text;html=1;align=center;verticalAlign=middle;resizable=0;points=[];labelBackgroundColor=#ffffff;" parent="thum3a6WnivtqRv_4nlt-11" vertex="1" connectable="0">
          <mxGeometry x="-0.1269" relative="1" as="geometry">
            <mxPoint x="8" y="-15" as="offset" />
          </mxGeometry>
        </mxCell>
        <mxCell id="thum3a6WnivtqRv_4nlt-13" value="" style="endArrow=open;html=1;fontColor=#000099;endFill=0;dashed=1;endSize=8;rounded=0;" parent="SW69Wv2g0n2l0y70cjte-21" source="thum3a6WnivtqRv_4nlt-9" target="thum3a6WnivtqRv_4nlt-10" edge="1">
          <mxGeometry width="50" height="50" relative="1" as="geometry">
            <mxPoint x="-220" y="85" as="sourcePoint" />
            <mxPoint x="-220" y="45" as="targetPoint" />
          </mxGeometry>
        </mxCell>
        <mxCell id="thum3a6WnivtqRv_4nlt-14" value="&amp;lt;&amp;lt;rdf:type&amp;gt;&amp;gt;" style="text;html=1;align=center;verticalAlign=middle;resizable=0;points=[];fontColor=#000000;labelBackgroundColor=#ffffff;" parent="thum3a6WnivtqRv_4nlt-13" vertex="1" connectable="0">
          <mxGeometry x="-0.3277" relative="1" as="geometry">
            <mxPoint y="-7" as="offset" />
          </mxGeometry>
        </mxCell>
        <mxCell id="thum3a6WnivtqRv_4nlt-15" value="om:Measure" style="rounded=0;whiteSpace=wrap;html=1;snapToPoint=1;points=[[0.1,0],[0.2,0],[0.3,0],[0.4,0],[0.5,0],[0.6,0],[0.7,0],[0.8,0],[0.9,0],[0,0.1],[0,0.3],[0,0.5],[0,0.7],[0,0.9],[0.1,1],[0.2,1],[0.3,1],[0.4,1],[0.5,1],[0.6,1],[0.7,1],[0.8,1],[0.9,1],[1,0.1],[1,0.3],[1,0.5],[1,0.7],[1,0.9]];" parent="SW69Wv2g0n2l0y70cjte-21" vertex="1">
          <mxGeometry x="-540" y="40" width="120" height="30" as="geometry" />
        </mxCell>
        <mxCell id="thum3a6WnivtqRv_4nlt-16" value="" style="endArrow=classic;html=1;endSize=8;arcSize=0;rounded=0;" parent="SW69Wv2g0n2l0y70cjte-21" source="thum3a6WnivtqRv_4nlt-9" target="thum3a6WnivtqRv_4nlt-18" edge="1">
          <mxGeometry width="50" height="50" relative="1" as="geometry">
            <mxPoint x="-280" y="106" as="sourcePoint" />
            <mxPoint x="-400" y="115" as="targetPoint" />
          </mxGeometry>
        </mxCell>
        <mxCell id="thum3a6WnivtqRv_4nlt-17" value="om:hasValue" style="text;html=1;align=center;verticalAlign=middle;resizable=0;points=[];labelBackgroundColor=#ffffff;" parent="thum3a6WnivtqRv_4nlt-16" vertex="1" connectable="0">
          <mxGeometry x="-0.1269" relative="1" as="geometry">
            <mxPoint x="-8" y="-15" as="offset" />
          </mxGeometry>
        </mxCell>
        <mxCell id="thum3a6WnivtqRv_4nlt-18" value="&lt;u&gt;cd:measureRawCopper&lt;/u&gt;" style="rounded=0;whiteSpace=wrap;html=1;snapToPoint=1;points=[[0.1,0],[0.2,0],[0.3,0],[0.4,0],[0.5,0],[0.6,0],[0.7,0],[0.8,0],[0.9,0],[0,0.1],[0,0.3],[0,0.5],[0,0.7],[0,0.9],[0.1,1],[0.2,1],[0.3,1],[0.4,1],[0.5,1],[0.6,1],[0.7,1],[0.8,1],[0.9,1],[1,0.1],[1,0.3],[1,0.5],[1,0.7],[1,0.9]];" parent="SW69Wv2g0n2l0y70cjte-21" vertex="1">
          <mxGeometry x="-560" y="120" width="160" height="30" as="geometry" />
        </mxCell>
        <mxCell id="thum3a6WnivtqRv_4nlt-19" value="" style="endArrow=open;html=1;fontColor=#000099;endFill=0;dashed=1;endSize=8;rounded=0;" parent="SW69Wv2g0n2l0y70cjte-21" source="thum3a6WnivtqRv_4nlt-18" target="thum3a6WnivtqRv_4nlt-15" edge="1">
          <mxGeometry width="50" height="50" relative="1" as="geometry">
            <mxPoint x="110" y="95" as="sourcePoint" />
            <mxPoint x="-230" y="45" as="targetPoint" />
          </mxGeometry>
        </mxCell>
        <mxCell id="thum3a6WnivtqRv_4nlt-20" value="&amp;lt;&amp;lt;rdf:type&amp;gt;&amp;gt;" style="text;html=1;align=center;verticalAlign=middle;resizable=0;points=[];fontColor=#000000;labelBackgroundColor=#ffffff;" parent="thum3a6WnivtqRv_4nlt-19" vertex="1" connectable="0">
          <mxGeometry x="-0.3277" relative="1" as="geometry">
            <mxPoint y="-7" as="offset" />
          </mxGeometry>
        </mxCell>
        <mxCell id="thum3a6WnivtqRv_4nlt-21" value="&quot;0.5&quot;^^xsd:Double" style="rounded=0;whiteSpace=wrap;html=1;snapToPoint=1;" parent="SW69Wv2g0n2l0y70cjte-21" vertex="1">
          <mxGeometry x="-540" y="200" width="120" height="30" as="geometry" />
        </mxCell>
        <mxCell id="thum3a6WnivtqRv_4nlt-22" value="om:hasNumericalValue" style="rounded=0;orthogonalLoop=1;jettySize=auto;html=1;fontSize=12;elbow=vertical;" parent="SW69Wv2g0n2l0y70cjte-21" source="thum3a6WnivtqRv_4nlt-18" target="thum3a6WnivtqRv_4nlt-21" edge="1">
          <mxGeometry relative="1" as="geometry">
            <mxPoint x="-550" y="210" as="sourcePoint" />
          </mxGeometry>
        </mxCell>
        <mxCell id="thum3a6WnivtqRv_4nlt-23" value="" style="endArrow=classic;html=1;endSize=8;arcSize=0;rounded=0;" parent="SW69Wv2g0n2l0y70cjte-21" source="thum3a6WnivtqRv_4nlt-18" target="thum3a6WnivtqRv_4nlt-25" edge="1">
          <mxGeometry width="50" height="50" relative="1" as="geometry">
            <mxPoint x="-300" y="-105" as="sourcePoint" />
            <mxPoint x="-420" y="-255" as="targetPoint" />
          </mxGeometry>
        </mxCell>
        <mxCell id="thum3a6WnivtqRv_4nlt-24" value="om:hasUnit" style="text;html=1;align=center;verticalAlign=middle;resizable=0;points=[];labelBackgroundColor=#ffffff;" parent="thum3a6WnivtqRv_4nlt-23" vertex="1" connectable="0">
          <mxGeometry x="-0.1269" relative="1" as="geometry">
            <mxPoint x="-8" y="-15" as="offset" />
          </mxGeometry>
        </mxCell>
        <mxCell id="thum3a6WnivtqRv_4nlt-25" value="om:kilogram" style="rounded=0;whiteSpace=wrap;html=1;snapToPoint=1;points=[[0.1,0],[0.2,0],[0.3,0],[0.4,0],[0.5,0],[0.6,0],[0.7,0],[0.8,0],[0.9,0],[0,0.1],[0,0.3],[0,0.5],[0,0.7],[0,0.9],[0.1,1],[0.2,1],[0.3,1],[0.4,1],[0.5,1],[0.6,1],[0.7,1],[0.8,1],[0.9,1],[1,0.1],[1,0.3],[1,0.5],[1,0.7],[1,0.9]];" parent="SW69Wv2g0n2l0y70cjte-21" vertex="1">
          <mxGeometry x="-800" y="120.00000000000034" width="120" height="30" as="geometry" />
        </mxCell>
        <mxCell id="thum3a6WnivtqRv_4nlt-26" value="&lt;u&gt;cd:massRawZinc&lt;/u&gt;" style="rounded=0;whiteSpace=wrap;html=1;snapToPoint=1;points=[[0.1,0],[0.2,0],[0.3,0],[0.4,0],[0.5,0],[0.6,0],[0.7,0],[0.8,0],[0.9,0],[0,0.1],[0,0.3],[0,0.5],[0,0.7],[0,0.9],[0.1,1],[0.2,1],[0.3,1],[0.4,1],[0.5,1],[0.6,1],[0.7,1],[0.8,1],[0.9,1],[1,0.1],[1,0.3],[1,0.5],[1,0.7],[1,0.9]];" parent="SW69Wv2g0n2l0y70cjte-21" vertex="1">
          <mxGeometry x="-280" y="360" width="160" height="30" as="geometry" />
        </mxCell>
        <mxCell id="thum3a6WnivtqRv_4nlt-27" value="om:Mass" style="rounded=0;whiteSpace=wrap;html=1;snapToPoint=1;points=[[0.1,0],[0.2,0],[0.3,0],[0.4,0],[0.5,0],[0.6,0],[0.7,0],[0.8,0],[0.9,0],[0,0.1],[0,0.3],[0,0.5],[0,0.7],[0,0.9],[0.1,1],[0.2,1],[0.3,1],[0.4,1],[0.5,1],[0.6,1],[0.7,1],[0.8,1],[0.9,1],[1,0.1],[1,0.3],[1,0.5],[1,0.7],[1,0.9]];" parent="SW69Wv2g0n2l0y70cjte-21" vertex="1">
          <mxGeometry x="-260" y="280.00000000000034" width="120" height="30" as="geometry" />
        </mxCell>
        <mxCell id="thum3a6WnivtqRv_4nlt-28" value="" style="endArrow=classic;html=1;endSize=8;arcSize=0;rounded=0;" parent="SW69Wv2g0n2l0y70cjte-21" source="thum3a6WnivtqRv_4nlt-26" target="thum3a6WnivtqRv_4nlt-8" edge="1">
          <mxGeometry width="50" height="50" relative="1" as="geometry">
            <mxPoint x="170" y="-151" as="sourcePoint" />
            <mxPoint x="60" y="413" as="targetPoint" />
          </mxGeometry>
        </mxCell>
        <mxCell id="thum3a6WnivtqRv_4nlt-29" value="om:hasPhenomenen" style="text;html=1;align=center;verticalAlign=middle;resizable=0;points=[];labelBackgroundColor=#ffffff;" parent="thum3a6WnivtqRv_4nlt-28" vertex="1" connectable="0">
          <mxGeometry x="-0.1269" relative="1" as="geometry">
            <mxPoint x="8" y="-15" as="offset" />
          </mxGeometry>
        </mxCell>
        <mxCell id="thum3a6WnivtqRv_4nlt-30" value="" style="endArrow=open;html=1;fontColor=#000099;endFill=0;dashed=1;endSize=8;rounded=0;" parent="SW69Wv2g0n2l0y70cjte-21" source="thum3a6WnivtqRv_4nlt-26" target="thum3a6WnivtqRv_4nlt-27" edge="1">
          <mxGeometry width="50" height="50" relative="1" as="geometry">
            <mxPoint x="-220" y="325" as="sourcePoint" />
            <mxPoint x="-220" y="285" as="targetPoint" />
          </mxGeometry>
        </mxCell>
        <mxCell id="thum3a6WnivtqRv_4nlt-31" value="&amp;lt;&amp;lt;rdf:type&amp;gt;&amp;gt;" style="text;html=1;align=center;verticalAlign=middle;resizable=0;points=[];fontColor=#000000;labelBackgroundColor=#ffffff;" parent="thum3a6WnivtqRv_4nlt-30" vertex="1" connectable="0">
          <mxGeometry x="-0.3277" relative="1" as="geometry">
            <mxPoint y="-7" as="offset" />
          </mxGeometry>
        </mxCell>
        <mxCell id="thum3a6WnivtqRv_4nlt-32" value="om:Measure" style="rounded=0;whiteSpace=wrap;html=1;snapToPoint=1;points=[[0.1,0],[0.2,0],[0.3,0],[0.4,0],[0.5,0],[0.6,0],[0.7,0],[0.8,0],[0.9,0],[0,0.1],[0,0.3],[0,0.5],[0,0.7],[0,0.9],[0.1,1],[0.2,1],[0.3,1],[0.4,1],[0.5,1],[0.6,1],[0.7,1],[0.8,1],[0.9,1],[1,0.1],[1,0.3],[1,0.5],[1,0.7],[1,0.9]];" parent="SW69Wv2g0n2l0y70cjte-21" vertex="1">
          <mxGeometry x="-540" y="280" width="120" height="30" as="geometry" />
        </mxCell>
        <mxCell id="thum3a6WnivtqRv_4nlt-33" value="" style="endArrow=classic;html=1;endSize=8;arcSize=0;rounded=0;" parent="SW69Wv2g0n2l0y70cjte-21" source="thum3a6WnivtqRv_4nlt-26" target="thum3a6WnivtqRv_4nlt-35" edge="1">
          <mxGeometry width="50" height="50" relative="1" as="geometry">
            <mxPoint x="-280" y="346" as="sourcePoint" />
            <mxPoint x="-400" y="355" as="targetPoint" />
          </mxGeometry>
        </mxCell>
        <mxCell id="thum3a6WnivtqRv_4nlt-34" value="om:hasValue" style="text;html=1;align=center;verticalAlign=middle;resizable=0;points=[];labelBackgroundColor=#ffffff;" parent="thum3a6WnivtqRv_4nlt-33" vertex="1" connectable="0">
          <mxGeometry x="-0.1269" relative="1" as="geometry">
            <mxPoint x="-8" y="-15" as="offset" />
          </mxGeometry>
        </mxCell>
        <mxCell id="thum3a6WnivtqRv_4nlt-35" value="&lt;u&gt;cd:measureRawZinc&lt;/u&gt;" style="rounded=0;whiteSpace=wrap;html=1;snapToPoint=1;points=[[0.1,0],[0.2,0],[0.3,0],[0.4,0],[0.5,0],[0.6,0],[0.7,0],[0.8,0],[0.9,0],[0,0.1],[0,0.3],[0,0.5],[0,0.7],[0,0.9],[0.1,1],[0.2,1],[0.3,1],[0.4,1],[0.5,1],[0.6,1],[0.7,1],[0.8,1],[0.9,1],[1,0.1],[1,0.3],[1,0.5],[1,0.7],[1,0.9]];" parent="SW69Wv2g0n2l0y70cjte-21" vertex="1">
          <mxGeometry x="-560" y="360" width="160" height="30" as="geometry" />
        </mxCell>
        <mxCell id="thum3a6WnivtqRv_4nlt-36" value="" style="endArrow=open;html=1;fontColor=#000099;endFill=0;dashed=1;endSize=8;rounded=0;" parent="SW69Wv2g0n2l0y70cjte-21" source="thum3a6WnivtqRv_4nlt-35" target="thum3a6WnivtqRv_4nlt-32" edge="1">
          <mxGeometry width="50" height="50" relative="1" as="geometry">
            <mxPoint x="110" y="335" as="sourcePoint" />
            <mxPoint x="-230" y="285" as="targetPoint" />
          </mxGeometry>
        </mxCell>
        <mxCell id="thum3a6WnivtqRv_4nlt-37" value="&amp;lt;&amp;lt;rdf:type&amp;gt;&amp;gt;" style="text;html=1;align=center;verticalAlign=middle;resizable=0;points=[];fontColor=#000000;labelBackgroundColor=#ffffff;" parent="thum3a6WnivtqRv_4nlt-36" vertex="1" connectable="0">
          <mxGeometry x="-0.3277" relative="1" as="geometry">
            <mxPoint y="-7" as="offset" />
          </mxGeometry>
        </mxCell>
        <mxCell id="thum3a6WnivtqRv_4nlt-38" value="&quot;0.5&quot;^^xsd:Double" style="rounded=0;whiteSpace=wrap;html=1;snapToPoint=1;" parent="SW69Wv2g0n2l0y70cjte-21" vertex="1">
          <mxGeometry x="-540" y="440" width="120" height="30" as="geometry" />
        </mxCell>
        <mxCell id="thum3a6WnivtqRv_4nlt-39" value="om:hasNumericalValue" style="rounded=0;orthogonalLoop=1;jettySize=auto;html=1;fontSize=12;elbow=vertical;" parent="SW69Wv2g0n2l0y70cjte-21" source="thum3a6WnivtqRv_4nlt-35" target="thum3a6WnivtqRv_4nlt-38" edge="1">
          <mxGeometry relative="1" as="geometry">
            <mxPoint x="-550" y="450" as="sourcePoint" />
          </mxGeometry>
        </mxCell>
        <mxCell id="thum3a6WnivtqRv_4nlt-40" value="" style="endArrow=classic;html=1;endSize=8;arcSize=0;rounded=0;" parent="SW69Wv2g0n2l0y70cjte-21" source="thum3a6WnivtqRv_4nlt-35" target="thum3a6WnivtqRv_4nlt-42" edge="1">
          <mxGeometry width="50" height="50" relative="1" as="geometry">
            <mxPoint x="-300" y="135" as="sourcePoint" />
            <mxPoint x="-420" y="-15" as="targetPoint" />
          </mxGeometry>
        </mxCell>
        <mxCell id="thum3a6WnivtqRv_4nlt-41" value="om:hasUnit" style="text;html=1;align=center;verticalAlign=middle;resizable=0;points=[];labelBackgroundColor=#ffffff;" parent="thum3a6WnivtqRv_4nlt-40" vertex="1" connectable="0">
          <mxGeometry x="-0.1269" relative="1" as="geometry">
            <mxPoint x="-8" y="-15" as="offset" />
          </mxGeometry>
        </mxCell>
        <mxCell id="thum3a6WnivtqRv_4nlt-42" value="om:kilogram" style="rounded=0;whiteSpace=wrap;html=1;snapToPoint=1;points=[[0.1,0],[0.2,0],[0.3,0],[0.4,0],[0.5,0],[0.6,0],[0.7,0],[0.8,0],[0.9,0],[0,0.1],[0,0.3],[0,0.5],[0,0.7],[0,0.9],[0.1,1],[0.2,1],[0.3,1],[0.4,1],[0.5,1],[0.6,1],[0.7,1],[0.8,1],[0.9,1],[1,0.1],[1,0.3],[1,0.5],[1,0.7],[1,0.9]];" parent="SW69Wv2g0n2l0y70cjte-21" vertex="1">
          <mxGeometry x="-800" y="360.00000000000034" width="120" height="30" as="geometry" />
        </mxCell>
        <mxCell id="thum3a6WnivtqRv_4nlt-47" value="&lt;u&gt;cd:massRawIron&lt;/u&gt;" style="rounded=0;whiteSpace=wrap;html=1;snapToPoint=1;points=[[0.1,0],[0.2,0],[0.3,0],[0.4,0],[0.5,0],[0.6,0],[0.7,0],[0.8,0],[0.9,0],[0,0.1],[0,0.3],[0,0.5],[0,0.7],[0,0.9],[0.1,1],[0.2,1],[0.3,1],[0.4,1],[0.5,1],[0.6,1],[0.7,1],[0.8,1],[0.9,1],[1,0.1],[1,0.3],[1,0.5],[1,0.7],[1,0.9]];" parent="SW69Wv2g0n2l0y70cjte-21" vertex="1">
          <mxGeometry x="-280" y="600" width="160" height="30" as="geometry" />
        </mxCell>
        <mxCell id="thum3a6WnivtqRv_4nlt-48" value="om:Mass" style="rounded=0;whiteSpace=wrap;html=1;snapToPoint=1;points=[[0.1,0],[0.2,0],[0.3,0],[0.4,0],[0.5,0],[0.6,0],[0.7,0],[0.8,0],[0.9,0],[0,0.1],[0,0.3],[0,0.5],[0,0.7],[0,0.9],[0.1,1],[0.2,1],[0.3,1],[0.4,1],[0.5,1],[0.6,1],[0.7,1],[0.8,1],[0.9,1],[1,0.1],[1,0.3],[1,0.5],[1,0.7],[1,0.9]];" parent="SW69Wv2g0n2l0y70cjte-21" vertex="1">
          <mxGeometry x="-260" y="520.0000000000003" width="120" height="30" as="geometry" />
        </mxCell>
        <mxCell id="thum3a6WnivtqRv_4nlt-49" value="" style="endArrow=classic;html=1;endSize=8;arcSize=0;rounded=0;" parent="SW69Wv2g0n2l0y70cjte-21" source="thum3a6WnivtqRv_4nlt-47" target="thum3a6WnivtqRv_4nlt-46" edge="1">
          <mxGeometry width="50" height="50" relative="1" as="geometry">
            <mxPoint x="170" y="89" as="sourcePoint" />
            <mxPoint x="60" y="653" as="targetPoint" />
          </mxGeometry>
        </mxCell>
        <mxCell id="thum3a6WnivtqRv_4nlt-50" value="om:hasPhenomenen" style="text;html=1;align=center;verticalAlign=middle;resizable=0;points=[];labelBackgroundColor=#ffffff;" parent="thum3a6WnivtqRv_4nlt-49" vertex="1" connectable="0">
          <mxGeometry x="-0.1269" relative="1" as="geometry">
            <mxPoint x="8" y="-15" as="offset" />
          </mxGeometry>
        </mxCell>
        <mxCell id="thum3a6WnivtqRv_4nlt-51" value="" style="endArrow=open;html=1;fontColor=#000099;endFill=0;dashed=1;endSize=8;rounded=0;" parent="SW69Wv2g0n2l0y70cjte-21" source="thum3a6WnivtqRv_4nlt-47" target="thum3a6WnivtqRv_4nlt-48" edge="1">
          <mxGeometry width="50" height="50" relative="1" as="geometry">
            <mxPoint x="-220" y="565" as="sourcePoint" />
            <mxPoint x="-220" y="525" as="targetPoint" />
          </mxGeometry>
        </mxCell>
        <mxCell id="thum3a6WnivtqRv_4nlt-52" value="&amp;lt;&amp;lt;rdf:type&amp;gt;&amp;gt;" style="text;html=1;align=center;verticalAlign=middle;resizable=0;points=[];fontColor=#000000;labelBackgroundColor=#ffffff;" parent="thum3a6WnivtqRv_4nlt-51" vertex="1" connectable="0">
          <mxGeometry x="-0.3277" relative="1" as="geometry">
            <mxPoint y="-7" as="offset" />
          </mxGeometry>
        </mxCell>
        <mxCell id="thum3a6WnivtqRv_4nlt-53" value="om:Measure" style="rounded=0;whiteSpace=wrap;html=1;snapToPoint=1;points=[[0.1,0],[0.2,0],[0.3,0],[0.4,0],[0.5,0],[0.6,0],[0.7,0],[0.8,0],[0.9,0],[0,0.1],[0,0.3],[0,0.5],[0,0.7],[0,0.9],[0.1,1],[0.2,1],[0.3,1],[0.4,1],[0.5,1],[0.6,1],[0.7,1],[0.8,1],[0.9,1],[1,0.1],[1,0.3],[1,0.5],[1,0.7],[1,0.9]];" parent="SW69Wv2g0n2l0y70cjte-21" vertex="1">
          <mxGeometry x="-540" y="520" width="120" height="30" as="geometry" />
        </mxCell>
        <mxCell id="thum3a6WnivtqRv_4nlt-54" value="" style="endArrow=classic;html=1;endSize=8;arcSize=0;rounded=0;" parent="SW69Wv2g0n2l0y70cjte-21" source="thum3a6WnivtqRv_4nlt-47" target="thum3a6WnivtqRv_4nlt-56" edge="1">
          <mxGeometry width="50" height="50" relative="1" as="geometry">
            <mxPoint x="-280" y="586" as="sourcePoint" />
            <mxPoint x="-400" y="595" as="targetPoint" />
          </mxGeometry>
        </mxCell>
        <mxCell id="thum3a6WnivtqRv_4nlt-55" value="om:hasValue" style="text;html=1;align=center;verticalAlign=middle;resizable=0;points=[];labelBackgroundColor=#ffffff;" parent="thum3a6WnivtqRv_4nlt-54" vertex="1" connectable="0">
          <mxGeometry x="-0.1269" relative="1" as="geometry">
            <mxPoint x="-8" y="-15" as="offset" />
          </mxGeometry>
        </mxCell>
        <mxCell id="thum3a6WnivtqRv_4nlt-56" value="&lt;u&gt;cd:measureRawIron&lt;/u&gt;" style="rounded=0;whiteSpace=wrap;html=1;snapToPoint=1;points=[[0.1,0],[0.2,0],[0.3,0],[0.4,0],[0.5,0],[0.6,0],[0.7,0],[0.8,0],[0.9,0],[0,0.1],[0,0.3],[0,0.5],[0,0.7],[0,0.9],[0.1,1],[0.2,1],[0.3,1],[0.4,1],[0.5,1],[0.6,1],[0.7,1],[0.8,1],[0.9,1],[1,0.1],[1,0.3],[1,0.5],[1,0.7],[1,0.9]];" parent="SW69Wv2g0n2l0y70cjte-21" vertex="1">
          <mxGeometry x="-560" y="600" width="160" height="30" as="geometry" />
        </mxCell>
        <mxCell id="thum3a6WnivtqRv_4nlt-57" value="" style="endArrow=open;html=1;fontColor=#000099;endFill=0;dashed=1;endSize=8;rounded=0;" parent="SW69Wv2g0n2l0y70cjte-21" source="thum3a6WnivtqRv_4nlt-56" target="thum3a6WnivtqRv_4nlt-53" edge="1">
          <mxGeometry width="50" height="50" relative="1" as="geometry">
            <mxPoint x="110" y="575" as="sourcePoint" />
            <mxPoint x="-230" y="525" as="targetPoint" />
          </mxGeometry>
        </mxCell>
        <mxCell id="thum3a6WnivtqRv_4nlt-58" value="&amp;lt;&amp;lt;rdf:type&amp;gt;&amp;gt;" style="text;html=1;align=center;verticalAlign=middle;resizable=0;points=[];fontColor=#000000;labelBackgroundColor=#ffffff;" parent="thum3a6WnivtqRv_4nlt-57" vertex="1" connectable="0">
          <mxGeometry x="-0.3277" relative="1" as="geometry">
            <mxPoint y="-7" as="offset" />
          </mxGeometry>
        </mxCell>
        <mxCell id="thum3a6WnivtqRv_4nlt-59" value="&quot;0.5&quot;^^xsd:Double" style="rounded=0;whiteSpace=wrap;html=1;snapToPoint=1;" parent="SW69Wv2g0n2l0y70cjte-21" vertex="1">
          <mxGeometry x="-540" y="680" width="120" height="30" as="geometry" />
        </mxCell>
        <mxCell id="thum3a6WnivtqRv_4nlt-60" value="om:hasNumericalValue" style="rounded=0;orthogonalLoop=1;jettySize=auto;html=1;fontSize=12;elbow=vertical;" parent="SW69Wv2g0n2l0y70cjte-21" source="thum3a6WnivtqRv_4nlt-56" target="thum3a6WnivtqRv_4nlt-59" edge="1">
          <mxGeometry relative="1" as="geometry">
            <mxPoint x="-550" y="690" as="sourcePoint" />
          </mxGeometry>
        </mxCell>
        <mxCell id="thum3a6WnivtqRv_4nlt-61" value="" style="endArrow=classic;html=1;endSize=8;arcSize=0;rounded=0;" parent="SW69Wv2g0n2l0y70cjte-21" source="thum3a6WnivtqRv_4nlt-56" target="thum3a6WnivtqRv_4nlt-63" edge="1">
          <mxGeometry width="50" height="50" relative="1" as="geometry">
            <mxPoint x="-300" y="375" as="sourcePoint" />
            <mxPoint x="-420" y="225" as="targetPoint" />
          </mxGeometry>
        </mxCell>
        <mxCell id="thum3a6WnivtqRv_4nlt-62" value="om:hasUnit" style="text;html=1;align=center;verticalAlign=middle;resizable=0;points=[];labelBackgroundColor=#ffffff;" parent="thum3a6WnivtqRv_4nlt-61" vertex="1" connectable="0">
          <mxGeometry x="-0.1269" relative="1" as="geometry">
            <mxPoint x="-8" y="-15" as="offset" />
          </mxGeometry>
        </mxCell>
        <mxCell id="thum3a6WnivtqRv_4nlt-63" value="om:kilogram" style="rounded=0;whiteSpace=wrap;html=1;snapToPoint=1;points=[[0.1,0],[0.2,0],[0.3,0],[0.4,0],[0.5,0],[0.6,0],[0.7,0],[0.8,0],[0.9,0],[0,0.1],[0,0.3],[0,0.5],[0,0.7],[0,0.9],[0.1,1],[0.2,1],[0.3,1],[0.4,1],[0.5,1],[0.6,1],[0.7,1],[0.8,1],[0.9,1],[1,0.1],[1,0.3],[1,0.5],[1,0.7],[1,0.9]];" parent="SW69Wv2g0n2l0y70cjte-21" vertex="1">
          <mxGeometry x="-800" y="600.0000000000003" width="120" height="30" as="geometry" />
        </mxCell>
      </root>
    </mxGraphModel>
  </diagram>
  <diagram id="oT1xv9Fzf4wDhgPAqP2W" name="Casting Log">
    <mxGraphModel dx="3076" dy="1004" grid="1" gridSize="10" guides="1" tooltips="1" connect="1" arrows="1" fold="1" page="1" pageScale="1" pageWidth="827" pageHeight="1169" math="0" shadow="0">
      <root>
        <mxCell id="0" />
        <mxCell id="1" parent="0" />
        <mxCell id="ceR-y8-nLFiyuJuDYNRY-1" value="om:Measure" style="rounded=0;whiteSpace=wrap;html=1;snapToPoint=1;points=[[0.1,0],[0.2,0],[0.3,0],[0.4,0],[0.5,0],[0.6,0],[0.7,0],[0.8,0],[0.9,0],[0,0.1],[0,0.3],[0,0.5],[0,0.7],[0,0.9],[0.1,1],[0.2,1],[0.3,1],[0.4,1],[0.5,1],[0.6,1],[0.7,1],[0.8,1],[0.9,1],[1,0.1],[1,0.3],[1,0.5],[1,0.7],[1,0.9]];" vertex="1" parent="1">
          <mxGeometry x="-580" y="1239.9999999999998" width="120" height="30" as="geometry" />
        </mxCell>
        <mxCell id="ceR-y8-nLFiyuJuDYNRY-2" value="" style="endArrow=classic;html=1;endSize=8;arcSize=0;rounded=0;" edge="1" parent="1" source="ceR-y8-nLFiyuJuDYNRY-82" target="ceR-y8-nLFiyuJuDYNRY-4">
          <mxGeometry width="50" height="50" relative="1" as="geometry">
            <mxPoint x="-320" y="1305.9999999999998" as="sourcePoint" />
            <mxPoint x="-440" y="1314.9999999999998" as="targetPoint" />
          </mxGeometry>
        </mxCell>
        <mxCell id="ceR-y8-nLFiyuJuDYNRY-3" value="om:hasValue" style="text;html=1;align=center;verticalAlign=middle;resizable=0;points=[];labelBackgroundColor=#ffffff;" vertex="1" connectable="0" parent="ceR-y8-nLFiyuJuDYNRY-2">
          <mxGeometry x="-0.1269" relative="1" as="geometry">
            <mxPoint x="-8" y="-15" as="offset" />
          </mxGeometry>
        </mxCell>
        <mxCell id="ceR-y8-nLFiyuJuDYNRY-4" value="ex:X" style="rounded=0;whiteSpace=wrap;html=1;snapToPoint=1;points=[[0.1,0],[0.2,0],[0.3,0],[0.4,0],[0.5,0],[0.6,0],[0.7,0],[0.8,0],[0.9,0],[0,0.1],[0,0.3],[0,0.5],[0,0.7],[0,0.9],[0.1,1],[0.2,1],[0.3,1],[0.4,1],[0.5,1],[0.6,1],[0.7,1],[0.8,1],[0.9,1],[1,0.1],[1,0.3],[1,0.5],[1,0.7],[1,0.9]];" vertex="1" parent="1">
          <mxGeometry x="-600" y="1319.9999999999998" width="160" height="30" as="geometry" />
        </mxCell>
        <mxCell id="ceR-y8-nLFiyuJuDYNRY-5" value="" style="endArrow=open;html=1;fontColor=#000099;endFill=0;dashed=1;endSize=8;rounded=0;" edge="1" parent="1" source="ceR-y8-nLFiyuJuDYNRY-4" target="ceR-y8-nLFiyuJuDYNRY-1">
          <mxGeometry width="50" height="50" relative="1" as="geometry">
            <mxPoint x="70" y="1294.9999999999998" as="sourcePoint" />
            <mxPoint x="-270" y="1244.9999999999998" as="targetPoint" />
          </mxGeometry>
        </mxCell>
        <mxCell id="ceR-y8-nLFiyuJuDYNRY-6" value="&amp;lt;&amp;lt;rdf:type&amp;gt;&amp;gt;" style="text;html=1;align=center;verticalAlign=middle;resizable=0;points=[];fontColor=#000000;labelBackgroundColor=#ffffff;" vertex="1" connectable="0" parent="ceR-y8-nLFiyuJuDYNRY-5">
          <mxGeometry x="-0.3277" relative="1" as="geometry">
            <mxPoint y="-7" as="offset" />
          </mxGeometry>
        </mxCell>
        <mxCell id="ceR-y8-nLFiyuJuDYNRY-7" value="&quot;1.0&quot;^^Double" style="rounded=0;whiteSpace=wrap;html=1;snapToPoint=1;" vertex="1" parent="1">
          <mxGeometry x="-580" y="1399.9999999999998" width="120" height="30" as="geometry" />
        </mxCell>
        <mxCell id="ceR-y8-nLFiyuJuDYNRY-8" value="om:hasNumericalValue" style="rounded=0;orthogonalLoop=1;jettySize=auto;html=1;fontSize=12;elbow=vertical;" edge="1" parent="1" source="ceR-y8-nLFiyuJuDYNRY-4" target="ceR-y8-nLFiyuJuDYNRY-7">
          <mxGeometry relative="1" as="geometry">
            <mxPoint x="-590" y="1409.9999999999998" as="sourcePoint" />
          </mxGeometry>
        </mxCell>
        <mxCell id="ceR-y8-nLFiyuJuDYNRY-9" value="" style="endArrow=classic;html=1;endSize=8;arcSize=0;rounded=0;" edge="1" parent="1" source="ceR-y8-nLFiyuJuDYNRY-4" target="ceR-y8-nLFiyuJuDYNRY-11">
          <mxGeometry width="50" height="50" relative="1" as="geometry">
            <mxPoint x="-340" y="1094.9999999999998" as="sourcePoint" />
            <mxPoint x="-460" y="944.9999999999998" as="targetPoint" />
          </mxGeometry>
        </mxCell>
        <mxCell id="ceR-y8-nLFiyuJuDYNRY-10" value="om:hasUnit" style="text;html=1;align=center;verticalAlign=middle;resizable=0;points=[];labelBackgroundColor=#ffffff;" vertex="1" connectable="0" parent="ceR-y8-nLFiyuJuDYNRY-9">
          <mxGeometry x="-0.1269" relative="1" as="geometry">
            <mxPoint x="-8" y="-15" as="offset" />
          </mxGeometry>
        </mxCell>
        <mxCell id="ceR-y8-nLFiyuJuDYNRY-11" value="om:bar" style="rounded=0;whiteSpace=wrap;html=1;snapToPoint=1;points=[[0.1,0],[0.2,0],[0.3,0],[0.4,0],[0.5,0],[0.6,0],[0.7,0],[0.8,0],[0.9,0],[0,0.1],[0,0.3],[0,0.5],[0,0.7],[0,0.9],[0.1,1],[0.2,1],[0.3,1],[0.4,1],[0.5,1],[0.6,1],[0.7,1],[0.8,1],[0.9,1],[1,0.1],[1,0.3],[1,0.5],[1,0.7],[1,0.9]];" vertex="1" parent="1">
          <mxGeometry x="-840" y="1320.0000000000002" width="120" height="30" as="geometry" />
        </mxCell>
        <mxCell id="ceR-y8-nLFiyuJuDYNRY-12" value="om:Measure" style="rounded=0;whiteSpace=wrap;html=1;snapToPoint=1;points=[[0.1,0],[0.2,0],[0.3,0],[0.4,0],[0.5,0],[0.6,0],[0.7,0],[0.8,0],[0.9,0],[0,0.1],[0,0.3],[0,0.5],[0,0.7],[0,0.9],[0.1,1],[0.2,1],[0.3,1],[0.4,1],[0.5,1],[0.6,1],[0.7,1],[0.8,1],[0.9,1],[1,0.1],[1,0.3],[1,0.5],[1,0.7],[1,0.9]];" vertex="1" parent="1">
          <mxGeometry x="-580" y="1479.9999999999998" width="120" height="30" as="geometry" />
        </mxCell>
        <mxCell id="ceR-y8-nLFiyuJuDYNRY-13" value="" style="endArrow=classic;html=1;endSize=8;arcSize=0;rounded=0;" edge="1" parent="1" source="ceR-y8-nLFiyuJuDYNRY-86" target="ceR-y8-nLFiyuJuDYNRY-15">
          <mxGeometry width="50" height="50" relative="1" as="geometry">
            <mxPoint x="-320" y="1545.9999999999998" as="sourcePoint" />
            <mxPoint x="-440" y="1554.9999999999998" as="targetPoint" />
          </mxGeometry>
        </mxCell>
        <mxCell id="ceR-y8-nLFiyuJuDYNRY-14" value="om:hasValue" style="text;html=1;align=center;verticalAlign=middle;resizable=0;points=[];labelBackgroundColor=#ffffff;" vertex="1" connectable="0" parent="ceR-y8-nLFiyuJuDYNRY-13">
          <mxGeometry x="-0.1269" relative="1" as="geometry">
            <mxPoint x="-8" y="-15" as="offset" />
          </mxGeometry>
        </mxCell>
        <mxCell id="ceR-y8-nLFiyuJuDYNRY-15" value="ex:X" style="rounded=0;whiteSpace=wrap;html=1;snapToPoint=1;points=[[0.1,0],[0.2,0],[0.3,0],[0.4,0],[0.5,0],[0.6,0],[0.7,0],[0.8,0],[0.9,0],[0,0.1],[0,0.3],[0,0.5],[0,0.7],[0,0.9],[0.1,1],[0.2,1],[0.3,1],[0.4,1],[0.5,1],[0.6,1],[0.7,1],[0.8,1],[0.9,1],[1,0.1],[1,0.3],[1,0.5],[1,0.7],[1,0.9]];" vertex="1" parent="1">
          <mxGeometry x="-600" y="1559.9999999999998" width="160" height="30" as="geometry" />
        </mxCell>
        <mxCell id="ceR-y8-nLFiyuJuDYNRY-16" value="" style="endArrow=open;html=1;fontColor=#000099;endFill=0;dashed=1;endSize=8;rounded=0;" edge="1" parent="1" source="ceR-y8-nLFiyuJuDYNRY-15" target="ceR-y8-nLFiyuJuDYNRY-12">
          <mxGeometry width="50" height="50" relative="1" as="geometry">
            <mxPoint x="70" y="1534.9999999999998" as="sourcePoint" />
            <mxPoint x="-270" y="1484.9999999999998" as="targetPoint" />
          </mxGeometry>
        </mxCell>
        <mxCell id="ceR-y8-nLFiyuJuDYNRY-17" value="&amp;lt;&amp;lt;rdf:type&amp;gt;&amp;gt;" style="text;html=1;align=center;verticalAlign=middle;resizable=0;points=[];fontColor=#000000;labelBackgroundColor=#ffffff;" vertex="1" connectable="0" parent="ceR-y8-nLFiyuJuDYNRY-16">
          <mxGeometry x="-0.3277" relative="1" as="geometry">
            <mxPoint y="-7" as="offset" />
          </mxGeometry>
        </mxCell>
        <mxCell id="ceR-y8-nLFiyuJuDYNRY-18" value="&quot;87.0&quot;^^Double" style="rounded=0;whiteSpace=wrap;html=1;snapToPoint=1;" vertex="1" parent="1">
          <mxGeometry x="-580" y="1639.9999999999998" width="120" height="30" as="geometry" />
        </mxCell>
        <mxCell id="ceR-y8-nLFiyuJuDYNRY-19" value="om:hasNumericalValue" style="rounded=0;orthogonalLoop=1;jettySize=auto;html=1;fontSize=12;elbow=vertical;" edge="1" parent="1" source="ceR-y8-nLFiyuJuDYNRY-15" target="ceR-y8-nLFiyuJuDYNRY-18">
          <mxGeometry relative="1" as="geometry">
            <mxPoint x="-590" y="1649.9999999999998" as="sourcePoint" />
          </mxGeometry>
        </mxCell>
        <mxCell id="ceR-y8-nLFiyuJuDYNRY-20" value="" style="endArrow=classic;html=1;endSize=8;arcSize=0;rounded=0;" edge="1" parent="1" source="ceR-y8-nLFiyuJuDYNRY-15" target="ceR-y8-nLFiyuJuDYNRY-22">
          <mxGeometry width="50" height="50" relative="1" as="geometry">
            <mxPoint x="-340" y="1334.9999999999998" as="sourcePoint" />
            <mxPoint x="-460" y="1184.9999999999998" as="targetPoint" />
          </mxGeometry>
        </mxCell>
        <mxCell id="ceR-y8-nLFiyuJuDYNRY-21" value="om:hasUnit" style="text;html=1;align=center;verticalAlign=middle;resizable=0;points=[];labelBackgroundColor=#ffffff;" vertex="1" connectable="0" parent="ceR-y8-nLFiyuJuDYNRY-20">
          <mxGeometry x="-0.1269" relative="1" as="geometry">
            <mxPoint x="-8" y="-15" as="offset" />
          </mxGeometry>
        </mxCell>
        <mxCell id="ceR-y8-nLFiyuJuDYNRY-22" value="om:celcius" style="rounded=0;whiteSpace=wrap;html=1;snapToPoint=1;points=[[0.1,0],[0.2,0],[0.3,0],[0.4,0],[0.5,0],[0.6,0],[0.7,0],[0.8,0],[0.9,0],[0,0.1],[0,0.3],[0,0.5],[0,0.7],[0,0.9],[0.1,1],[0.2,1],[0.3,1],[0.4,1],[0.5,1],[0.6,1],[0.7,1],[0.8,1],[0.9,1],[1,0.1],[1,0.3],[1,0.5],[1,0.7],[1,0.9]];" vertex="1" parent="1">
          <mxGeometry x="-840" y="1560.0000000000002" width="120" height="30" as="geometry" />
        </mxCell>
        <mxCell id="ceR-y8-nLFiyuJuDYNRY-23" value="" style="endArrow=none;dashed=1;html=1;dashPattern=1 3;strokeWidth=2;rounded=0;" edge="1" parent="1">
          <mxGeometry width="50" height="50" relative="1" as="geometry">
            <mxPoint x="-520" y="1690" as="sourcePoint" />
            <mxPoint x="-520" y="1800" as="targetPoint" />
          </mxGeometry>
        </mxCell>
        <mxCell id="ceR-y8-nLFiyuJuDYNRY-24" value="&lt;u&gt;ex:obs1&lt;/u&gt;" style="rounded=0;whiteSpace=wrap;html=1;snapToPoint=1;points=[[0.1,0],[0.2,0],[0.3,0],[0.4,0],[0.5,0],[0.6,0],[0.7,0],[0.8,0],[0.9,0],[0,0.1],[0,0.3],[0,0.5],[0,0.7],[0,0.9],[0.1,1],[0.2,1],[0.3,1],[0.4,1],[0.5,1],[0.6,1],[0.7,1],[0.8,1],[0.9,1],[1,0.1],[1,0.3],[1,0.5],[1,0.7],[1,0.9]];" vertex="1" parent="1">
          <mxGeometry x="-200" y="1760" width="120" height="30" as="geometry" />
        </mxCell>
        <mxCell id="ceR-y8-nLFiyuJuDYNRY-25" value="" style="endArrow=classic;html=1;endSize=8;arcSize=0;rounded=0;" edge="1" parent="1" source="ceR-y8-nLFiyuJuDYNRY-24" target="ceR-y8-nLFiyuJuDYNRY-27">
          <mxGeometry width="50" height="50" relative="1" as="geometry">
            <mxPoint x="-106" y="1770" as="sourcePoint" />
            <mxPoint x="-250" y="1850" as="targetPoint" />
          </mxGeometry>
        </mxCell>
        <mxCell id="ceR-y8-nLFiyuJuDYNRY-26" value="time:&lt;code class=&quot;hljs javascript&quot;&gt;inXSDDateTimeStamp&lt;/code&gt;" style="text;html=1;align=center;verticalAlign=middle;resizable=0;points=[];labelBackgroundColor=#ffffff;" vertex="1" connectable="0" parent="ceR-y8-nLFiyuJuDYNRY-25">
          <mxGeometry x="-0.1269" relative="1" as="geometry">
            <mxPoint y="2" as="offset" />
          </mxGeometry>
        </mxCell>
        <mxCell id="ceR-y8-nLFiyuJuDYNRY-27" value="&quot;2001-05-23T08:21:00+08:00&quot;^^xsd:dateTimeStamp" style="rounded=0;whiteSpace=wrap;html=1;snapToPoint=1;points=[[0.1,0],[0.2,0],[0.3,0],[0.4,0],[0.5,0],[0.6,0],[0.7,0],[0.8,0],[0.9,0],[0,0.1],[0,0.3],[0,0.5],[0,0.7],[0,0.9],[0.1,1],[0.2,1],[0.3,1],[0.4,1],[0.5,1],[0.6,1],[0.7,1],[0.8,1],[0.9,1],[1,0.1],[1,0.3],[1,0.5],[1,0.7],[1,0.9]];" vertex="1" parent="1">
          <mxGeometry x="-520" y="1840" width="360" height="30" as="geometry" />
        </mxCell>
        <mxCell id="ceR-y8-nLFiyuJuDYNRY-28" value="" style="endArrow=classic;html=1;endSize=8;arcSize=0;rounded=0;" edge="1" parent="1" source="ceR-y8-nLFiyuJuDYNRY-24" target="ceR-y8-nLFiyuJuDYNRY-33">
          <mxGeometry width="50" height="50" relative="1" as="geometry">
            <mxPoint x="-106" y="1770" as="sourcePoint" />
            <mxPoint x="-140" y="1990" as="targetPoint" />
            <Array as="points">
              <mxPoint x="-140" y="2015.0000000000002" />
            </Array>
          </mxGeometry>
        </mxCell>
        <mxCell id="ceR-y8-nLFiyuJuDYNRY-29" value="cd:hasProperty" style="text;html=1;align=center;verticalAlign=middle;resizable=0;points=[];labelBackgroundColor=#ffffff;" vertex="1" connectable="0" parent="ceR-y8-nLFiyuJuDYNRY-28">
          <mxGeometry x="-0.1269" relative="1" as="geometry">
            <mxPoint y="2" as="offset" />
          </mxGeometry>
        </mxCell>
        <mxCell id="ceR-y8-nLFiyuJuDYNRY-30" value="qb:Observation" style="rounded=0;whiteSpace=wrap;html=1;snapToPoint=1;points=[[0.1,0],[0.2,0],[0.3,0],[0.4,0],[0.5,0],[0.6,0],[0.7,0],[0.8,0],[0.9,0],[0,0.1],[0,0.3],[0,0.5],[0,0.7],[0,0.9],[0.1,1],[0.2,1],[0.3,1],[0.4,1],[0.5,1],[0.6,1],[0.7,1],[0.8,1],[0.9,1],[1,0.1],[1,0.3],[1,0.5],[1,0.7],[1,0.9]];" vertex="1" parent="1">
          <mxGeometry x="-440" y="1760" width="120" height="30" as="geometry" />
        </mxCell>
        <mxCell id="ceR-y8-nLFiyuJuDYNRY-31" value="" style="endArrow=open;html=1;fontColor=#000099;endFill=0;dashed=1;endSize=8;rounded=0;" edge="1" parent="1" source="ceR-y8-nLFiyuJuDYNRY-24" target="ceR-y8-nLFiyuJuDYNRY-30">
          <mxGeometry width="50" height="50" relative="1" as="geometry">
            <mxPoint x="-50" y="1705" as="sourcePoint" />
            <mxPoint x="-190" y="1705" as="targetPoint" />
          </mxGeometry>
        </mxCell>
        <mxCell id="ceR-y8-nLFiyuJuDYNRY-32" value="&amp;lt;&amp;lt;rdf:type&amp;gt;&amp;gt;" style="text;html=1;align=center;verticalAlign=middle;resizable=0;points=[];fontColor=#000000;labelBackgroundColor=#ffffff;" vertex="1" connectable="0" parent="ceR-y8-nLFiyuJuDYNRY-31">
          <mxGeometry x="-0.3277" relative="1" as="geometry">
            <mxPoint x="-20" y="-15" as="offset" />
          </mxGeometry>
        </mxCell>
        <mxCell id="ceR-y8-nLFiyuJuDYNRY-33" value="ex:X" style="rounded=0;whiteSpace=wrap;html=1;snapToPoint=1;points=[[0.1,0],[0.2,0],[0.3,0],[0.4,0],[0.5,0],[0.6,0],[0.7,0],[0.8,0],[0.9,0],[0,0.1],[0,0.3],[0,0.5],[0,0.7],[0,0.9],[0.1,1],[0.2,1],[0.3,1],[0.4,1],[0.5,1],[0.6,1],[0.7,1],[0.8,1],[0.9,1],[1,0.1],[1,0.3],[1,0.5],[1,0.7],[1,0.9]];" vertex="1" parent="1">
          <mxGeometry x="-320" y="2000" width="160" height="30" as="geometry" />
        </mxCell>
        <mxCell id="ceR-y8-nLFiyuJuDYNRY-34" value="p:CruSetPress" style="rounded=0;whiteSpace=wrap;html=1;snapToPoint=1;points=[[0.1,0],[0.2,0],[0.3,0],[0.4,0],[0.5,0],[0.6,0],[0.7,0],[0.8,0],[0.9,0],[0,0.1],[0,0.3],[0,0.5],[0,0.7],[0,0.9],[0.1,1],[0.2,1],[0.3,1],[0.4,1],[0.5,1],[0.6,1],[0.7,1],[0.8,1],[0.9,1],[1,0.1],[1,0.3],[1,0.5],[1,0.7],[1,0.9]];" vertex="1" parent="1">
          <mxGeometry x="-300" y="1920.0000000000005" width="120" height="30" as="geometry" />
        </mxCell>
        <mxCell id="ceR-y8-nLFiyuJuDYNRY-35" value="" style="endArrow=open;html=1;fontColor=#000099;endFill=0;dashed=1;endSize=8;rounded=0;" edge="1" parent="1" source="ceR-y8-nLFiyuJuDYNRY-33" target="ceR-y8-nLFiyuJuDYNRY-34">
          <mxGeometry width="50" height="50" relative="1" as="geometry">
            <mxPoint x="-260" y="1965" as="sourcePoint" />
            <mxPoint x="-260" y="1925" as="targetPoint" />
          </mxGeometry>
        </mxCell>
        <mxCell id="ceR-y8-nLFiyuJuDYNRY-36" value="&amp;lt;&amp;lt;rdf:type&amp;gt;&amp;gt;" style="text;html=1;align=center;verticalAlign=middle;resizable=0;points=[];fontColor=#000000;labelBackgroundColor=#ffffff;" vertex="1" connectable="0" parent="ceR-y8-nLFiyuJuDYNRY-35">
          <mxGeometry x="-0.3277" relative="1" as="geometry">
            <mxPoint y="-7" as="offset" />
          </mxGeometry>
        </mxCell>
        <mxCell id="ceR-y8-nLFiyuJuDYNRY-37" value="om:Measure" style="rounded=0;whiteSpace=wrap;html=1;snapToPoint=1;points=[[0.1,0],[0.2,0],[0.3,0],[0.4,0],[0.5,0],[0.6,0],[0.7,0],[0.8,0],[0.9,0],[0,0.1],[0,0.3],[0,0.5],[0,0.7],[0,0.9],[0.1,1],[0.2,1],[0.3,1],[0.4,1],[0.5,1],[0.6,1],[0.7,1],[0.8,1],[0.9,1],[1,0.1],[1,0.3],[1,0.5],[1,0.7],[1,0.9]];" vertex="1" parent="1">
          <mxGeometry x="-580" y="1920" width="120" height="30" as="geometry" />
        </mxCell>
        <mxCell id="ceR-y8-nLFiyuJuDYNRY-38" value="ex:X" style="rounded=0;whiteSpace=wrap;html=1;snapToPoint=1;points=[[0.1,0],[0.2,0],[0.3,0],[0.4,0],[0.5,0],[0.6,0],[0.7,0],[0.8,0],[0.9,0],[0,0.1],[0,0.3],[0,0.5],[0,0.7],[0,0.9],[0.1,1],[0.2,1],[0.3,1],[0.4,1],[0.5,1],[0.6,1],[0.7,1],[0.8,1],[0.9,1],[1,0.1],[1,0.3],[1,0.5],[1,0.7],[1,0.9]];" vertex="1" parent="1">
          <mxGeometry x="-600" y="2000" width="160" height="30" as="geometry" />
        </mxCell>
        <mxCell id="ceR-y8-nLFiyuJuDYNRY-39" value="" style="endArrow=open;html=1;fontColor=#000099;endFill=0;dashed=1;endSize=8;rounded=0;" edge="1" parent="1" source="ceR-y8-nLFiyuJuDYNRY-38" target="ceR-y8-nLFiyuJuDYNRY-37">
          <mxGeometry width="50" height="50" relative="1" as="geometry">
            <mxPoint x="70" y="1975" as="sourcePoint" />
            <mxPoint x="-270" y="1925" as="targetPoint" />
          </mxGeometry>
        </mxCell>
        <mxCell id="ceR-y8-nLFiyuJuDYNRY-40" value="&amp;lt;&amp;lt;rdf:type&amp;gt;&amp;gt;" style="text;html=1;align=center;verticalAlign=middle;resizable=0;points=[];fontColor=#000000;labelBackgroundColor=#ffffff;" vertex="1" connectable="0" parent="ceR-y8-nLFiyuJuDYNRY-39">
          <mxGeometry x="-0.3277" relative="1" as="geometry">
            <mxPoint y="-7" as="offset" />
          </mxGeometry>
        </mxCell>
        <mxCell id="ceR-y8-nLFiyuJuDYNRY-41" value="&quot;1.0&quot;^^Double" style="rounded=0;whiteSpace=wrap;html=1;snapToPoint=1;" vertex="1" parent="1">
          <mxGeometry x="-580" y="2080" width="120" height="30" as="geometry" />
        </mxCell>
        <mxCell id="ceR-y8-nLFiyuJuDYNRY-42" value="om:hasNumericalValue" style="rounded=0;orthogonalLoop=1;jettySize=auto;html=1;fontSize=12;elbow=vertical;" edge="1" parent="1" source="ceR-y8-nLFiyuJuDYNRY-38" target="ceR-y8-nLFiyuJuDYNRY-41">
          <mxGeometry relative="1" as="geometry">
            <mxPoint x="-590" y="2090" as="sourcePoint" />
          </mxGeometry>
        </mxCell>
        <mxCell id="ceR-y8-nLFiyuJuDYNRY-43" value="" style="endArrow=classic;html=1;endSize=8;arcSize=0;rounded=0;" edge="1" parent="1" source="ceR-y8-nLFiyuJuDYNRY-38" target="ceR-y8-nLFiyuJuDYNRY-45">
          <mxGeometry width="50" height="50" relative="1" as="geometry">
            <mxPoint x="-340" y="1775" as="sourcePoint" />
            <mxPoint x="-460" y="1624.9999999999998" as="targetPoint" />
          </mxGeometry>
        </mxCell>
        <mxCell id="ceR-y8-nLFiyuJuDYNRY-44" value="om:hasUnit" style="text;html=1;align=center;verticalAlign=middle;resizable=0;points=[];labelBackgroundColor=#ffffff;" vertex="1" connectable="0" parent="ceR-y8-nLFiyuJuDYNRY-43">
          <mxGeometry x="-0.1269" relative="1" as="geometry">
            <mxPoint x="-8" y="-15" as="offset" />
          </mxGeometry>
        </mxCell>
        <mxCell id="ceR-y8-nLFiyuJuDYNRY-45" value="om:bar" style="rounded=0;whiteSpace=wrap;html=1;snapToPoint=1;points=[[0.1,0],[0.2,0],[0.3,0],[0.4,0],[0.5,0],[0.6,0],[0.7,0],[0.8,0],[0.9,0],[0,0.1],[0,0.3],[0,0.5],[0,0.7],[0,0.9],[0.1,1],[0.2,1],[0.3,1],[0.4,1],[0.5,1],[0.6,1],[0.7,1],[0.8,1],[0.9,1],[1,0.1],[1,0.3],[1,0.5],[1,0.7],[1,0.9]];" vertex="1" parent="1">
          <mxGeometry x="-840" y="2000.0000000000005" width="120" height="30" as="geometry" />
        </mxCell>
        <mxCell id="ceR-y8-nLFiyuJuDYNRY-46" value="ex:X" style="rounded=0;whiteSpace=wrap;html=1;snapToPoint=1;points=[[0.1,0],[0.2,0],[0.3,0],[0.4,0],[0.5,0],[0.6,0],[0.7,0],[0.8,0],[0.9,0],[0,0.1],[0,0.3],[0,0.5],[0,0.7],[0,0.9],[0.1,1],[0.2,1],[0.3,1],[0.4,1],[0.5,1],[0.6,1],[0.7,1],[0.8,1],[0.9,1],[1,0.1],[1,0.3],[1,0.5],[1,0.7],[1,0.9]];" vertex="1" parent="1">
          <mxGeometry x="-320" y="2240" width="160" height="30" as="geometry" />
        </mxCell>
        <mxCell id="ceR-y8-nLFiyuJuDYNRY-47" value="p:SetTemp" style="rounded=0;whiteSpace=wrap;html=1;snapToPoint=1;points=[[0.1,0],[0.2,0],[0.3,0],[0.4,0],[0.5,0],[0.6,0],[0.7,0],[0.8,0],[0.9,0],[0,0.1],[0,0.3],[0,0.5],[0,0.7],[0,0.9],[0.1,1],[0.2,1],[0.3,1],[0.4,1],[0.5,1],[0.6,1],[0.7,1],[0.8,1],[0.9,1],[1,0.1],[1,0.3],[1,0.5],[1,0.7],[1,0.9]];" vertex="1" parent="1">
          <mxGeometry x="-300" y="2160.0000000000005" width="120" height="30" as="geometry" />
        </mxCell>
        <mxCell id="ceR-y8-nLFiyuJuDYNRY-48" value="" style="endArrow=open;html=1;fontColor=#000099;endFill=0;dashed=1;endSize=8;rounded=0;" edge="1" parent="1" source="ceR-y8-nLFiyuJuDYNRY-46" target="ceR-y8-nLFiyuJuDYNRY-47">
          <mxGeometry width="50" height="50" relative="1" as="geometry">
            <mxPoint x="-260" y="2205" as="sourcePoint" />
            <mxPoint x="-260" y="2165" as="targetPoint" />
          </mxGeometry>
        </mxCell>
        <mxCell id="ceR-y8-nLFiyuJuDYNRY-49" value="&amp;lt;&amp;lt;rdf:type&amp;gt;&amp;gt;" style="text;html=1;align=center;verticalAlign=middle;resizable=0;points=[];fontColor=#000000;labelBackgroundColor=#ffffff;" vertex="1" connectable="0" parent="ceR-y8-nLFiyuJuDYNRY-48">
          <mxGeometry x="-0.3277" relative="1" as="geometry">
            <mxPoint y="-7" as="offset" />
          </mxGeometry>
        </mxCell>
        <mxCell id="ceR-y8-nLFiyuJuDYNRY-50" value="om:Measure" style="rounded=0;whiteSpace=wrap;html=1;snapToPoint=1;points=[[0.1,0],[0.2,0],[0.3,0],[0.4,0],[0.5,0],[0.6,0],[0.7,0],[0.8,0],[0.9,0],[0,0.1],[0,0.3],[0,0.5],[0,0.7],[0,0.9],[0.1,1],[0.2,1],[0.3,1],[0.4,1],[0.5,1],[0.6,1],[0.7,1],[0.8,1],[0.9,1],[1,0.1],[1,0.3],[1,0.5],[1,0.7],[1,0.9]];" vertex="1" parent="1">
          <mxGeometry x="-580" y="2160" width="120" height="30" as="geometry" />
        </mxCell>
        <mxCell id="ceR-y8-nLFiyuJuDYNRY-51" value="ex:X" style="rounded=0;whiteSpace=wrap;html=1;snapToPoint=1;points=[[0.1,0],[0.2,0],[0.3,0],[0.4,0],[0.5,0],[0.6,0],[0.7,0],[0.8,0],[0.9,0],[0,0.1],[0,0.3],[0,0.5],[0,0.7],[0,0.9],[0.1,1],[0.2,1],[0.3,1],[0.4,1],[0.5,1],[0.6,1],[0.7,1],[0.8,1],[0.9,1],[1,0.1],[1,0.3],[1,0.5],[1,0.7],[1,0.9]];" vertex="1" parent="1">
          <mxGeometry x="-600" y="2240" width="160" height="30" as="geometry" />
        </mxCell>
        <mxCell id="ceR-y8-nLFiyuJuDYNRY-52" value="" style="endArrow=open;html=1;fontColor=#000099;endFill=0;dashed=1;endSize=8;rounded=0;" edge="1" parent="1" source="ceR-y8-nLFiyuJuDYNRY-51" target="ceR-y8-nLFiyuJuDYNRY-50">
          <mxGeometry width="50" height="50" relative="1" as="geometry">
            <mxPoint x="70" y="2215" as="sourcePoint" />
            <mxPoint x="-270" y="2165" as="targetPoint" />
          </mxGeometry>
        </mxCell>
        <mxCell id="ceR-y8-nLFiyuJuDYNRY-53" value="&amp;lt;&amp;lt;rdf:type&amp;gt;&amp;gt;" style="text;html=1;align=center;verticalAlign=middle;resizable=0;points=[];fontColor=#000000;labelBackgroundColor=#ffffff;" vertex="1" connectable="0" parent="ceR-y8-nLFiyuJuDYNRY-52">
          <mxGeometry x="-0.3277" relative="1" as="geometry">
            <mxPoint y="-7" as="offset" />
          </mxGeometry>
        </mxCell>
        <mxCell id="ceR-y8-nLFiyuJuDYNRY-54" value="&quot;88.0&quot;^^Double" style="rounded=0;whiteSpace=wrap;html=1;snapToPoint=1;" vertex="1" parent="1">
          <mxGeometry x="-580" y="2320" width="120" height="30" as="geometry" />
        </mxCell>
        <mxCell id="ceR-y8-nLFiyuJuDYNRY-55" value="om:hasNumericalValue" style="rounded=0;orthogonalLoop=1;jettySize=auto;html=1;fontSize=12;elbow=vertical;" edge="1" parent="1" source="ceR-y8-nLFiyuJuDYNRY-51" target="ceR-y8-nLFiyuJuDYNRY-54">
          <mxGeometry relative="1" as="geometry">
            <mxPoint x="-590" y="2330" as="sourcePoint" />
          </mxGeometry>
        </mxCell>
        <mxCell id="ceR-y8-nLFiyuJuDYNRY-56" value="" style="endArrow=classic;html=1;endSize=8;arcSize=0;rounded=0;" edge="1" parent="1" source="ceR-y8-nLFiyuJuDYNRY-51" target="ceR-y8-nLFiyuJuDYNRY-58">
          <mxGeometry width="50" height="50" relative="1" as="geometry">
            <mxPoint x="-340" y="2015.0000000000002" as="sourcePoint" />
            <mxPoint x="-460" y="1865" as="targetPoint" />
          </mxGeometry>
        </mxCell>
        <mxCell id="ceR-y8-nLFiyuJuDYNRY-57" value="om:hasUnit" style="text;html=1;align=center;verticalAlign=middle;resizable=0;points=[];labelBackgroundColor=#ffffff;" vertex="1" connectable="0" parent="ceR-y8-nLFiyuJuDYNRY-56">
          <mxGeometry x="-0.1269" relative="1" as="geometry">
            <mxPoint x="-8" y="-15" as="offset" />
          </mxGeometry>
        </mxCell>
        <mxCell id="ceR-y8-nLFiyuJuDYNRY-58" value="om:celcius" style="rounded=0;whiteSpace=wrap;html=1;snapToPoint=1;points=[[0.1,0],[0.2,0],[0.3,0],[0.4,0],[0.5,0],[0.6,0],[0.7,0],[0.8,0],[0.9,0],[0,0.1],[0,0.3],[0,0.5],[0,0.7],[0,0.9],[0.1,1],[0.2,1],[0.3,1],[0.4,1],[0.5,1],[0.6,1],[0.7,1],[0.8,1],[0.9,1],[1,0.1],[1,0.3],[1,0.5],[1,0.7],[1,0.9]];" vertex="1" parent="1">
          <mxGeometry x="-840" y="2240.0000000000005" width="120" height="30" as="geometry" />
        </mxCell>
        <mxCell id="ceR-y8-nLFiyuJuDYNRY-59" value="" style="endArrow=classic;html=1;endSize=8;arcSize=0;rounded=0;" edge="1" parent="1" source="ceR-y8-nLFiyuJuDYNRY-24" target="ceR-y8-nLFiyuJuDYNRY-46">
          <mxGeometry width="50" height="50" relative="1" as="geometry">
            <mxPoint x="-130" y="1800" as="sourcePoint" />
            <mxPoint x="-150" y="2025.0000000000002" as="targetPoint" />
            <Array as="points">
              <mxPoint x="-140" y="2255" />
            </Array>
          </mxGeometry>
        </mxCell>
        <mxCell id="ceR-y8-nLFiyuJuDYNRY-60" value="cd:hasProperty" style="text;html=1;align=center;verticalAlign=middle;resizable=0;points=[];labelBackgroundColor=#ffffff;" vertex="1" connectable="0" parent="ceR-y8-nLFiyuJuDYNRY-59">
          <mxGeometry x="-0.1269" relative="1" as="geometry">
            <mxPoint x="-10" y="98" as="offset" />
          </mxGeometry>
        </mxCell>
        <mxCell id="ceR-y8-nLFiyuJuDYNRY-61" value="" style="endArrow=classic;html=1;endSize=8;arcSize=0;rounded=0;" edge="1" parent="1" source="ceR-y8-nLFiyuJuDYNRY-33" target="ceR-y8-nLFiyuJuDYNRY-38">
          <mxGeometry width="50" height="50" relative="1" as="geometry">
            <mxPoint x="-320" y="2020.0000000000002" as="sourcePoint" />
            <mxPoint x="-440" y="2020.0000000000002" as="targetPoint" />
          </mxGeometry>
        </mxCell>
        <mxCell id="ceR-y8-nLFiyuJuDYNRY-62" value="om:hasValue" style="text;html=1;align=center;verticalAlign=middle;resizable=0;points=[];labelBackgroundColor=#ffffff;" vertex="1" connectable="0" parent="ceR-y8-nLFiyuJuDYNRY-61">
          <mxGeometry x="-0.1269" relative="1" as="geometry">
            <mxPoint x="-8" y="-15" as="offset" />
          </mxGeometry>
        </mxCell>
        <mxCell id="ceR-y8-nLFiyuJuDYNRY-63" value="" style="endArrow=classic;html=1;endSize=8;arcSize=0;rounded=0;" edge="1" parent="1" source="ceR-y8-nLFiyuJuDYNRY-46" target="ceR-y8-nLFiyuJuDYNRY-51">
          <mxGeometry width="50" height="50" relative="1" as="geometry">
            <mxPoint x="-320" y="2260" as="sourcePoint" />
            <mxPoint x="-440" y="2260" as="targetPoint" />
          </mxGeometry>
        </mxCell>
        <mxCell id="ceR-y8-nLFiyuJuDYNRY-64" value="om:hasValue" style="text;html=1;align=center;verticalAlign=middle;resizable=0;points=[];labelBackgroundColor=#ffffff;" vertex="1" connectable="0" parent="ceR-y8-nLFiyuJuDYNRY-63">
          <mxGeometry x="-0.1269" relative="1" as="geometry">
            <mxPoint x="-8" y="-15" as="offset" />
          </mxGeometry>
        </mxCell>
        <mxCell id="ceR-y8-nLFiyuJuDYNRY-65" value="&lt;u&gt;ex:castingLog&lt;/u&gt;" style="rounded=0;whiteSpace=wrap;html=1;snapToPoint=1;points=[[0.1,0],[0.2,0],[0.3,0],[0.4,0],[0.5,0],[0.6,0],[0.7,0],[0.8,0],[0.9,0],[0,0.1],[0,0.3],[0,0.5],[0,0.7],[0,0.9],[0.1,1],[0.2,1],[0.3,1],[0.4,1],[0.5,1],[0.6,1],[0.7,1],[0.8,1],[0.9,1],[1,0.1],[1,0.3],[1,0.5],[1,0.7],[1,0.9]];" vertex="1" parent="1">
          <mxGeometry x="40" y="800" width="120" height="30" as="geometry" />
        </mxCell>
        <mxCell id="ceR-y8-nLFiyuJuDYNRY-66" value="" style="endArrow=open;html=1;fontColor=#000099;endFill=0;dashed=1;endSize=8;rounded=0;" edge="1" parent="1" source="ceR-y8-nLFiyuJuDYNRY-65" target="ceR-y8-nLFiyuJuDYNRY-68">
          <mxGeometry width="50" height="50" relative="1" as="geometry">
            <mxPoint x="80" y="960" as="sourcePoint" />
            <mxPoint x="-57.00000000001069" y="920" as="targetPoint" />
          </mxGeometry>
        </mxCell>
        <mxCell id="ceR-y8-nLFiyuJuDYNRY-67" value="&amp;lt;&amp;lt;rdf:type&amp;gt;&amp;gt;" style="text;html=1;align=center;verticalAlign=middle;resizable=0;points=[];fontColor=#000000;labelBackgroundColor=#ffffff;" vertex="1" connectable="0" parent="ceR-y8-nLFiyuJuDYNRY-66">
          <mxGeometry x="-0.3277" relative="1" as="geometry">
            <mxPoint x="-16" y="-15" as="offset" />
          </mxGeometry>
        </mxCell>
        <mxCell id="ceR-y8-nLFiyuJuDYNRY-68" value="dcat:Dataset" style="rounded=0;whiteSpace=wrap;html=1;snapToPoint=1;points=[[0.1,0],[0.2,0],[0.3,0],[0.4,0],[0.5,0],[0.6,0],[0.7,0],[0.8,0],[0.9,0],[0,0.1],[0,0.3],[0,0.5],[0,0.7],[0,0.9],[0.1,1],[0.2,1],[0.3,1],[0.4,1],[0.5,1],[0.6,1],[0.7,1],[0.8,1],[0.9,1],[1,0.1],[1,0.3],[1,0.5],[1,0.7],[1,0.9]];" vertex="1" parent="1">
          <mxGeometry x="-200" y="800" width="120" height="30" as="geometry" />
        </mxCell>
        <mxCell id="ceR-y8-nLFiyuJuDYNRY-69" value="&lt;u&gt;ex:obs1&lt;/u&gt;" style="rounded=0;whiteSpace=wrap;html=1;snapToPoint=1;points=[[0.1,0],[0.2,0],[0.3,0],[0.4,0],[0.5,0],[0.6,0],[0.7,0],[0.8,0],[0.9,0],[0,0.1],[0,0.3],[0,0.5],[0,0.7],[0,0.9],[0.1,1],[0.2,1],[0.3,1],[0.4,1],[0.5,1],[0.6,1],[0.7,1],[0.8,1],[0.9,1],[1,0.1],[1,0.3],[1,0.5],[1,0.7],[1,0.9]];" vertex="1" parent="1">
          <mxGeometry x="-200" y="1080" width="120" height="30" as="geometry" />
        </mxCell>
        <mxCell id="ceR-y8-nLFiyuJuDYNRY-70" value="" style="endArrow=classic;html=1;endSize=8;arcSize=0;rounded=0;" edge="1" parent="1" source="ceR-y8-nLFiyuJuDYNRY-69" target="ceR-y8-nLFiyuJuDYNRY-92">
          <mxGeometry width="50" height="50" relative="1" as="geometry">
            <mxPoint x="220" y="810" as="sourcePoint" />
            <mxPoint x="220" y="760" as="targetPoint" />
            <Array as="points">
              <mxPoint x="-40" y="1095" />
            </Array>
          </mxGeometry>
        </mxCell>
        <mxCell id="ceR-y8-nLFiyuJuDYNRY-71" value="qb:dataSet" style="text;html=1;align=center;verticalAlign=middle;resizable=0;points=[];labelBackgroundColor=#ffffff;" vertex="1" connectable="0" parent="ceR-y8-nLFiyuJuDYNRY-70">
          <mxGeometry x="-0.1269" relative="1" as="geometry">
            <mxPoint x="40" y="-10" as="offset" />
          </mxGeometry>
        </mxCell>
        <mxCell id="ceR-y8-nLFiyuJuDYNRY-72" value="" style="endArrow=classic;html=1;endSize=8;arcSize=0;rounded=0;" edge="1" parent="1" source="ceR-y8-nLFiyuJuDYNRY-69" target="ceR-y8-nLFiyuJuDYNRY-81">
          <mxGeometry width="50" height="50" relative="1" as="geometry">
            <mxPoint x="-106" y="1089.9999999999998" as="sourcePoint" />
            <mxPoint x="-250" y="1169.9999999999998" as="targetPoint" />
          </mxGeometry>
        </mxCell>
        <mxCell id="ceR-y8-nLFiyuJuDYNRY-73" value="time:&lt;code class=&quot;hljs javascript&quot;&gt;inXSDDateTimeStamp&lt;/code&gt;" style="text;html=1;align=center;verticalAlign=middle;resizable=0;points=[];labelBackgroundColor=#ffffff;" vertex="1" connectable="0" parent="ceR-y8-nLFiyuJuDYNRY-72">
          <mxGeometry x="-0.1269" relative="1" as="geometry">
            <mxPoint y="2" as="offset" />
          </mxGeometry>
        </mxCell>
        <mxCell id="ceR-y8-nLFiyuJuDYNRY-74" value="" style="endArrow=classic;html=1;endSize=8;arcSize=0;rounded=0;" edge="1" parent="1" source="ceR-y8-nLFiyuJuDYNRY-69" target="ceR-y8-nLFiyuJuDYNRY-82">
          <mxGeometry width="50" height="50" relative="1" as="geometry">
            <mxPoint x="-106" y="1089.9999999999998" as="sourcePoint" />
            <mxPoint x="-140" y="1309.9999999999998" as="targetPoint" />
            <Array as="points">
              <mxPoint x="-140" y="1334.9999999999998" />
            </Array>
          </mxGeometry>
        </mxCell>
        <mxCell id="ceR-y8-nLFiyuJuDYNRY-75" value="cd:hasProperty" style="text;html=1;align=center;verticalAlign=middle;resizable=0;points=[];labelBackgroundColor=#ffffff;" vertex="1" connectable="0" parent="ceR-y8-nLFiyuJuDYNRY-74">
          <mxGeometry x="-0.1269" relative="1" as="geometry">
            <mxPoint y="2" as="offset" />
          </mxGeometry>
        </mxCell>
        <mxCell id="ceR-y8-nLFiyuJuDYNRY-76" value="" style="endArrow=open;html=1;fontColor=#000099;endFill=0;dashed=1;endSize=8;rounded=0;" edge="1" parent="1" source="ceR-y8-nLFiyuJuDYNRY-69" target="ceR-y8-nLFiyuJuDYNRY-80">
          <mxGeometry width="50" height="50" relative="1" as="geometry">
            <mxPoint x="-50" y="1024.9999999999998" as="sourcePoint" />
            <mxPoint x="-190" y="1024.9999999999998" as="targetPoint" />
          </mxGeometry>
        </mxCell>
        <mxCell id="ceR-y8-nLFiyuJuDYNRY-77" value="&amp;lt;&amp;lt;rdf:type&amp;gt;&amp;gt;" style="text;html=1;align=center;verticalAlign=middle;resizable=0;points=[];fontColor=#000000;labelBackgroundColor=#ffffff;" vertex="1" connectable="0" parent="ceR-y8-nLFiyuJuDYNRY-76">
          <mxGeometry x="-0.3277" relative="1" as="geometry">
            <mxPoint x="-20" y="-15" as="offset" />
          </mxGeometry>
        </mxCell>
        <mxCell id="ceR-y8-nLFiyuJuDYNRY-78" value="" style="endArrow=classic;html=1;endSize=8;arcSize=0;rounded=0;" edge="1" parent="1" source="ceR-y8-nLFiyuJuDYNRY-69" target="ceR-y8-nLFiyuJuDYNRY-86">
          <mxGeometry width="50" height="50" relative="1" as="geometry">
            <mxPoint x="-130" y="1119.9999999999998" as="sourcePoint" />
            <mxPoint x="-150" y="1344.9999999999998" as="targetPoint" />
            <Array as="points">
              <mxPoint x="-140" y="1574.9999999999998" />
            </Array>
          </mxGeometry>
        </mxCell>
        <mxCell id="ceR-y8-nLFiyuJuDYNRY-79" value="cd:hasProperty" style="text;html=1;align=center;verticalAlign=middle;resizable=0;points=[];labelBackgroundColor=#ffffff;" vertex="1" connectable="0" parent="ceR-y8-nLFiyuJuDYNRY-78">
          <mxGeometry x="-0.1269" relative="1" as="geometry">
            <mxPoint x="-10" y="98" as="offset" />
          </mxGeometry>
        </mxCell>
        <mxCell id="ceR-y8-nLFiyuJuDYNRY-80" value="qb:Observation" style="rounded=0;whiteSpace=wrap;html=1;snapToPoint=1;points=[[0.1,0],[0.2,0],[0.3,0],[0.4,0],[0.5,0],[0.6,0],[0.7,0],[0.8,0],[0.9,0],[0,0.1],[0,0.3],[0,0.5],[0,0.7],[0,0.9],[0.1,1],[0.2,1],[0.3,1],[0.4,1],[0.5,1],[0.6,1],[0.7,1],[0.8,1],[0.9,1],[1,0.1],[1,0.3],[1,0.5],[1,0.7],[1,0.9]];" vertex="1" parent="1">
          <mxGeometry x="-440" y="1079.9999999999998" width="120" height="30" as="geometry" />
        </mxCell>
        <mxCell id="ceR-y8-nLFiyuJuDYNRY-81" value="&quot;2001-05-23T08:20:00+08:00&quot;^^xsd:dateTimeStamp" style="rounded=0;whiteSpace=wrap;html=1;snapToPoint=1;points=[[0.1,0],[0.2,0],[0.3,0],[0.4,0],[0.5,0],[0.6,0],[0.7,0],[0.8,0],[0.9,0],[0,0.1],[0,0.3],[0,0.5],[0,0.7],[0,0.9],[0.1,1],[0.2,1],[0.3,1],[0.4,1],[0.5,1],[0.6,1],[0.7,1],[0.8,1],[0.9,1],[1,0.1],[1,0.3],[1,0.5],[1,0.7],[1,0.9]];" vertex="1" parent="1">
          <mxGeometry x="-520" y="1159.9999999999998" width="360" height="30" as="geometry" />
        </mxCell>
        <mxCell id="ceR-y8-nLFiyuJuDYNRY-82" value="ex:X" style="rounded=0;whiteSpace=wrap;html=1;snapToPoint=1;points=[[0.1,0],[0.2,0],[0.3,0],[0.4,0],[0.5,0],[0.6,0],[0.7,0],[0.8,0],[0.9,0],[0,0.1],[0,0.3],[0,0.5],[0,0.7],[0,0.9],[0.1,1],[0.2,1],[0.3,1],[0.4,1],[0.5,1],[0.6,1],[0.7,1],[0.8,1],[0.9,1],[1,0.1],[1,0.3],[1,0.5],[1,0.7],[1,0.9]];" vertex="1" parent="1">
          <mxGeometry x="-320" y="1319.9999999999998" width="160" height="30" as="geometry" />
        </mxCell>
        <mxCell id="ceR-y8-nLFiyuJuDYNRY-83" value="p:CruSetPress" style="rounded=0;whiteSpace=wrap;html=1;snapToPoint=1;points=[[0.1,0],[0.2,0],[0.3,0],[0.4,0],[0.5,0],[0.6,0],[0.7,0],[0.8,0],[0.9,0],[0,0.1],[0,0.3],[0,0.5],[0,0.7],[0,0.9],[0.1,1],[0.2,1],[0.3,1],[0.4,1],[0.5,1],[0.6,1],[0.7,1],[0.8,1],[0.9,1],[1,0.1],[1,0.3],[1,0.5],[1,0.7],[1,0.9]];" vertex="1" parent="1">
          <mxGeometry x="-300" y="1240.0000000000002" width="120" height="30" as="geometry" />
        </mxCell>
        <mxCell id="ceR-y8-nLFiyuJuDYNRY-84" value="" style="endArrow=open;html=1;fontColor=#000099;endFill=0;dashed=1;endSize=8;rounded=0;" edge="1" parent="1" source="ceR-y8-nLFiyuJuDYNRY-82" target="ceR-y8-nLFiyuJuDYNRY-83">
          <mxGeometry width="50" height="50" relative="1" as="geometry">
            <mxPoint x="-260" y="1284.9999999999998" as="sourcePoint" />
            <mxPoint x="-260" y="1244.9999999999998" as="targetPoint" />
          </mxGeometry>
        </mxCell>
        <mxCell id="ceR-y8-nLFiyuJuDYNRY-85" value="&amp;lt;&amp;lt;rdf:type&amp;gt;&amp;gt;" style="text;html=1;align=center;verticalAlign=middle;resizable=0;points=[];fontColor=#000000;labelBackgroundColor=#ffffff;" vertex="1" connectable="0" parent="ceR-y8-nLFiyuJuDYNRY-84">
          <mxGeometry x="-0.3277" relative="1" as="geometry">
            <mxPoint y="-7" as="offset" />
          </mxGeometry>
        </mxCell>
        <mxCell id="ceR-y8-nLFiyuJuDYNRY-86" value="ex:X" style="rounded=0;whiteSpace=wrap;html=1;snapToPoint=1;points=[[0.1,0],[0.2,0],[0.3,0],[0.4,0],[0.5,0],[0.6,0],[0.7,0],[0.8,0],[0.9,0],[0,0.1],[0,0.3],[0,0.5],[0,0.7],[0,0.9],[0.1,1],[0.2,1],[0.3,1],[0.4,1],[0.5,1],[0.6,1],[0.7,1],[0.8,1],[0.9,1],[1,0.1],[1,0.3],[1,0.5],[1,0.7],[1,0.9]];" vertex="1" parent="1">
          <mxGeometry x="-320" y="1559.9999999999998" width="160" height="30" as="geometry" />
        </mxCell>
        <mxCell id="ceR-y8-nLFiyuJuDYNRY-87" value="p:SetTemp" style="rounded=0;whiteSpace=wrap;html=1;snapToPoint=1;points=[[0.1,0],[0.2,0],[0.3,0],[0.4,0],[0.5,0],[0.6,0],[0.7,0],[0.8,0],[0.9,0],[0,0.1],[0,0.3],[0,0.5],[0,0.7],[0,0.9],[0.1,1],[0.2,1],[0.3,1],[0.4,1],[0.5,1],[0.6,1],[0.7,1],[0.8,1],[0.9,1],[1,0.1],[1,0.3],[1,0.5],[1,0.7],[1,0.9]];" vertex="1" parent="1">
          <mxGeometry x="-300" y="1480.0000000000002" width="120" height="30" as="geometry" />
        </mxCell>
        <mxCell id="ceR-y8-nLFiyuJuDYNRY-88" value="" style="endArrow=open;html=1;fontColor=#000099;endFill=0;dashed=1;endSize=8;rounded=0;" edge="1" parent="1" source="ceR-y8-nLFiyuJuDYNRY-86" target="ceR-y8-nLFiyuJuDYNRY-87">
          <mxGeometry width="50" height="50" relative="1" as="geometry">
            <mxPoint x="-260" y="1524.9999999999998" as="sourcePoint" />
            <mxPoint x="-260" y="1484.9999999999998" as="targetPoint" />
          </mxGeometry>
        </mxCell>
        <mxCell id="ceR-y8-nLFiyuJuDYNRY-89" value="&amp;lt;&amp;lt;rdf:type&amp;gt;&amp;gt;" style="text;html=1;align=center;verticalAlign=middle;resizable=0;points=[];fontColor=#000000;labelBackgroundColor=#ffffff;" vertex="1" connectable="0" parent="ceR-y8-nLFiyuJuDYNRY-88">
          <mxGeometry x="-0.3277" relative="1" as="geometry">
            <mxPoint y="-7" as="offset" />
          </mxGeometry>
        </mxCell>
        <mxCell id="ceR-y8-nLFiyuJuDYNRY-90" value="" style="endArrow=classic;html=1;endSize=8;arcSize=0;rounded=0;" edge="1" parent="1" source="ceR-y8-nLFiyuJuDYNRY-24" target="ceR-y8-nLFiyuJuDYNRY-92">
          <mxGeometry width="50" height="50" relative="1" as="geometry">
            <mxPoint x="140" y="905" as="sourcePoint" />
            <mxPoint x="220" y="840" as="targetPoint" />
            <Array as="points">
              <mxPoint x="-40" y="1775" />
            </Array>
          </mxGeometry>
        </mxCell>
        <mxCell id="ceR-y8-nLFiyuJuDYNRY-91" value="qb:dataSet" style="text;html=1;align=center;verticalAlign=middle;resizable=0;points=[];labelBackgroundColor=#ffffff;" vertex="1" connectable="0" parent="ceR-y8-nLFiyuJuDYNRY-90">
          <mxGeometry x="-0.1269" relative="1" as="geometry">
            <mxPoint x="50" y="287" as="offset" />
          </mxGeometry>
        </mxCell>
        <mxCell id="ceR-y8-nLFiyuJuDYNRY-92" value="&lt;u&gt;ex:castingLogTurtle&lt;/u&gt;" style="rounded=0;whiteSpace=wrap;html=1;snapToPoint=1;points=[[0.1,0],[0.2,0],[0.3,0],[0.4,0],[0.5,0],[0.6,0],[0.7,0],[0.8,0],[0.9,0],[0,0.1],[0,0.3],[0,0.5],[0,0.7],[0,0.9],[0.1,1],[0.2,1],[0.3,1],[0.4,1],[0.5,1],[0.6,1],[0.7,1],[0.8,1],[0.9,1],[1,0.1],[1,0.3],[1,0.5],[1,0.7],[1,0.9]];" vertex="1" parent="1">
          <mxGeometry x="-120" y="960" width="160" height="30" as="geometry" />
        </mxCell>
        <mxCell id="ceR-y8-nLFiyuJuDYNRY-93" value="" style="endArrow=classic;html=1;endSize=8;arcSize=0;rounded=0;" edge="1" parent="1" source="ceR-y8-nLFiyuJuDYNRY-65" target="ceR-y8-nLFiyuJuDYNRY-92">
          <mxGeometry width="50" height="50" relative="1" as="geometry">
            <mxPoint x="-50" y="1459.75" as="sourcePoint" />
            <mxPoint x="-100" y="1149.75" as="targetPoint" />
            <Array as="points">
              <mxPoint x="100" y="975" />
            </Array>
          </mxGeometry>
        </mxCell>
        <mxCell id="ceR-y8-nLFiyuJuDYNRY-94" value="dcat:distribution" style="text;html=1;align=center;verticalAlign=middle;resizable=0;points=[];labelBackgroundColor=#ffffff;" vertex="1" connectable="0" parent="ceR-y8-nLFiyuJuDYNRY-93">
          <mxGeometry x="-0.1269" relative="1" as="geometry">
            <mxPoint x="60" y="20" as="offset" />
          </mxGeometry>
        </mxCell>
        <mxCell id="ceR-y8-nLFiyuJuDYNRY-95" value="&lt;span&gt;ex:castingLogCSV&lt;/span&gt;" style="rounded=0;whiteSpace=wrap;html=1;snapToPoint=1;points=[[0.1,0],[0.2,0],[0.3,0],[0.4,0],[0.5,0],[0.6,0],[0.7,0],[0.8,0],[0.9,0],[0,0.1],[0,0.3],[0,0.5],[0,0.7],[0,0.9],[0.1,1],[0.2,1],[0.3,1],[0.4,1],[0.5,1],[0.6,1],[0.7,1],[0.8,1],[0.9,1],[1,0.1],[1,0.3],[1,0.5],[1,0.7],[1,0.9]];fontStyle=4" vertex="1" parent="1">
          <mxGeometry x="-120" y="880" width="160" height="30" as="geometry" />
        </mxCell>
        <mxCell id="ceR-y8-nLFiyuJuDYNRY-96" value="" style="endArrow=classic;html=1;endSize=8;arcSize=0;rounded=0;" edge="1" parent="1" source="ceR-y8-nLFiyuJuDYNRY-65" target="ceR-y8-nLFiyuJuDYNRY-95">
          <mxGeometry width="50" height="50" relative="1" as="geometry">
            <mxPoint x="112.5" y="839.75" as="sourcePoint" />
            <mxPoint x="172.5" y="969.75" as="targetPoint" />
            <Array as="points">
              <mxPoint x="100" y="895" />
            </Array>
          </mxGeometry>
        </mxCell>
        <mxCell id="ceR-y8-nLFiyuJuDYNRY-97" value="dcat:distribution" style="text;html=1;align=center;verticalAlign=middle;resizable=0;points=[];labelBackgroundColor=#ffffff;" vertex="1" connectable="0" parent="ceR-y8-nLFiyuJuDYNRY-96">
          <mxGeometry x="-0.1269" relative="1" as="geometry">
            <mxPoint x="60" y="-25" as="offset" />
          </mxGeometry>
        </mxCell>
        <mxCell id="ceR-y8-nLFiyuJuDYNRY-98" value="" style="endArrow=open;html=1;fontColor=#000099;endFill=0;dashed=1;endSize=8;rounded=0;" edge="1" parent="1" source="ceR-y8-nLFiyuJuDYNRY-95" target="ceR-y8-nLFiyuJuDYNRY-100">
          <mxGeometry width="50" height="50" relative="1" as="geometry">
            <mxPoint x="-100" y="891" as="sourcePoint" />
            <mxPoint x="-217.0000000000107" y="1000" as="targetPoint" />
          </mxGeometry>
        </mxCell>
        <mxCell id="ceR-y8-nLFiyuJuDYNRY-99" value="&amp;lt;&amp;lt;rdf:type&amp;gt;&amp;gt;" style="text;html=1;align=center;verticalAlign=middle;resizable=0;points=[];fontColor=#000000;labelBackgroundColor=#ffffff;" vertex="1" connectable="0" parent="ceR-y8-nLFiyuJuDYNRY-98">
          <mxGeometry x="-0.3277" relative="1" as="geometry">
            <mxPoint x="-16" y="-15" as="offset" />
          </mxGeometry>
        </mxCell>
        <mxCell id="ceR-y8-nLFiyuJuDYNRY-100" value="dcat:Distribution" style="rounded=0;whiteSpace=wrap;html=1;snapToPoint=1;points=[[0.1,0],[0.2,0],[0.3,0],[0.4,0],[0.5,0],[0.6,0],[0.7,0],[0.8,0],[0.9,0],[0,0.1],[0,0.3],[0,0.5],[0,0.7],[0,0.9],[0.1,1],[0.2,1],[0.3,1],[0.4,1],[0.5,1],[0.6,1],[0.7,1],[0.8,1],[0.9,1],[1,0.1],[1,0.3],[1,0.5],[1,0.7],[1,0.9]];" vertex="1" parent="1">
          <mxGeometry x="-360" y="880" width="120" height="30" as="geometry" />
        </mxCell>
        <mxCell id="ceR-y8-nLFiyuJuDYNRY-101" value="" style="endArrow=open;html=1;fontColor=#000099;endFill=0;dashed=1;endSize=8;rounded=0;" edge="1" parent="1" source="ceR-y8-nLFiyuJuDYNRY-92" target="ceR-y8-nLFiyuJuDYNRY-103">
          <mxGeometry width="50" height="50" relative="1" as="geometry">
            <mxPoint x="-120" y="974.75" as="sourcePoint" />
            <mxPoint x="-217.0000000000107" y="1080" as="targetPoint" />
          </mxGeometry>
        </mxCell>
        <mxCell id="ceR-y8-nLFiyuJuDYNRY-102" value="&amp;lt;&amp;lt;rdf:type&amp;gt;&amp;gt;" style="text;html=1;align=center;verticalAlign=middle;resizable=0;points=[];fontColor=#000000;labelBackgroundColor=#ffffff;" vertex="1" connectable="0" parent="ceR-y8-nLFiyuJuDYNRY-101">
          <mxGeometry x="-0.3277" relative="1" as="geometry">
            <mxPoint x="-16" y="-15" as="offset" />
          </mxGeometry>
        </mxCell>
        <mxCell id="ceR-y8-nLFiyuJuDYNRY-103" value="dcat:Distribution" style="rounded=0;whiteSpace=wrap;html=1;snapToPoint=1;points=[[0.1,0],[0.2,0],[0.3,0],[0.4,0],[0.5,0],[0.6,0],[0.7,0],[0.8,0],[0.9,0],[0,0.1],[0,0.3],[0,0.5],[0,0.7],[0,0.9],[0.1,1],[0.2,1],[0.3,1],[0.4,1],[0.5,1],[0.6,1],[0.7,1],[0.8,1],[0.9,1],[1,0.1],[1,0.3],[1,0.5],[1,0.7],[1,0.9]];" vertex="1" parent="1">
          <mxGeometry x="-360" y="960" width="120" height="30" as="geometry" />
        </mxCell>
      </root>
    </mxGraphModel>
  </diagram>
</mxfile>
