Jul-04 16:17:43.585 [main] DEBUG nextflow.cli.Launcher - $> nextflow run main.nf -params-file config.json
Jul-04 16:17:43.667 [main] INFO  nextflow.cli.CmdRun - N E X T F L O W  ~  version 21.04.3
Jul-04 16:17:43.681 [main] INFO  nextflow.cli.CmdRun - Launching `main.nf` [nostalgic_kilby] - revision: 6f9c32198a
Jul-04 16:17:43.690 [main] DEBUG nextflow.config.ConfigBuilder - Found config local: /home/beavis/repositories/continuous-casting/nextflow.config
Jul-04 16:17:43.691 [main] DEBUG nextflow.config.ConfigBuilder - Parsing config file: /home/beavis/repositories/continuous-casting/nextflow.config
Jul-04 16:17:43.714 [main] DEBUG nextflow.config.ConfigBuilder - Applying config profile: `standard`
Jul-04 16:17:44.108 [main] DEBUG nextflow.plugin.PluginsFacade - Setting up plugin manager > mode=prod; plugins-dir=/home/beavis/.nextflow/plugins
Jul-04 16:17:44.109 [main] DEBUG nextflow.plugin.PluginsFacade - Plugins default=[]
Jul-04 16:17:44.111 [main] DEBUG nextflow.plugin.PluginsFacade - Plugins local root: .nextflow/plr/empty
Jul-04 16:17:44.118 [main] INFO  org.pf4j.DefaultPluginStatusProvider - Enabled plugins: []
Jul-04 16:17:44.119 [main] INFO  org.pf4j.DefaultPluginStatusProvider - Disabled plugins: []
Jul-04 16:17:44.123 [main] INFO  org.pf4j.DefaultPluginManager - PF4J version 3.4.1 in 'deployment' mode
Jul-04 16:17:44.133 [main] INFO  org.pf4j.AbstractPluginManager - No plugins
Jul-04 16:17:44.178 [main] DEBUG nextflow.Session - Session uuid: 321f8d14-8f06-4cf5-861d-74c1a960a397
Jul-04 16:17:44.178 [main] DEBUG nextflow.Session - Run name: nostalgic_kilby
Jul-04 16:17:44.179 [main] DEBUG nextflow.Session - Executor pool size: 16
Jul-04 16:17:44.204 [main] DEBUG nextflow.cli.CmdRun - 
  Version: 21.04.3 build 5560
  Created: 21-07-2021 15:09 UTC (17:09 CEST)
  System: Linux 5.15.0-39-generic
  Runtime: Groovy 3.0.7 on OpenJDK 64-Bit Server VM 11.0.15+10-Ubuntu-0ubuntu0.22.04.1
  Encoding: UTF-8 (UTF-8)
  Process: 1511778@schlepptopVI [127.0.1.1]
  CPUs: 16 - Mem: 31.1 GB (8.3 GB) - Swap: 0 (0)
Jul-04 16:17:44.223 [main] DEBUG nextflow.Session - Work-dir: /home/beavis/repositories/continuous-casting/work [ext2/ext3]
Jul-04 16:17:44.223 [main] DEBUG nextflow.Session - Script base path does not exist or is not a directory: /home/beavis/repositories/continuous-casting/bin
Jul-04 16:17:44.233 [main] DEBUG nextflow.executor.ExecutorFactory - Extension executors providers=[]
Jul-04 16:17:44.241 [main] DEBUG nextflow.Session - Observer factory: DefaultObserverFactory
Jul-04 16:17:44.341 [main] DEBUG nextflow.Session - Session start invoked
Jul-04 16:17:44.582 [main] DEBUG nextflow.script.ScriptRunner - > Launching execution
Jul-04 16:17:44.590 [main] DEBUG nextflow.Session - Workflow process names [dsl1]: mapToRdf
Jul-04 16:17:44.645 [main] WARN  nextflow.script.ScriptBinding - Access to undefined parameter `mappingFile` -- Initialise it to a default value eg. `params.mappingFile = some_value`
Jul-04 16:17:44.706 [main] DEBUG nextflow.executor.ExecutorFactory - << taskConfig executor: null
Jul-04 16:17:44.706 [main] DEBUG nextflow.executor.ExecutorFactory - >> processorType: 'local'
Jul-04 16:17:44.709 [main] DEBUG nextflow.executor.Executor - [warm up] executor > local
Jul-04 16:17:44.713 [main] DEBUG n.processor.LocalPollingMonitor - Creating local task monitor for executor 'local' > cpus=16; memory=31.1 GB; capacity=16; pollInterval=100ms; dumpInterval=5m
Jul-04 16:17:44.766 [main] DEBUG nextflow.script.ScriptRunner - > Await termination 
Jul-04 16:17:44.767 [main] DEBUG nextflow.Session - Session await
Jul-04 16:18:08.480 [SIGINT handler] DEBUG nextflow.Session - Session aborted -- Cause: SIGINT
Jul-04 16:18:08.518 [SIGINT handler] DEBUG nextflow.Session - The following nodes are still active:
[process] mapToRdf
  status=ACTIVE
  port 0: (value) bound ; channel: data
  port 1: (value) OPEN  ; channel: mapping.yaml
  port 2: (cntrl) -     ; channel: $

Jul-04 16:18:08.521 [main] DEBUG nextflow.Session - Session await > all process finished
Jul-04 16:18:08.521 [main] DEBUG nextflow.Session - Session await > all barriers passed
Jul-04 16:18:08.524 [main] DEBUG nextflow.trace.WorkflowStatsObserver - Workflow completed > WorkflowStats[succeededCount=0; failedCount=0; ignoredCount=0; cachedCount=0; pendingCount=0; submittedCount=0; runningCount=0; retriesCount=0; abortedCount=0; succeedDuration=0ms; failedDuration=0ms; cachedDuration=0ms;loadCpus=0; loadMemory=0; peakRunning=0; peakCpus=0; peakMemory=0; ]
Jul-04 16:18:08.602 [main] DEBUG nextflow.CacheDB - Closing CacheDB done
Jul-04 16:18:08.628 [main] DEBUG nextflow.script.ScriptRunner - > Execution complete -- Goodbye
