Jul-04 15:42:13.085 [main] DEBUG nextflow.cli.Launcher - $> nextflow run main.nf -params-file config.json
Jul-04 15:42:13.159 [main] INFO  nextflow.cli.CmdRun - N E X T F L O W  ~  version 21.04.3
Jul-04 15:42:13.172 [main] INFO  nextflow.cli.CmdRun - Launching `main.nf` [sleepy_jepsen] - revision: b708f885d0
Jul-04 15:42:13.182 [main] DEBUG nextflow.config.ConfigBuilder - Found config local: /home/beavis/repositories/continuous-casting/nextflow.config
Jul-04 15:42:13.183 [main] DEBUG nextflow.config.ConfigBuilder - Parsing config file: /home/beavis/repositories/continuous-casting/nextflow.config
Jul-04 15:42:13.204 [main] DEBUG nextflow.config.ConfigBuilder - Applying config profile: `standard`
Jul-04 15:42:13.598 [main] DEBUG nextflow.plugin.PluginsFacade - Setting up plugin manager > mode=prod; plugins-dir=/home/beavis/.nextflow/plugins
Jul-04 15:42:13.599 [main] DEBUG nextflow.plugin.PluginsFacade - Plugins default=[]
Jul-04 15:42:13.600 [main] DEBUG nextflow.plugin.PluginsFacade - Plugins local root: .nextflow/plr/empty
Jul-04 15:42:13.606 [main] INFO  org.pf4j.DefaultPluginStatusProvider - Enabled plugins: []
Jul-04 15:42:13.606 [main] INFO  org.pf4j.DefaultPluginStatusProvider - Disabled plugins: []
Jul-04 15:42:13.609 [main] INFO  org.pf4j.DefaultPluginManager - PF4J version 3.4.1 in 'deployment' mode
Jul-04 15:42:13.615 [main] INFO  org.pf4j.AbstractPluginManager - No plugins
Jul-04 15:42:13.647 [main] DEBUG nextflow.Session - Session uuid: e5f586f7-dc71-4300-8598-3746ea356e50
Jul-04 15:42:13.647 [main] DEBUG nextflow.Session - Run name: sleepy_jepsen
Jul-04 15:42:13.647 [main] DEBUG nextflow.Session - Executor pool size: 16
Jul-04 15:42:13.666 [main] DEBUG nextflow.cli.CmdRun - 
  Version: 21.04.3 build 5560
  Created: 21-07-2021 15:09 UTC (17:09 CEST)
  System: Linux 5.15.0-39-generic
  Runtime: Groovy 3.0.7 on OpenJDK 64-Bit Server VM 11.0.15+10-Ubuntu-0ubuntu0.22.04.1
  Encoding: UTF-8 (UTF-8)
  Process: 1414586@schlepptopVI [127.0.1.1]
  CPUs: 16 - Mem: 31.1 GB (9.2 GB) - Swap: 0 (0)
Jul-04 15:42:13.682 [main] DEBUG nextflow.Session - Work-dir: /home/beavis/repositories/continuous-casting/work [ext2/ext3]
Jul-04 15:42:13.682 [main] DEBUG nextflow.Session - Script base path does not exist or is not a directory: /home/beavis/repositories/continuous-casting/bin
Jul-04 15:42:13.690 [main] DEBUG nextflow.executor.ExecutorFactory - Extension executors providers=[]
Jul-04 15:42:13.698 [main] DEBUG nextflow.Session - Observer factory: DefaultObserverFactory
Jul-04 15:42:13.793 [main] DEBUG nextflow.Session - Session start invoked
Jul-04 15:42:14.008 [main] DEBUG nextflow.script.ScriptRunner - > Launching execution
Jul-04 15:42:14.014 [main] DEBUG nextflow.Session - Workflow process names [dsl1]: mapToRdf
Jul-04 15:42:14.123 [main] DEBUG nextflow.executor.ExecutorFactory - << taskConfig executor: null
Jul-04 15:42:14.124 [main] DEBUG nextflow.executor.ExecutorFactory - >> processorType: 'local'
Jul-04 15:42:14.126 [main] DEBUG nextflow.executor.Executor - [warm up] executor > local
Jul-04 15:42:14.130 [main] DEBUG n.processor.LocalPollingMonitor - Creating local task monitor for executor 'local' > cpus=16; memory=31.1 GB; capacity=16; pollInterval=100ms; dumpInterval=5m
Jul-04 15:42:14.180 [main] DEBUG nextflow.script.ScriptRunner - > Await termination 
Jul-04 15:42:14.180 [main] DEBUG nextflow.Session - Session await
Jul-04 15:42:14.629 [Actor Thread 3] DEBUG n.util.BlockingThreadExecutorFactory - Thread pool name=FileTransfer; maxThreads=48; maxQueueSize=144; keepAlive=1m
Jul-04 15:42:14.640 [FileTransfer-thread-1] DEBUG nextflow.file.FilePorter - Local cache found for foreign file http://139.18.211.135:5001/dataset/49b7432c-8cbb-461b-8db1-d75a1bfcd747/resource/da6c5cae-0ad5-4157-8c95-40c9115253ce/download/leg.-3-cuni20-2021_10_07__11_38_22_comlog.txt at /home/beavis/repositories/continuous-casting/work/stage/f9/0940c5a882d869b2daa7567ec7424d/leg.-3-cuni20-2021_10_07__11_38_22_comlog.txt
Jul-04 15:42:14.712 [Task submitter] DEBUG nextflow.executor.LocalTaskHandler - Launch cmd line: /bin/bash -ue .command.run
Jul-04 15:42:14.715 [Task submitter] INFO  nextflow.Session - [e6/d92728] Submitted process > mapToRdf
Jul-04 15:42:24.165 [Task monitor] DEBUG n.processor.TaskPollingMonitor - Task completed > TaskHandler[id: 1; name: mapToRdf; status: COMPLETED; exit: 0; error: -; workDir: /home/beavis/repositories/continuous-casting/work/e6/d9272881119b8aebeb3886c4030a00]
Jul-04 15:42:24.177 [main] DEBUG nextflow.Session - Session await > all process finished
Jul-04 15:42:24.263 [main] DEBUG nextflow.Session - Session await > all barriers passed
Jul-04 15:42:24.270 [main] DEBUG nextflow.trace.WorkflowStatsObserver - Workflow completed > WorkflowStats[succeededCount=1; failedCount=0; ignoredCount=0; cachedCount=0; pendingCount=0; submittedCount=0; runningCount=0; retriesCount=0; abortedCount=0; succeedDuration=9.4s; failedDuration=0ms; cachedDuration=0ms;loadCpus=0; loadMemory=0; peakRunning=1; peakCpus=1; peakMemory=0; ]
Jul-04 15:42:24.438 [main] DEBUG nextflow.CacheDB - Closing CacheDB done
Jul-04 15:42:24.459 [main] DEBUG nextflow.script.ScriptRunner - > Execution complete -- Goodbye
