<mxfile host="app.diagrams.net" modified="2023-03-29T15:15:41.203Z" agent="Mozilla/5.0 (Windows NT 10.0; Win64; x64) AppleWebKit/537.36 (KHTML, like Gecko) Chrome/111.0.0.0 Safari/537.36 Edg/111.0.1661.54" etag="OnMxhjKYxxrXsR9LkOaC" version="21.1.2" type="gitlab">
  <diagram name="Page-1" id="4GzTeZ2f9IDtOKxZkM5V">
    <mxGraphModel dx="851" dy="582" grid="1" gridSize="10" guides="1" tooltips="1" connect="1" arrows="1" fold="1" page="1" pageScale="1" pageWidth="827" pageHeight="1169" math="0" shadow="0">
      <root>
        <mxCell id="0" />
        <mxCell id="1" parent="0" />
        <mxCell id="Py2-osz_EyMqtM_qYo2S-1" value="&lt;div&gt;&lt;/div&gt;&lt;b&gt;base&lt;/b&gt;: https://kupferdigital.gitlab.io/process-graphs/workshop-example/index.ttl/&lt;div style=&quot;border-color: var(--border-color);&quot;&gt;&lt;span style=&quot;border-color: var(--border-color); font-family: Verdana; background-color: initial;&quot;&gt;mseo:&amp;nbsp;https://purl.matolab.org/mseo/mid/&lt;/span&gt;&lt;/div&gt;&lt;div style=&quot;border-color: var(--border-color);&quot;&gt;&lt;span style=&quot;border-color: var(--border-color); font-family: Verdana; background-color: initial;&quot;&gt;iof: https://spec.industrialontologies.org/ontology/core/Core/&lt;/span&gt;&lt;/div&gt;&lt;div style=&quot;border-color: var(--border-color);&quot;&gt;&lt;span style=&quot;border-color: var(--border-color); font-family: Verdana; background-color: initial;&quot;&gt;&lt;span style=&quot;border-color: var(--border-color); font-family: Helvetica;&quot;&gt;iof-av:&amp;nbsp;&lt;/span&gt;&lt;span style=&quot;border-color: var(--border-color); font-family: Helvetica;&quot;&gt;https://spec.industrialontologies.org/ontology/core/meta/AnnotationVocabulary/&lt;/span&gt;&lt;br&gt;&lt;/span&gt;&lt;/div&gt;&lt;div style=&quot;border-color: var(--border-color);&quot;&gt;&lt;span style=&quot;border-color: var(--border-color); font-family: Verdana; background-color: initial;&quot;&gt;obo: http://purl.obolibrary.org/obo/&lt;/span&gt;&lt;/div&gt;&lt;div style=&quot;border-color: var(--border-color);&quot;&gt;&lt;span style=&quot;border-color: var(--border-color); font-family: Verdana; background-color: initial;&quot;&gt;terms:&amp;nbsp;&lt;/span&gt;&lt;font style=&quot;border-color: var(--border-color);&quot; face=&quot;Verdana&quot;&gt;http://purl.org/dc/terms/&lt;/font&gt;&lt;/div&gt;&lt;div style=&quot;border-color: var(--border-color);&quot;&gt;&lt;span style=&quot;border-color: var(--border-color); background-color: initial; font-family: Verdana;&quot;&gt;qudtk:&amp;nbsp;http://qudt.org/vocab/quantitykind/&lt;/span&gt;&lt;/div&gt;&lt;div style=&quot;border-color: var(--border-color);&quot;&gt;&lt;span style=&quot;border-color: var(--border-color); font-family: Verdana; background-color: initial;&quot;&gt;qudt:&amp;nbsp;http://qudt.org/schema/qudt/&lt;/span&gt;&lt;/div&gt;" style="shape=note;whiteSpace=wrap;html=1;backgroundOutline=1;darkOpacity=0.05;align=left;" parent="1" vertex="1">
          <mxGeometry x="30" y="50" width="510" height="127.57" as="geometry" />
        </mxCell>
        <mxCell id="Py2-osz_EyMqtM_qYo2S-2" value="&lt;div&gt;&lt;b&gt;dc:creator:&lt;/b&gt;&amp;nbsp;Thomas Hanke&lt;/div&gt;&lt;div&gt;&lt;b&gt;owl:versionInfo:&lt;/b&gt; 0.0.1&lt;/div&gt;&lt;div&gt;&lt;b&gt;dc:title:&lt;/b&gt;&amp;nbsp;my_method_long_name&lt;/div&gt;" style="shape=document;whiteSpace=wrap;html=1;boundedLbl=1;labelBackgroundColor=#ffffff;strokeColor=#000000;fontSize=12;fontColor=#000000;size=0.23333333333333334;align=left;" parent="1" vertex="1">
          <mxGeometry x="30" y="185.99582914572886" width="253" height="85.92964824120604" as="geometry" />
        </mxCell>
        <mxCell id="W1JiaCnCX7zwp9q-DU5L-3" value="iof:MeasurementProcess" style="rounded=0;whiteSpace=wrap;html=1;snapToPoint=1;points=[[0.1,0],[0.2,0],[0.3,0],[0.4,0],[0.5,0],[0.6,0],[0.7,0],[0.8,0],[0.9,0],[0,0.1],[0,0.3],[0,0.5],[0,0.7],[0,0.9],[0.1,1],[0.2,1],[0.3,1],[0.4,1],[0.5,1],[0.6,1],[0.7,1],[0.8,1],[0.9,1],[1,0.1],[1,0.3],[1,0.5],[1,0.7],[1,0.9]];align=left;" vertex="1" parent="1">
          <mxGeometry x="30" y="714.5" width="170" height="30" as="geometry" />
        </mxCell>
        <mxCell id="W1JiaCnCX7zwp9q-DU5L-54" value="iof:isOutput" style="edgeStyle=orthogonalEdgeStyle;rounded=0;orthogonalLoop=1;jettySize=auto;html=1;exitX=1;exitY=0.3;exitDx=0;exitDy=0;entryX=0;entryY=0.5;entryDx=0;entryDy=0;" edge="1" parent="1" source="W1JiaCnCX7zwp9q-DU5L-4" target="W1JiaCnCX7zwp9q-DU5L-35">
          <mxGeometry relative="1" as="geometry" />
        </mxCell>
        <mxCell id="W1JiaCnCX7zwp9q-DU5L-4" value="&lt;u&gt;:LengthMeasurementProcess&lt;br&gt;&lt;/u&gt;" style="rounded=0;whiteSpace=wrap;html=1;snapToPoint=1;points=[[0.1,0],[0.2,0],[0.3,0],[0.4,0],[0.5,0],[0.6,0],[0.7,0],[0.8,0],[0.9,0],[0,0.1],[0,0.3],[0,0.5],[0,0.7],[0,0.9],[0.1,1],[0.2,1],[0.3,1],[0.4,1],[0.5,1],[0.6,1],[0.7,1],[0.8,1],[0.9,1],[1,0.1],[1,0.3],[1,0.5],[1,0.7],[1,0.9]];align=left;fillColor=#d5e8d4;strokeColor=#82b366;" vertex="1" parent="1">
          <mxGeometry x="30" y="744.5" width="170" height="30" as="geometry" />
        </mxCell>
        <mxCell id="W1JiaCnCX7zwp9q-DU5L-8" value="iof:Agent" style="rounded=0;whiteSpace=wrap;html=1;snapToPoint=1;points=[[0.1,0],[0.2,0],[0.3,0],[0.4,0],[0.5,0],[0.6,0],[0.7,0],[0.8,0],[0.9,0],[0,0.1],[0,0.3],[0,0.5],[0,0.7],[0,0.9],[0.1,1],[0.2,1],[0.3,1],[0.4,1],[0.5,1],[0.6,1],[0.7,1],[0.8,1],[0.9,1],[1,0.1],[1,0.3],[1,0.5],[1,0.7],[1,0.9]];align=left;" vertex="1" parent="1">
          <mxGeometry x="100" y="370.0000000000002" width="100" height="30" as="geometry" />
        </mxCell>
        <mxCell id="W1JiaCnCX7zwp9q-DU5L-9" value="&lt;u&gt;:Operator&lt;br&gt;&lt;/u&gt;" style="rounded=0;whiteSpace=wrap;html=1;snapToPoint=1;points=[[0.1,0],[0.2,0],[0.3,0],[0.4,0],[0.5,0],[0.6,0],[0.7,0],[0.8,0],[0.9,0],[0,0.1],[0,0.3],[0,0.5],[0,0.7],[0,0.9],[0.1,1],[0.2,1],[0.3,1],[0.4,1],[0.5,1],[0.6,1],[0.7,1],[0.8,1],[0.9,1],[1,0.1],[1,0.3],[1,0.5],[1,0.7],[1,0.9]];align=left;" vertex="1" parent="1">
          <mxGeometry x="100" y="400.0000000000002" width="100" height="30" as="geometry" />
        </mxCell>
        <mxCell id="W1JiaCnCX7zwp9q-DU5L-10" value="iof:designatedBy" style="edgeStyle=orthogonalEdgeStyle;rounded=0;orthogonalLoop=1;jettySize=auto;html=1;exitX=1;exitY=0.1;exitDx=0;exitDy=0;fontSize=12;entryX=0;entryY=0.1;entryDx=0;entryDy=0;" edge="1" source="W1JiaCnCX7zwp9q-DU5L-9" target="W1JiaCnCX7zwp9q-DU5L-12" parent="1">
          <mxGeometry relative="1" as="geometry">
            <mxPoint x="280" y="483.0000000000002" as="sourcePoint" />
            <mxPoint x="280" y="420.0000000000001" as="targetPoint" />
          </mxGeometry>
        </mxCell>
        <mxCell id="W1JiaCnCX7zwp9q-DU5L-11" value="iof:DesignativeInformationContentEntity" style="rounded=0;whiteSpace=wrap;html=1;snapToPoint=1;points=[[0.1,0],[0.2,0],[0.3,0],[0.4,0],[0.5,0],[0.6,0],[0.7,0],[0.8,0],[0.9,0],[0,0.1],[0,0.3],[0,0.5],[0,0.7],[0,0.9],[0.1,1],[0.2,1],[0.3,1],[0.4,1],[0.5,1],[0.6,1],[0.7,1],[0.8,1],[0.9,1],[1,0.1],[1,0.3],[1,0.5],[1,0.7],[1,0.9]];align=left;" vertex="1" parent="1">
          <mxGeometry x="360" y="370.0000000000002" width="220" height="30" as="geometry" />
        </mxCell>
        <mxCell id="W1JiaCnCX7zwp9q-DU5L-12" value="&lt;u&gt;:OperatorID&lt;br&gt;&lt;/u&gt;" style="rounded=0;whiteSpace=wrap;html=1;snapToPoint=1;points=[[0.1,0],[0.2,0],[0.3,0],[0.4,0],[0.5,0],[0.6,0],[0.7,0],[0.8,0],[0.9,0],[0,0.1],[0,0.3],[0,0.5],[0,0.7],[0,0.9],[0.1,1],[0.2,1],[0.3,1],[0.4,1],[0.5,1],[0.6,1],[0.7,1],[0.8,1],[0.9,1],[1,0.1],[1,0.3],[1,0.5],[1,0.7],[1,0.9]];align=left;fillColor=#fff2cc;strokeColor=#d6b656;" vertex="1" parent="1">
          <mxGeometry x="360" y="400.0000000000002" width="220" height="30" as="geometry" />
        </mxCell>
        <mxCell id="W1JiaCnCX7zwp9q-DU5L-13" value="obo:BFO_0000166" style="edgeStyle=orthogonalEdgeStyle;rounded=0;orthogonalLoop=1;jettySize=auto;html=1;fontSize=12;entryX=0.5;entryY=1;entryDx=0;entryDy=0;exitX=0.6;exitY=0;exitDx=0;exitDy=0;" edge="1" source="W1JiaCnCX7zwp9q-DU5L-3" target="W1JiaCnCX7zwp9q-DU5L-9" parent="1">
          <mxGeometry x="0.116" y="-8" relative="1" as="geometry">
            <mxPoint x="150" y="620.0000000000002" as="sourcePoint" />
            <mxPoint x="1250" y="1258.0000000000002" as="targetPoint" />
            <mxPoint as="offset" />
          </mxGeometry>
        </mxCell>
        <mxCell id="W1JiaCnCX7zwp9q-DU5L-14" value="iof:PlanSpecification" style="rounded=0;whiteSpace=wrap;html=1;snapToPoint=1;points=[[0.1,0],[0.2,0],[0.3,0],[0.4,0],[0.5,0],[0.6,0],[0.7,0],[0.8,0],[0.9,0],[0,0.1],[0,0.3],[0,0.5],[0,0.7],[0,0.9],[0.1,1],[0.2,1],[0.3,1],[0.4,1],[0.5,1],[0.6,1],[0.7,1],[0.8,1],[0.9,1],[1,0.1],[1,0.3],[1,0.5],[1,0.7],[1,0.9]];align=left;" vertex="1" parent="1">
          <mxGeometry x="165" y="440.0000000000002" width="100" height="30" as="geometry" />
        </mxCell>
        <mxCell id="W1JiaCnCX7zwp9q-DU5L-15" value="&lt;u&gt;:TestPlan&lt;br&gt;&lt;/u&gt;" style="rounded=0;whiteSpace=wrap;html=1;snapToPoint=1;points=[[0.1,0],[0.2,0],[0.3,0],[0.4,0],[0.5,0],[0.6,0],[0.7,0],[0.8,0],[0.9,0],[0,0.1],[0,0.3],[0,0.5],[0,0.7],[0,0.9],[0.1,1],[0.2,1],[0.3,1],[0.4,1],[0.5,1],[0.6,1],[0.7,1],[0.8,1],[0.9,1],[1,0.1],[1,0.3],[1,0.5],[1,0.7],[1,0.9]];align=left;" vertex="1" parent="1">
          <mxGeometry x="165" y="470.0000000000002" width="100" height="30" as="geometry" />
        </mxCell>
        <mxCell id="W1JiaCnCX7zwp9q-DU5L-16" value="iof:designatedBy" style="edgeStyle=orthogonalEdgeStyle;rounded=0;orthogonalLoop=1;jettySize=auto;html=1;exitX=1;exitY=0.1;exitDx=0;exitDy=0;fontSize=12;entryX=0;entryY=0.1;entryDx=0;entryDy=0;" edge="1" source="W1JiaCnCX7zwp9q-DU5L-15" target="W1JiaCnCX7zwp9q-DU5L-18" parent="1">
          <mxGeometry relative="1" as="geometry">
            <mxPoint x="345" y="553.0000000000002" as="sourcePoint" />
            <mxPoint x="345" y="490.0000000000001" as="targetPoint" />
          </mxGeometry>
        </mxCell>
        <mxCell id="W1JiaCnCX7zwp9q-DU5L-17" value="iof:DesignativeInformationContentEntity" style="rounded=0;whiteSpace=wrap;html=1;snapToPoint=1;points=[[0.1,0],[0.2,0],[0.3,0],[0.4,0],[0.5,0],[0.6,0],[0.7,0],[0.8,0],[0.9,0],[0,0.1],[0,0.3],[0,0.5],[0,0.7],[0,0.9],[0.1,1],[0.2,1],[0.3,1],[0.4,1],[0.5,1],[0.6,1],[0.7,1],[0.8,1],[0.9,1],[1,0.1],[1,0.3],[1,0.5],[1,0.7],[1,0.9]];align=left;" vertex="1" parent="1">
          <mxGeometry x="604" y="420.0000000000002" width="215" height="30" as="geometry" />
        </mxCell>
        <mxCell id="W1JiaCnCX7zwp9q-DU5L-18" value="&lt;u&gt;:TestPlanName&lt;br&gt;&lt;/u&gt;" style="rounded=0;whiteSpace=wrap;html=1;snapToPoint=1;points=[[0.1,0],[0.2,0],[0.3,0],[0.4,0],[0.5,0],[0.6,0],[0.7,0],[0.8,0],[0.9,0],[0,0.1],[0,0.3],[0,0.5],[0,0.7],[0,0.9],[0.1,1],[0.2,1],[0.3,1],[0.4,1],[0.5,1],[0.6,1],[0.7,1],[0.8,1],[0.9,1],[1,0.1],[1,0.3],[1,0.5],[1,0.7],[1,0.9]];align=left;fillColor=#fff2cc;strokeColor=#d6b656;" vertex="1" parent="1">
          <mxGeometry x="604" y="450.0000000000002" width="215" height="30" as="geometry" />
        </mxCell>
        <mxCell id="W1JiaCnCX7zwp9q-DU5L-19" value="iof:prescribedBy" style="edgeStyle=orthogonalEdgeStyle;rounded=0;orthogonalLoop=1;jettySize=auto;html=1;fontSize=12;entryX=0.5;entryY=1;entryDx=0;entryDy=0;exitX=0.7;exitY=0;exitDx=0;exitDy=0;" edge="1" source="W1JiaCnCX7zwp9q-DU5L-3" target="W1JiaCnCX7zwp9q-DU5L-15" parent="1">
          <mxGeometry relative="1" as="geometry">
            <mxPoint x="155" y="620.0000000000002" as="sourcePoint" />
            <mxPoint x="1315" y="1328.0000000000002" as="targetPoint" />
          </mxGeometry>
        </mxCell>
        <mxCell id="W1JiaCnCX7zwp9q-DU5L-20" value="obo:BFO_0000008" style="rounded=0;whiteSpace=wrap;html=1;snapToPoint=1;points=[[0.1,0],[0.2,0],[0.3,0],[0.4,0],[0.5,0],[0.6,0],[0.7,0],[0.8,0],[0.9,0],[0,0.1],[0,0.3],[0,0.5],[0,0.7],[0,0.9],[0.1,1],[0.2,1],[0.3,1],[0.4,1],[0.5,1],[0.6,1],[0.7,1],[0.8,1],[0.9,1],[1,0.1],[1,0.3],[1,0.5],[1,0.7],[1,0.9]];align=left;" vertex="1" parent="1">
          <mxGeometry x="230" y="510.0000000000002" width="140" height="30" as="geometry" />
        </mxCell>
        <mxCell id="W1JiaCnCX7zwp9q-DU5L-21" value="&lt;u&gt;:ExperimentTimeInterval&lt;br&gt;&lt;/u&gt;" style="rounded=0;whiteSpace=wrap;html=1;snapToPoint=1;points=[[0.1,0],[0.2,0],[0.3,0],[0.4,0],[0.5,0],[0.6,0],[0.7,0],[0.8,0],[0.9,0],[0,0.1],[0,0.3],[0,0.5],[0,0.7],[0,0.9],[0.1,1],[0.2,1],[0.3,1],[0.4,1],[0.5,1],[0.6,1],[0.7,1],[0.8,1],[0.9,1],[1,0.1],[1,0.3],[1,0.5],[1,0.7],[1,0.9]];align=left;" vertex="1" parent="1">
          <mxGeometry x="230" y="540.0000000000002" width="140" height="30" as="geometry" />
        </mxCell>
        <mxCell id="W1JiaCnCX7zwp9q-DU5L-22" value="obo:BFO_0000199" style="edgeStyle=orthogonalEdgeStyle;rounded=0;orthogonalLoop=1;jettySize=auto;html=1;exitX=0.8;exitY=0;exitDx=0;exitDy=0;entryX=0.5;entryY=1;entryDx=0;entryDy=0;" edge="1" source="W1JiaCnCX7zwp9q-DU5L-3" target="W1JiaCnCX7zwp9q-DU5L-21" parent="1">
          <mxGeometry relative="1" as="geometry" />
        </mxCell>
        <mxCell id="W1JiaCnCX7zwp9q-DU5L-25" value="iof:PlannedProcess" style="rounded=0;whiteSpace=wrap;html=1;snapToPoint=1;points=[[0.1,0],[0.2,0],[0.3,0],[0.4,0],[0.5,0],[0.6,0],[0.7,0],[0.8,0],[0.9,0],[0,0.1],[0,0.3],[0,0.5],[0,0.7],[0,0.9],[0.1,1],[0.2,1],[0.3,1],[0.4,1],[0.5,1],[0.6,1],[0.7,1],[0.8,1],[0.9,1],[1,0.1],[1,0.3],[1,0.5],[1,0.7],[1,0.9]];align=left;" vertex="1" parent="1">
          <mxGeometry x="350" y="586.0000000000002" width="160" height="30" as="geometry" />
        </mxCell>
        <mxCell id="W1JiaCnCX7zwp9q-DU5L-26" value="&lt;u&gt;:Project&lt;br&gt;&lt;/u&gt;" style="rounded=0;whiteSpace=wrap;html=1;snapToPoint=1;points=[[0.1,0],[0.2,0],[0.3,0],[0.4,0],[0.5,0],[0.6,0],[0.7,0],[0.8,0],[0.9,0],[0,0.1],[0,0.3],[0,0.5],[0,0.7],[0,0.9],[0.1,1],[0.2,1],[0.3,1],[0.4,1],[0.5,1],[0.6,1],[0.7,1],[0.8,1],[0.9,1],[1,0.1],[1,0.3],[1,0.5],[1,0.7],[1,0.9]];align=left;fillColor=#d5e8d4;strokeColor=#82b366;" vertex="1" parent="1">
          <mxGeometry x="350" y="616.0000000000002" width="160" height="30" as="geometry" />
        </mxCell>
        <mxCell id="W1JiaCnCX7zwp9q-DU5L-27" value="iof:designatedBy" style="edgeStyle=orthogonalEdgeStyle;rounded=0;orthogonalLoop=1;jettySize=auto;html=1;fontSize=12;snapToPoint=1;" edge="1" source="W1JiaCnCX7zwp9q-DU5L-26" target="W1JiaCnCX7zwp9q-DU5L-29" parent="1">
          <mxGeometry relative="1" as="geometry">
            <mxPoint x="180.37037037037044" y="732.1503703703704" as="sourcePoint" />
            <mxPoint x="220" y="1961.7800000000004" as="targetPoint" />
            <Array as="points">
              <mxPoint x="430" y="555.0000000000002" />
            </Array>
          </mxGeometry>
        </mxCell>
        <mxCell id="W1JiaCnCX7zwp9q-DU5L-28" value="iof:Identifier" style="rounded=0;whiteSpace=wrap;html=1;snapToPoint=1;points=[[0.1,0],[0.2,0],[0.3,0],[0.4,0],[0.5,0],[0.6,0],[0.7,0],[0.8,0],[0.9,0],[0,0.1],[0,0.3],[0,0.5],[0,0.7],[0,0.9],[0.1,1],[0.2,1],[0.3,1],[0.4,1],[0.5,1],[0.6,1],[0.7,1],[0.8,1],[0.9,1],[1,0.1],[1,0.3],[1,0.5],[1,0.7],[1,0.9]];align=left;" vertex="1" parent="1">
          <mxGeometry x="604" y="510.0000000000002" width="170" height="30" as="geometry" />
        </mxCell>
        <mxCell id="W1JiaCnCX7zwp9q-DU5L-29" value="&lt;u&gt;:ProjectID&lt;br&gt;&lt;/u&gt;" style="rounded=0;whiteSpace=wrap;html=1;snapToPoint=1;points=[[0.1,0],[0.2,0],[0.3,0],[0.4,0],[0.5,0],[0.6,0],[0.7,0],[0.8,0],[0.9,0],[0,0.1],[0,0.3],[0,0.5],[0,0.7],[0,0.9],[0.1,1],[0.2,1],[0.3,1],[0.4,1],[0.5,1],[0.6,1],[0.7,1],[0.8,1],[0.9,1],[1,0.1],[1,0.3],[1,0.5],[1,0.7],[1,0.9]];align=left;fillColor=#fff2cc;strokeColor=#d6b656;" vertex="1" parent="1">
          <mxGeometry x="604" y="540.0000000000002" width="170" height="30" as="geometry" />
        </mxCell>
        <mxCell id="W1JiaCnCX7zwp9q-DU5L-30" value="obo:BFO_0000117" style="edgeStyle=orthogonalEdgeStyle;rounded=0;orthogonalLoop=1;jettySize=auto;html=1;exitX=0.4;exitY=1;exitDx=0;exitDy=0;snapToPoint=1;entryX=0.9;entryY=0;entryDx=0;entryDy=0;elbow=vertical;" edge="1" source="W1JiaCnCX7zwp9q-DU5L-26" target="W1JiaCnCX7zwp9q-DU5L-3" parent="1">
          <mxGeometry x="0.0551" relative="1" as="geometry">
            <mxPoint as="offset" />
            <mxPoint x="230" y="-1094.9999999999998" as="sourcePoint" />
            <mxPoint x="230" y="790.0000000000002" as="targetPoint" />
          </mxGeometry>
        </mxCell>
        <mxCell id="W1JiaCnCX7zwp9q-DU5L-31" value="has occurrent part" style="text;html=1;strokeColor=none;fillColor=none;align=center;verticalAlign=middle;whiteSpace=wrap;rounded=0;fontSize=10;fontStyle=2;snapToPoint=1;" vertex="1" parent="1">
          <mxGeometry x="200" y="646.0000000000002" width="130" height="30" as="geometry" />
        </mxCell>
        <mxCell id="W1JiaCnCX7zwp9q-DU5L-32" value="occupies temporal region" style="text;html=1;strokeColor=none;fillColor=none;align=center;verticalAlign=middle;whiteSpace=wrap;rounded=0;fontSize=10;fontStyle=2;snapToPoint=1;" vertex="1" parent="1">
          <mxGeometry x="135" y="617.0000000000002" width="130" height="30" as="geometry" />
        </mxCell>
        <mxCell id="W1JiaCnCX7zwp9q-DU5L-33" value="participates at all times" style="text;html=1;strokeColor=none;fillColor=none;align=center;verticalAlign=middle;whiteSpace=wrap;rounded=0;fontSize=10;fontStyle=2;snapToPoint=1;" vertex="1" parent="1">
          <mxGeometry x="80" y="550.0000000000002" width="130" height="30" as="geometry" />
        </mxCell>
        <mxCell id="W1JiaCnCX7zwp9q-DU5L-34" value="iof:MeasurementInformationContentEntity" style="rounded=0;whiteSpace=wrap;html=1;snapToPoint=1;points=[[0.1,0],[0.2,0],[0.3,0],[0.4,0],[0.5,0],[0.6,0],[0.7,0],[0.8,0],[0.9,0],[0,0.1],[0,0.3],[0,0.5],[0,0.7],[0,0.9],[0.1,1],[0.2,1],[0.3,1],[0.4,1],[0.5,1],[0.6,1],[0.7,1],[0.8,1],[0.9,1],[1,0.1],[1,0.3],[1,0.5],[1,0.7],[1,0.9]];align=left;" vertex="1" parent="1">
          <mxGeometry x="490" y="830" width="230" height="30" as="geometry" />
        </mxCell>
        <mxCell id="W1JiaCnCX7zwp9q-DU5L-35" value="&lt;u&gt;:Measurements&lt;br&gt;&lt;/u&gt;" style="rounded=0;whiteSpace=wrap;html=1;snapToPoint=1;points=[[0.1,0],[0.2,0],[0.3,0],[0.4,0],[0.5,0],[0.6,0],[0.7,0],[0.8,0],[0.9,0],[0,0.1],[0,0.3],[0,0.5],[0,0.7],[0,0.9],[0.1,1],[0.2,1],[0.3,1],[0.4,1],[0.5,1],[0.6,1],[0.7,1],[0.8,1],[0.9,1],[1,0.1],[1,0.3],[1,0.5],[1,0.7],[1,0.9]];align=left;fillColor=#fff2cc;strokeColor=#d6b656;" vertex="1" parent="1">
          <mxGeometry x="490" y="860" width="230" height="30" as="geometry" />
        </mxCell>
        <mxCell id="W1JiaCnCX7zwp9q-DU5L-36" value="obo:BFO_0000176" style="edgeStyle=orthogonalEdgeStyle;rounded=0;orthogonalLoop=1;jettySize=auto;html=1;fontSize=12;" edge="1" source="W1JiaCnCX7zwp9q-DU5L-39" target="W1JiaCnCX7zwp9q-DU5L-35" parent="1">
          <mxGeometry x="0.0625" relative="1" as="geometry">
            <mxPoint x="235" y="558.5" as="sourcePoint" />
            <mxPoint x="510" y="930" as="targetPoint" />
            <mxPoint as="offset" />
          </mxGeometry>
        </mxCell>
        <mxCell id="W1JiaCnCX7zwp9q-DU5L-37" value="continuante part at some time" style="text;html=1;strokeColor=none;fillColor=none;align=center;verticalAlign=middle;whiteSpace=wrap;rounded=0;fontSize=10;fontStyle=2;snapToPoint=1;" vertex="1" parent="1">
          <mxGeometry x="505" y="902" width="200" height="30" as="geometry" />
        </mxCell>
        <mxCell id="W1JiaCnCX7zwp9q-DU5L-38" value="iof:ValueExpression" style="rounded=0;whiteSpace=wrap;html=1;snapToPoint=1;points=[[0.1,0],[0.2,0],[0.3,0],[0.4,0],[0.5,0],[0.6,0],[0.7,0],[0.8,0],[0.9,0],[0,0.1],[0,0.3],[0,0.5],[0,0.7],[0,0.9],[0.1,1],[0.2,1],[0.3,1],[0.4,1],[0.5,1],[0.6,1],[0.7,1],[0.8,1],[0.9,1],[1,0.1],[1,0.3],[1,0.5],[1,0.7],[1,0.9]];align=left;" vertex="1" parent="1">
          <mxGeometry x="490" y="945.5" width="230" height="30" as="geometry" />
        </mxCell>
        <mxCell id="W1JiaCnCX7zwp9q-DU5L-39" value="&lt;u&gt;:LengthMeasurement&lt;br&gt;&lt;/u&gt;" style="rounded=0;whiteSpace=wrap;html=1;snapToPoint=1;points=[[0.1,0],[0.2,0],[0.3,0],[0.4,0],[0.5,0],[0.6,0],[0.7,0],[0.8,0],[0.9,0],[0,0.1],[0,0.3],[0,0.5],[0,0.7],[0,0.9],[0.1,1],[0.2,1],[0.3,1],[0.4,1],[0.5,1],[0.6,1],[0.7,1],[0.8,1],[0.9,1],[1,0.1],[1,0.3],[1,0.5],[1,0.7],[1,0.9]];align=left;fillColor=#fff2cc;strokeColor=#d6b656;" vertex="1" parent="1">
          <mxGeometry x="490" y="975.5" width="230" height="30" as="geometry" />
        </mxCell>
        <mxCell id="W1JiaCnCX7zwp9q-DU5L-40" value="obo:BFO_0000019" style="rounded=0;whiteSpace=wrap;html=1;snapToPoint=1;points=[[0.1,0],[0.2,0],[0.3,0],[0.4,0],[0.5,0],[0.6,0],[0.7,0],[0.8,0],[0.9,0],[0,0.1],[0,0.3],[0,0.5],[0,0.7],[0,0.9],[0.1,1],[0.2,1],[0.3,1],[0.4,1],[0.5,1],[0.6,1],[0.7,1],[0.8,1],[0.9,1],[1,0.1],[1,0.3],[1,0.5],[1,0.7],[1,0.9]];" vertex="1" parent="1">
          <mxGeometry x="250" y="1030" width="170" height="30" as="geometry" />
        </mxCell>
        <mxCell id="W1JiaCnCX7zwp9q-DU5L-41" value="&lt;u&gt;:MySpecimenLength&lt;/u&gt;" style="rounded=0;whiteSpace=wrap;html=1;snapToPoint=1;points=[[0.1,0],[0.2,0],[0.3,0],[0.4,0],[0.5,0],[0.6,0],[0.7,0],[0.8,0],[0.9,0],[0,0.1],[0,0.3],[0,0.5],[0,0.7],[0,0.9],[0.1,1],[0.2,1],[0.3,1],[0.4,1],[0.5,1],[0.6,1],[0.7,1],[0.8,1],[0.9,1],[1,0.1],[1,0.3],[1,0.5],[1,0.7],[1,0.9]];" vertex="1" parent="1">
          <mxGeometry x="250" y="1060" width="170" height="30" as="geometry" />
        </mxCell>
        <mxCell id="W1JiaCnCX7zwp9q-DU5L-42" value="mseo:MeasurementDevice" style="rounded=0;whiteSpace=wrap;html=1;snapToPoint=1;points=[[0.1,0],[0.2,0],[0.3,0],[0.4,0],[0.5,0],[0.6,0],[0.7,0],[0.8,0],[0.9,0],[0,0.1],[0,0.3],[0,0.5],[0,0.7],[0,0.9],[0.1,1],[0.2,1],[0.3,1],[0.4,1],[0.5,1],[0.6,1],[0.7,1],[0.8,1],[0.9,1],[1,0.1],[1,0.3],[1,0.5],[1,0.7],[1,0.9]];" vertex="1" parent="1">
          <mxGeometry x="960" y="945.5" width="170" height="30" as="geometry" />
        </mxCell>
        <mxCell id="W1JiaCnCX7zwp9q-DU5L-43" value="&lt;u&gt;:Caliper&lt;/u&gt;" style="rounded=0;whiteSpace=wrap;html=1;snapToPoint=1;points=[[0.1,0],[0.2,0],[0.3,0],[0.4,0],[0.5,0],[0.6,0],[0.7,0],[0.8,0],[0.9,0],[0,0.1],[0,0.3],[0,0.5],[0,0.7],[0,0.9],[0.1,1],[0.2,1],[0.3,1],[0.4,1],[0.5,1],[0.6,1],[0.7,1],[0.8,1],[0.9,1],[1,0.1],[1,0.3],[1,0.5],[1,0.7],[1,0.9]];" vertex="1" parent="1">
          <mxGeometry x="960" y="975.5" width="170" height="30" as="geometry" />
        </mxCell>
        <mxCell id="W1JiaCnCX7zwp9q-DU5L-44" value="iof:measuredByAtSomeTime" style="edgeStyle=orthogonalEdgeStyle;rounded=0;orthogonalLoop=1;jettySize=auto;html=1;fontSize=12;snapToPoint=1;exitX=1;exitY=0.7;exitDx=0;exitDy=0;entryX=0;entryY=0.7;entryDx=0;entryDy=0;" edge="1" source="W1JiaCnCX7zwp9q-DU5L-39" target="W1JiaCnCX7zwp9q-DU5L-43" parent="1">
          <mxGeometry relative="1" as="geometry">
            <mxPoint x="720" y="919.5" as="sourcePoint" />
            <mxPoint x="730" y="1054.5" as="targetPoint" />
          </mxGeometry>
        </mxCell>
        <mxCell id="W1JiaCnCX7zwp9q-DU5L-45" value="iof:designatedBy" style="edgeStyle=orthogonalEdgeStyle;rounded=0;orthogonalLoop=1;jettySize=auto;html=1;fontSize=12;fontColor=#000000;snapToPoint=1;" edge="1" source="W1JiaCnCX7zwp9q-DU5L-43" target="W1JiaCnCX7zwp9q-DU5L-48" parent="1">
          <mxGeometry x="105" y="-59.5" as="geometry">
            <mxPoint x="676" y="1090.5" as="sourcePoint" />
            <mxPoint x="661.0000000000005" y="1130.4999999999998" as="targetPoint" />
            <Array as="points">
              <mxPoint x="1190" y="991" />
              <mxPoint x="1190" y="905" />
            </Array>
            <mxPoint y="-15" as="offset" />
          </mxGeometry>
        </mxCell>
        <mxCell id="W1JiaCnCX7zwp9q-DU5L-46" value="" style="group;snapToPoint=1;" vertex="1" connectable="0" parent="1">
          <mxGeometry x="1250" y="860" width="220" height="60" as="geometry" />
        </mxCell>
        <mxCell id="W1JiaCnCX7zwp9q-DU5L-47" value="iof:DesignativeInformationContentEntity" style="rounded=0;whiteSpace=wrap;html=1;snapToPoint=1;points=[[0.1,0],[0.2,0],[0.3,0],[0.4,0],[0.5,0],[0.6,0],[0.7,0],[0.8,0],[0.9,0],[0,0.1],[0,0.3],[0,0.5],[0,0.7],[0,0.9],[0.1,1],[0.2,1],[0.3,1],[0.4,1],[0.5,1],[0.6,1],[0.7,1],[0.8,1],[0.9,1],[1,0.1],[1,0.3],[1,0.5],[1,0.7],[1,0.9]];align=left;" vertex="1" parent="W1JiaCnCX7zwp9q-DU5L-46">
          <mxGeometry width="220" height="30" as="geometry" />
        </mxCell>
        <mxCell id="W1JiaCnCX7zwp9q-DU5L-48" value="&lt;u&gt;:CaliperID&lt;br&gt;&lt;/u&gt;" style="rounded=0;whiteSpace=wrap;html=1;snapToPoint=1;points=[[0.1,0],[0.2,0],[0.3,0],[0.4,0],[0.5,0],[0.6,0],[0.7,0],[0.8,0],[0.9,0],[0,0.1],[0,0.3],[0,0.5],[0,0.7],[0,0.9],[0.1,1],[0.2,1],[0.3,1],[0.4,1],[0.5,1],[0.6,1],[0.7,1],[0.8,1],[0.9,1],[1,0.1],[1,0.3],[1,0.5],[1,0.7],[1,0.9]];align=left;fillColor=#fff2cc;strokeColor=#d6b656;" vertex="1" parent="W1JiaCnCX7zwp9q-DU5L-46">
          <mxGeometry y="30" width="220" height="30" as="geometry" />
        </mxCell>
        <mxCell id="W1JiaCnCX7zwp9q-DU5L-49" value="" style="group;snapToPoint=1;" vertex="1" connectable="0" parent="1">
          <mxGeometry x="1250" y="945" width="220" height="60" as="geometry" />
        </mxCell>
        <mxCell id="W1JiaCnCX7zwp9q-DU5L-50" value="iof:MeasurementCapaility" style="rounded=0;whiteSpace=wrap;html=1;snapToPoint=1;points=[[0.1,0],[0.2,0],[0.3,0],[0.4,0],[0.5,0],[0.6,0],[0.7,0],[0.8,0],[0.9,0],[0,0.1],[0,0.3],[0,0.5],[0,0.7],[0,0.9],[0.1,1],[0.2,1],[0.3,1],[0.4,1],[0.5,1],[0.6,1],[0.7,1],[0.8,1],[0.9,1],[1,0.1],[1,0.3],[1,0.5],[1,0.7],[1,0.9]];align=left;" vertex="1" parent="W1JiaCnCX7zwp9q-DU5L-49">
          <mxGeometry width="220" height="30" as="geometry" />
        </mxCell>
        <mxCell id="W1JiaCnCX7zwp9q-DU5L-51" value="&lt;u&gt;:DistanceMeasurementCapability&lt;br&gt;&lt;/u&gt;" style="rounded=0;whiteSpace=wrap;html=1;snapToPoint=1;points=[[0.1,0],[0.2,0],[0.3,0],[0.4,0],[0.5,0],[0.6,0],[0.7,0],[0.8,0],[0.9,0],[0,0.1],[0,0.3],[0,0.5],[0,0.7],[0,0.9],[0.1,1],[0.2,1],[0.3,1],[0.4,1],[0.5,1],[0.6,1],[0.7,1],[0.8,1],[0.9,1],[1,0.1],[1,0.3],[1,0.5],[1,0.7],[1,0.9]];align=left;" vertex="1" parent="W1JiaCnCX7zwp9q-DU5L-49">
          <mxGeometry y="30" width="220" height="30" as="geometry" />
        </mxCell>
        <mxCell id="W1JiaCnCX7zwp9q-DU5L-52" value="iof:hasCapability" style="edgeStyle=elbowEdgeStyle;rounded=0;orthogonalLoop=1;jettySize=auto;html=1;fontSize=12;fontColor=#000000;snapToPoint=1;" edge="1" source="W1JiaCnCX7zwp9q-DU5L-43" target="W1JiaCnCX7zwp9q-DU5L-51" parent="1">
          <mxGeometry x="20" y="144.5" as="geometry">
            <mxPoint x="502" y="1120.5" as="sourcePoint" />
            <mxPoint x="520" y="1134.5" as="targetPoint" />
            <mxPoint x="-1" y="17" as="offset" />
          </mxGeometry>
        </mxCell>
        <mxCell id="W1JiaCnCX7zwp9q-DU5L-53" value="iof:hasMeasuredValueAtSomeTime" style="edgeStyle=orthogonalEdgeStyle;rounded=0;orthogonalLoop=1;jettySize=auto;html=1;fontSize=12;snapToPoint=1;" edge="1" source="W1JiaCnCX7zwp9q-DU5L-41" target="W1JiaCnCX7zwp9q-DU5L-39" parent="1">
          <mxGeometry relative="1" as="geometry">
            <mxPoint x="260" y="1038.67" as="sourcePoint" />
            <mxPoint x="490" y="1038.67" as="targetPoint" />
          </mxGeometry>
        </mxCell>
        <mxCell id="W1JiaCnCX7zwp9q-DU5L-55" value="iof:isInputOf" style="edgeStyle=orthogonalEdgeStyle;rounded=0;orthogonalLoop=1;jettySize=auto;html=1;fontSize=12;snapToPoint=1;entryX=0.5;entryY=1;entryDx=0;entryDy=0;" edge="1" source="W1JiaCnCX7zwp9q-DU5L-60" target="W1JiaCnCX7zwp9q-DU5L-4" parent="1">
          <mxGeometry relative="1" as="geometry">
            <mxPoint x="-771" y="1514.5" as="sourcePoint" />
            <mxPoint x="131" y="1345.5" as="targetPoint" />
          </mxGeometry>
        </mxCell>
        <mxCell id="W1JiaCnCX7zwp9q-DU5L-56" value="iof:designatedBy" style="edgeStyle=orthogonalEdgeStyle;rounded=0;orthogonalLoop=1;jettySize=auto;html=1;fontSize=12;" edge="1" source="W1JiaCnCX7zwp9q-DU5L-60" target="W1JiaCnCX7zwp9q-DU5L-58" parent="1">
          <mxGeometry x="0.1078" relative="1" as="geometry">
            <mxPoint x="-9" y="1358" as="sourcePoint" />
            <mxPoint x="171" y="1450" as="targetPoint" />
            <Array as="points">
              <mxPoint x="341" y="1285" />
            </Array>
            <mxPoint as="offset" />
          </mxGeometry>
        </mxCell>
        <mxCell id="W1JiaCnCX7zwp9q-DU5L-57" value="iof:DesignativeInformationContentEntity" style="rounded=0;whiteSpace=wrap;html=1;snapToPoint=1;points=[[0.1,0],[0.2,0],[0.3,0],[0.4,0],[0.5,0],[0.6,0],[0.7,0],[0.8,0],[0.9,0],[0,0.1],[0,0.3],[0,0.5],[0,0.7],[0,0.9],[0.1,1],[0.2,1],[0.3,1],[0.4,1],[0.5,1],[0.6,1],[0.7,1],[0.8,1],[0.9,1],[1,0.1],[1,0.3],[1,0.5],[1,0.7],[1,0.9]];align=left;" vertex="1" parent="1">
          <mxGeometry x="501" y="1240" width="220" height="30" as="geometry" />
        </mxCell>
        <mxCell id="W1JiaCnCX7zwp9q-DU5L-58" value="&lt;u&gt;:SpecimenID&lt;br&gt;&lt;/u&gt;" style="rounded=0;whiteSpace=wrap;html=1;snapToPoint=1;points=[[0.1,0],[0.2,0],[0.3,0],[0.4,0],[0.5,0],[0.6,0],[0.7,0],[0.8,0],[0.9,0],[0,0.1],[0,0.3],[0,0.5],[0,0.7],[0,0.9],[0.1,1],[0.2,1],[0.3,1],[0.4,1],[0.5,1],[0.6,1],[0.7,1],[0.8,1],[0.9,1],[1,0.1],[1,0.3],[1,0.5],[1,0.7],[1,0.9]];align=left;fillColor=#fff2cc;strokeColor=#d6b656;" vertex="1" parent="1">
          <mxGeometry x="501" y="1270" width="220" height="30" as="geometry" />
        </mxCell>
        <mxCell id="W1JiaCnCX7zwp9q-DU5L-59" value="mseo:Specimen" style="rounded=0;whiteSpace=wrap;html=1;snapToPoint=1;points=[[0.1,0],[0.2,0],[0.3,0],[0.4,0],[0.5,0],[0.6,0],[0.7,0],[0.8,0],[0.9,0],[0,0.1],[0,0.3],[0,0.5],[0,0.7],[0,0.9],[0.1,1],[0.2,1],[0.3,1],[0.4,1],[0.5,1],[0.6,1],[0.7,1],[0.8,1],[0.9,1],[1,0.1],[1,0.3],[1,0.5],[1,0.7],[1,0.9]];align=left;" vertex="1" parent="1">
          <mxGeometry x="271" y="1160" width="140" height="30" as="geometry" />
        </mxCell>
        <mxCell id="W1JiaCnCX7zwp9q-DU5L-60" value="&lt;u&gt;:MySpecimen&lt;br&gt;&lt;/u&gt;" style="rounded=0;whiteSpace=wrap;html=1;snapToPoint=1;points=[[0.1,0],[0.2,0],[0.3,0],[0.4,0],[0.5,0],[0.6,0],[0.7,0],[0.8,0],[0.9,0],[0,0.1],[0,0.3],[0,0.5],[0,0.7],[0,0.9],[0.1,1],[0.2,1],[0.3,1],[0.4,1],[0.5,1],[0.6,1],[0.7,1],[0.8,1],[0.9,1],[1,0.1],[1,0.3],[1,0.5],[1,0.7],[1,0.9]];align=left;" vertex="1" parent="1">
          <mxGeometry x="271" y="1190" width="140" height="30" as="geometry" />
        </mxCell>
        <mxCell id="W1JiaCnCX7zwp9q-DU5L-61" value="iof:hasQuality" style="rounded=0;orthogonalLoop=1;jettySize=auto;html=1;fontSize=12;edgeStyle=orthogonalEdgeStyle;snapToPoint=1;elbow=vertical;entryX=0.6;entryY=1;entryDx=0;entryDy=0;" edge="1" source="W1JiaCnCX7zwp9q-DU5L-60" target="W1JiaCnCX7zwp9q-DU5L-41" parent="1">
          <mxGeometry x="0.0011" relative="1" as="geometry">
            <mxPoint x="291" y="1425.5" as="sourcePoint" />
            <mxPoint x="350" y="1690.5" as="targetPoint" />
            <mxPoint as="offset" />
          </mxGeometry>
        </mxCell>
      </root>
    </mxGraphModel>
  </diagram>
</mxfile>
