<mxfile host="Electron" modified="2024-06-16T18:17:43.955Z" agent="Mozilla/5.0 (X11; Linux x86_64) AppleWebKit/537.36 (KHTML, like Gecko) draw.io/24.5.3 Chrome/124.0.6367.207 Electron/30.0.6 Safari/537.36" etag="06jHz9wxfQeR-gURyn49" compressed="false" version="24.5.3" type="device">
  <diagram id="MJNksl6tCDwtd28xJWI5" name="Ontology">
    <mxGraphModel dx="1299" dy="1001" grid="1" gridSize="10" guides="1" tooltips="1" connect="1" arrows="1" fold="1" page="1" pageScale="1" pageWidth="827" pageHeight="1169" math="0" shadow="0">
      <root>
        <mxCell id="0" />
        <mxCell id="1" style="" parent="0" />
        <mxCell id="aysTpWYp_d0TLLfFKDWt-2" value="&lt;div&gt;&amp;lt;&amp;lt;owl:ObjectProperty&amp;gt;&amp;gt; cd:specifiedBy&lt;br&gt;&lt;/div&gt;" style="rhombus;whiteSpace=wrap;html=1;fillColor=#f5f5f5;fontColor=#333333;strokeColor=#666666;" parent="1" vertex="1">
          <mxGeometry x="1080" y="320" width="200" height="80" as="geometry" />
        </mxCell>
        <mxCell id="aysTpWYp_d0TLLfFKDWt-3" value="&lt;div&gt;&amp;lt;&amp;lt;owl:ObjectProperty&amp;gt;&amp;gt;&amp;nbsp;&lt;br&gt;&lt;/div&gt;&lt;div&gt;cd:specifies&lt;/div&gt;" style="rhombus;whiteSpace=wrap;html=1;fillColor=#f5f5f5;fontColor=#333333;strokeColor=#666666;" parent="1" vertex="1">
          <mxGeometry x="1080" y="440" width="200" height="80" as="geometry" />
        </mxCell>
        <mxCell id="aysTpWYp_d0TLLfFKDWt-7" value="" style="endArrow=classic;html=1;endSize=8;arcSize=0;rounded=0;dashed=1;" parent="1" source="aysTpWYp_d0TLLfFKDWt-10" target="aysTpWYp_d0TLLfFKDWt-6" edge="1">
          <mxGeometry width="50" height="50" relative="1" as="geometry">
            <mxPoint x="710" y="345" as="sourcePoint" />
            <mxPoint x="413.0000000000002" y="708.3299999999999" as="targetPoint" />
          </mxGeometry>
        </mxCell>
        <mxCell id="aysTpWYp_d0TLLfFKDWt-8" value="(some) rdfs:isDefinedBy" style="text;html=1;align=center;verticalAlign=middle;resizable=0;points=[];labelBackgroundColor=#ffffff;" parent="aysTpWYp_d0TLLfFKDWt-7" vertex="1" connectable="0">
          <mxGeometry x="-0.1269" relative="1" as="geometry">
            <mxPoint x="8" as="offset" />
          </mxGeometry>
        </mxCell>
        <mxCell id="aysTpWYp_d0TLLfFKDWt-13" value="owl:Thing" style="rounded=0;whiteSpace=wrap;html=1;snapToPoint=1;points=[[0.1,0],[0.2,0],[0.3,0],[0.4,0],[0.5,0],[0.6,0],[0.7,0],[0.8,0],[0.9,0],[0,0.1],[0,0.3],[0,0.5],[0,0.7],[0,0.9],[0.1,1],[0.2,1],[0.3,1],[0.4,1],[0.5,1],[0.6,1],[0.7,1],[0.8,1],[0.9,1],[1,0.1],[1,0.3],[1,0.5],[1,0.7],[1,0.9]];" parent="1" vertex="1">
          <mxGeometry x="520" y="400" width="80" height="30" as="geometry" />
        </mxCell>
        <mxCell id="aysTpWYp_d0TLLfFKDWt-14" value="" style="endArrow=classic;html=1;endSize=8;startArrow=oval;startFill=1;dashed=1;arcSize=0;rounded=0;" parent="1" source="aysTpWYp_d0TLLfFKDWt-10" target="aysTpWYp_d0TLLfFKDWt-13" edge="1">
          <mxGeometry width="50" height="50" relative="1" as="geometry">
            <mxPoint x="860" y="645" as="sourcePoint" />
            <mxPoint x="952.0000000000002" y="748.3299999999999" as="targetPoint" />
          </mxGeometry>
        </mxCell>
        <mxCell id="aysTpWYp_d0TLLfFKDWt-15" value="(some) cd:specifies" style="text;html=1;align=center;verticalAlign=middle;resizable=0;points=[];labelBackgroundColor=#ffffff;" parent="aysTpWYp_d0TLLfFKDWt-14" vertex="1" connectable="0">
          <mxGeometry x="-0.1269" relative="1" as="geometry">
            <mxPoint as="offset" />
          </mxGeometry>
        </mxCell>
        <mxCell id="aysTpWYp_d0TLLfFKDWt-22" value="&lt;div&gt;&amp;lt;&amp;lt;owl:DatatypeProperty&amp;gt;&amp;gt;&lt;/div&gt;&lt;div&gt;&lt;span style=&quot;background-color: initial;&quot;&gt;cd:materialDesignation&lt;/span&gt;&lt;/div&gt;" style="rhombus;whiteSpace=wrap;html=1;fillColor=#f5f5f5;fontColor=#333333;strokeColor=#666666;" parent="1" vertex="1">
          <mxGeometry x="1400" y="800" width="200" height="80" as="geometry" />
        </mxCell>
        <mxCell id="aysTpWYp_d0TLLfFKDWt-23" value="&lt;div&gt;&amp;lt;&amp;lt;owl:DatatypeProperty&amp;gt;&amp;gt;&amp;nbsp;&lt;/div&gt;cd:materialNumber" style="rhombus;whiteSpace=wrap;html=1;" parent="1" vertex="1">
          <mxGeometry x="1280" y="680" width="200" height="80" as="geometry" />
        </mxCell>
        <mxCell id="aysTpWYp_d0TLLfFKDWt-24" value="" style="endArrow=open;html=1;fontColor=#000099;endFill=0;dashed=1;endSize=8;arcSize=0;rounded=0;" parent="1" source="aysTpWYp_d0TLLfFKDWt-23" target="aysTpWYp_d0TLLfFKDWt-22" edge="1">
          <mxGeometry width="50" height="50" relative="1" as="geometry">
            <mxPoint x="1261" y="720" as="sourcePoint" />
            <mxPoint x="1261" y="650" as="targetPoint" />
          </mxGeometry>
        </mxCell>
        <mxCell id="aysTpWYp_d0TLLfFKDWt-25" value="&amp;lt;&amp;lt;rdfs:subPropertyOf&amp;gt;&amp;gt;" style="text;html=1;align=center;verticalAlign=middle;resizable=0;points=[];fontColor=#000000;labelBackgroundColor=#ffffff;" parent="aysTpWYp_d0TLLfFKDWt-24" vertex="1" connectable="0">
          <mxGeometry x="-0.3277" relative="1" as="geometry">
            <mxPoint x="-10" y="10" as="offset" />
          </mxGeometry>
        </mxCell>
        <mxCell id="aysTpWYp_d0TLLfFKDWt-26" value="&lt;div&gt;&amp;lt;&amp;lt;owl:DatatypeProperty&amp;gt;&amp;gt;&amp;nbsp;&lt;/div&gt;cd:materialSymbol" style="rhombus;whiteSpace=wrap;html=1;" parent="1" vertex="1">
          <mxGeometry x="1520" y="680" width="200" height="80" as="geometry" />
        </mxCell>
        <mxCell id="aysTpWYp_d0TLLfFKDWt-27" value="" style="endArrow=open;html=1;fontColor=#000099;endFill=0;dashed=1;endSize=8;arcSize=0;rounded=0;" parent="1" source="aysTpWYp_d0TLLfFKDWt-26" target="aysTpWYp_d0TLLfFKDWt-22" edge="1">
          <mxGeometry width="50" height="50" relative="1" as="geometry">
            <mxPoint x="1421" y="810" as="sourcePoint" />
            <mxPoint x="1651" y="750" as="targetPoint" />
          </mxGeometry>
        </mxCell>
        <mxCell id="aysTpWYp_d0TLLfFKDWt-28" value="&amp;lt;&amp;lt;rdfs:subPropertyOf&amp;gt;&amp;gt;" style="text;html=1;align=center;verticalAlign=middle;resizable=0;points=[];fontColor=#000000;labelBackgroundColor=#ffffff;" parent="aysTpWYp_d0TLLfFKDWt-27" vertex="1" connectable="0">
          <mxGeometry x="-0.3277" relative="1" as="geometry">
            <mxPoint x="30" y="10" as="offset" />
          </mxGeometry>
        </mxCell>
        <mxCell id="aysTpWYp_d0TLLfFKDWt-29" value="&lt;div&gt;&amp;lt;&amp;lt;owl:DatatypeProperty&amp;gt;&amp;gt;&lt;/div&gt;&lt;div&gt;qudt:value&lt;/div&gt;" style="rhombus;whiteSpace=wrap;html=1;fillColor=#f5f5f5;fontColor=#333333;strokeColor=#666666;" parent="1" vertex="1">
          <mxGeometry x="1400" y="1040" width="200" height="80" as="geometry" />
        </mxCell>
        <mxCell id="aysTpWYp_d0TLLfFKDWt-30" value="&lt;div&gt;&amp;lt;&amp;lt;owl:DatatypeProperty&amp;gt;&amp;gt;&amp;nbsp;&lt;/div&gt;cd:greaterThan" style="rhombus;whiteSpace=wrap;html=1;" parent="1" vertex="1">
          <mxGeometry x="1400" y="1160" width="200" height="80" as="geometry" />
        </mxCell>
        <mxCell id="aysTpWYp_d0TLLfFKDWt-31" value="" style="endArrow=open;html=1;fontColor=#000099;endFill=0;dashed=1;endSize=8;arcSize=0;rounded=0;" parent="1" source="aysTpWYp_d0TLLfFKDWt-42" target="aysTpWYp_d0TLLfFKDWt-123" edge="1">
          <mxGeometry width="50" height="50" relative="1" as="geometry">
            <mxPoint x="1420" y="320" as="sourcePoint" />
            <mxPoint x="1420" y="650" as="targetPoint" />
          </mxGeometry>
        </mxCell>
        <mxCell id="aysTpWYp_d0TLLfFKDWt-32" value="&amp;lt;&amp;lt;rdfs:subPropertyOf&amp;gt;&amp;gt;" style="text;html=1;align=center;verticalAlign=middle;resizable=0;points=[];fontColor=#000000;labelBackgroundColor=#ffffff;" parent="aysTpWYp_d0TLLfFKDWt-31" vertex="1" connectable="0">
          <mxGeometry x="-0.3277" relative="1" as="geometry">
            <mxPoint y="-7" as="offset" />
          </mxGeometry>
        </mxCell>
        <mxCell id="aysTpWYp_d0TLLfFKDWt-33" value="&lt;div&gt;&amp;lt;&amp;lt;owl:DatatypeProperty&amp;gt;&amp;gt;&amp;nbsp;&lt;/div&gt;cd:equal" style="rhombus;whiteSpace=wrap;html=1;" parent="1" vertex="1">
          <mxGeometry x="1640" y="1160" width="200" height="80" as="geometry" />
        </mxCell>
        <mxCell id="aysTpWYp_d0TLLfFKDWt-34" value="" style="endArrow=open;html=1;fontColor=#000099;endFill=0;dashed=1;endSize=8;arcSize=0;rounded=0;" parent="1" source="aysTpWYp_d0TLLfFKDWt-33" target="aysTpWYp_d0TLLfFKDWt-29" edge="1">
          <mxGeometry width="50" height="50" relative="1" as="geometry">
            <mxPoint x="1500" y="1200" as="sourcePoint" />
            <mxPoint x="1740" y="1120" as="targetPoint" />
          </mxGeometry>
        </mxCell>
        <mxCell id="aysTpWYp_d0TLLfFKDWt-35" value="&amp;lt;&amp;lt;rdfs:subPropertyOf&amp;gt;&amp;gt;" style="text;html=1;align=center;verticalAlign=middle;resizable=0;points=[];fontColor=#000000;labelBackgroundColor=#ffffff;" parent="aysTpWYp_d0TLLfFKDWt-34" vertex="1" connectable="0">
          <mxGeometry x="-0.3277" relative="1" as="geometry">
            <mxPoint y="-7" as="offset" />
          </mxGeometry>
        </mxCell>
        <mxCell id="aysTpWYp_d0TLLfFKDWt-36" value="&lt;div&gt;&amp;lt;&amp;lt;owl:DatatypeProperty&amp;gt;&amp;gt;&amp;nbsp;&lt;/div&gt;cd:lessThan" style="rhombus;whiteSpace=wrap;html=1;" parent="1" vertex="1">
          <mxGeometry x="1160" y="1160" width="200" height="80" as="geometry" />
        </mxCell>
        <mxCell id="aysTpWYp_d0TLLfFKDWt-37" value="" style="endArrow=open;html=1;fontColor=#000099;endFill=0;dashed=1;endSize=8;arcSize=0;rounded=0;" parent="1" source="aysTpWYp_d0TLLfFKDWt-36" target="aysTpWYp_d0TLLfFKDWt-29" edge="1">
          <mxGeometry width="50" height="50" relative="1" as="geometry">
            <mxPoint x="1020" y="1200" as="sourcePoint" />
            <mxPoint x="1260" y="1120" as="targetPoint" />
          </mxGeometry>
        </mxCell>
        <mxCell id="aysTpWYp_d0TLLfFKDWt-38" value="&amp;lt;&amp;lt;rdfs:subPropertyOf&amp;gt;&amp;gt;" style="text;html=1;align=center;verticalAlign=middle;resizable=0;points=[];fontColor=#000000;labelBackgroundColor=#ffffff;" parent="aysTpWYp_d0TLLfFKDWt-37" vertex="1" connectable="0">
          <mxGeometry x="-0.3277" relative="1" as="geometry">
            <mxPoint y="-7" as="offset" />
          </mxGeometry>
        </mxCell>
        <mxCell id="aysTpWYp_d0TLLfFKDWt-39" value="" style="endArrow=classic;html=1;endSize=8;arcSize=0;rounded=0;" parent="1" source="aysTpWYp_d0TLLfFKDWt-149" target="aysTpWYp_d0TLLfFKDWt-10" edge="1">
          <mxGeometry width="50" height="50" relative="1" as="geometry">
            <mxPoint x="179.82352941176475" y="335.17647058823513" as="sourcePoint" />
            <mxPoint x="260" y="380" as="targetPoint" />
          </mxGeometry>
        </mxCell>
        <mxCell id="aysTpWYp_d0TLLfFKDWt-40" value="&lt;div&gt;(some) cd:requiredBy&lt;/div&gt;" style="text;html=1;align=center;verticalAlign=middle;resizable=0;points=[];labelBackgroundColor=#ffffff;" parent="aysTpWYp_d0TLLfFKDWt-39" vertex="1" connectable="0">
          <mxGeometry x="-0.1269" relative="1" as="geometry">
            <mxPoint x="10" as="offset" />
          </mxGeometry>
        </mxCell>
        <mxCell id="aysTpWYp_d0TLLfFKDWt-41" value="qudt:Quantity" style="rounded=0;whiteSpace=wrap;html=1;snapToPoint=1;points=[[0.1,0],[0.2,0],[0.3,0],[0.4,0],[0.5,0],[0.6,0],[0.7,0],[0.8,0],[0.9,0],[0,0.1],[0,0.3],[0,0.5],[0,0.7],[0,0.9],[0.1,1],[0.2,1],[0.3,1],[0.4,1],[0.5,1],[0.6,1],[0.7,1],[0.8,1],[0.9,1],[1,0.1],[1,0.3],[1,0.5],[1,0.7],[1,0.9]];" parent="1" vertex="1">
          <mxGeometry x="60" y="400" width="80" height="30" as="geometry" />
        </mxCell>
        <mxCell id="aysTpWYp_d0TLLfFKDWt-42" value="&lt;div&gt;&amp;lt;&amp;lt;owl:ObjectProperty&amp;gt;&amp;gt; cd:requiredBy&lt;br&gt;&lt;/div&gt;" style="rhombus;whiteSpace=wrap;html=1;fillColor=#f5f5f5;fontColor=#333333;strokeColor=#666666;" parent="1" vertex="1">
          <mxGeometry x="1320" y="320" width="200" height="80" as="geometry" />
        </mxCell>
        <mxCell id="aysTpWYp_d0TLLfFKDWt-43" value="&lt;div&gt;&amp;lt;&amp;lt;owl:ObjectProperty&amp;gt;&amp;gt;&amp;nbsp;&lt;br&gt;&lt;/div&gt;&lt;div&gt;cd:requires&lt;/div&gt;" style="rhombus;whiteSpace=wrap;html=1;fillColor=#f5f5f5;fontColor=#333333;strokeColor=#666666;" parent="1" vertex="1">
          <mxGeometry x="1320" y="440" width="200" height="80" as="geometry" />
        </mxCell>
        <mxCell id="aysTpWYp_d0TLLfFKDWt-46" value="cd:ChemicalElementFraction" style="rounded=0;whiteSpace=wrap;html=1;snapToPoint=1;points=[[0.1,0],[0.2,0],[0.3,0],[0.4,0],[0.5,0],[0.6,0],[0.7,0],[0.8,0],[0.9,0],[0,0.1],[0,0.3],[0,0.5],[0,0.7],[0,0.9],[0.1,1],[0.2,1],[0.3,1],[0.4,1],[0.5,1],[0.6,1],[0.7,1],[0.8,1],[0.9,1],[1,0.1],[1,0.3],[1,0.5],[1,0.7],[1,0.9]];" parent="1" vertex="1">
          <mxGeometry x="20" y="560" width="160" height="30" as="geometry" />
        </mxCell>
        <mxCell id="aysTpWYp_d0TLLfFKDWt-47" value="" style="endArrow=classic;html=1;endSize=8;arcSize=0;rounded=0;" parent="1" source="aysTpWYp_d0TLLfFKDWt-46" target="aysTpWYp_d0TLLfFKDWt-49" edge="1">
          <mxGeometry width="50" height="50" relative="1" as="geometry">
            <mxPoint x="100.04000000000002" y="600" as="sourcePoint" />
            <mxPoint x="440" y="760" as="targetPoint" />
          </mxGeometry>
        </mxCell>
        <mxCell id="aysTpWYp_d0TLLfFKDWt-48" value="&lt;div&gt;(all)(F) cd:ofElement&lt;/div&gt;" style="text;html=1;align=center;verticalAlign=middle;resizable=0;points=[];labelBackgroundColor=#ffffff;fontColor=#EA6B66;" parent="aysTpWYp_d0TLLfFKDWt-47" vertex="1" connectable="0">
          <mxGeometry x="-0.1269" relative="1" as="geometry">
            <mxPoint x="1" as="offset" />
          </mxGeometry>
        </mxCell>
        <mxCell id="aysTpWYp_d0TLLfFKDWt-49" value="cd:ChemicalElement" style="rounded=0;whiteSpace=wrap;html=1;snapToPoint=1;points=[[0.1,0],[0.2,0],[0.3,0],[0.4,0],[0.5,0],[0.6,0],[0.7,0],[0.8,0],[0.9,0],[0,0.1],[0,0.3],[0,0.5],[0,0.7],[0,0.9],[0.1,1],[0.2,1],[0.3,1],[0.4,1],[0.5,1],[0.6,1],[0.7,1],[0.8,1],[0.9,1],[1,0.1],[1,0.3],[1,0.5],[1,0.7],[1,0.9]];fillColor=#f5f5f5;fontColor=#333333;strokeColor=#666666;" parent="1" vertex="1">
          <mxGeometry x="400" y="560" width="120" height="30" as="geometry" />
        </mxCell>
        <mxCell id="aysTpWYp_d0TLLfFKDWt-50" value="qk:AmountOfSubstanceFractionOfB" style="rounded=0;whiteSpace=wrap;html=1;snapToPoint=1;points=[[0.1,0],[0.2,0],[0.3,0],[0.4,0],[0.5,0],[0.6,0],[0.7,0],[0.8,0],[0.9,0],[0,0.1],[0,0.3],[0,0.5],[0,0.7],[0,0.9],[0.1,1],[0.2,1],[0.3,1],[0.4,1],[0.5,1],[0.6,1],[0.7,1],[0.8,1],[0.9,1],[1,0.1],[1,0.3],[1,0.5],[1,0.7],[1,0.9]];fontStyle=4" parent="1" vertex="1">
          <mxGeometry x="160" y="880" width="240" height="30" as="geometry" />
        </mxCell>
        <mxCell id="aysTpWYp_d0TLLfFKDWt-51" value="qudt:QuantityKind" style="rounded=0;whiteSpace=wrap;html=1;snapToPoint=1;points=[[0.1,0],[0.2,0],[0.3,0],[0.4,0],[0.5,0],[0.6,0],[0.7,0],[0.8,0],[0.9,0],[0,0.1],[0,0.3],[0,0.5],[0,0.7],[0,0.9],[0.1,1],[0.2,1],[0.3,1],[0.4,1],[0.5,1],[0.6,1],[0.7,1],[0.8,1],[0.9,1],[1,0.1],[1,0.3],[1,0.5],[1,0.7],[1,0.9]];fillColor=#f5f5f5;fontColor=#333333;strokeColor=#666666;" parent="1" vertex="1">
          <mxGeometry x="400" y="640" width="120" height="30" as="geometry" />
        </mxCell>
        <mxCell id="aysTpWYp_d0TLLfFKDWt-52" value="&lt;span style=&quot;font-size: 12px;&quot;&gt;qudt:hasQuantityKind&lt;/span&gt;&lt;span style=&quot;font-size: 12px;&quot;&gt;&amp;nbsp;(1..1)&lt;/span&gt;" style="endArrow=classic;html=1;endSize=8;dashed=1;arcSize=0;rounded=0;" parent="1" source="aysTpWYp_d0TLLfFKDWt-46" target="aysTpWYp_d0TLLfFKDWt-54" edge="1">
          <mxGeometry width="50" height="50" relative="1" as="geometry">
            <mxPoint x="60" y="448.3299999999999" as="sourcePoint" />
            <mxPoint x="272.0000000000003" y="448.3299999999999" as="targetPoint" />
            <Array as="points">
              <mxPoint x="200" y="610" />
            </Array>
          </mxGeometry>
        </mxCell>
        <mxCell id="aysTpWYp_d0TLLfFKDWt-53" value="&lt;span style=&quot;color: rgba(0, 0, 0, 0); font-family: monospace; font-size: 0px; text-align: start; background-color: rgb(248, 249, 250);&quot;&gt;%3CmxGraphModel%3E%3Croot%3E%3CmxCell%20id%3D%220%22%2F%3E%3CmxCell%20id%3D%221%22%20parent%3D%220%22%2F%3E%3CmxCell%20id%3D%222%22%20value%3D%22%26lt%3Bdiv%26gt%3Bcd%3AfractionOfElement%20(1..1)%26lt%3B%2Fdiv%26gt%3B%22%20style%3D%22text%3Bhtml%3D1%3Balign%3Dcenter%3BverticalAlign%3Dmiddle%3Bresizable%3D0%3Bpoints%3D%5B%5D%3BlabelBackgroundColor%3D%23ffffff%3B%22%20vertex%3D%221%22%20connectable%3D%220%22%20parent%3D%221%22%3E%3CmxGeometry%20x%3D%2260%22%20y%3D%221052%22%20as%3D%22geometry%22%2F%3E%3C%2FmxCell%3E%3C%2Froot%3E%3C%2FmxGraphModel%3&lt;/span&gt;" style="edgeLabel;html=1;align=center;verticalAlign=middle;resizable=0;points=[];" parent="aysTpWYp_d0TLLfFKDWt-52" vertex="1" connectable="0">
          <mxGeometry x="-0.1912" y="-1" relative="1" as="geometry">
            <mxPoint as="offset" />
          </mxGeometry>
        </mxCell>
        <mxCell id="aysTpWYp_d0TLLfFKDWt-54" value="cd:FractionKind" style="rounded=0;whiteSpace=wrap;html=1;snapToPoint=1;points=[[0.1,0],[0.2,0],[0.3,0],[0.4,0],[0.5,0],[0.6,0],[0.7,0],[0.8,0],[0.9,0],[0,0.1],[0,0.3],[0,0.5],[0,0.7],[0,0.9],[0.1,1],[0.2,1],[0.3,1],[0.4,1],[0.5,1],[0.6,1],[0.7,1],[0.8,1],[0.9,1],[1,0.1],[1,0.3],[1,0.5],[1,0.7],[1,0.9]];" parent="1" vertex="1">
          <mxGeometry x="40" y="640" width="120" height="30" as="geometry" />
        </mxCell>
        <mxCell id="aysTpWYp_d0TLLfFKDWt-55" value="" style="endArrow=block;html=1;fontColor=#000099;endFill=0;endSize=8;arcSize=0;rounded=0;" parent="1" source="aysTpWYp_d0TLLfFKDWt-54" target="aysTpWYp_d0TLLfFKDWt-51" edge="1">
          <mxGeometry width="50" height="50" relative="1" as="geometry">
            <mxPoint x="-290" y="649.01" as="sourcePoint" />
            <mxPoint x="-290" y="599.01" as="targetPoint" />
          </mxGeometry>
        </mxCell>
        <mxCell id="aysTpWYp_d0TLLfFKDWt-56" value="qk:AmountOfSubstancePerUnitMass" style="rounded=0;whiteSpace=wrap;html=1;snapToPoint=1;points=[[0.1,0],[0.2,0],[0.3,0],[0.4,0],[0.5,0],[0.6,0],[0.7,0],[0.8,0],[0.9,0],[0,0.1],[0,0.3],[0,0.5],[0,0.7],[0,0.9],[0.1,1],[0.2,1],[0.3,1],[0.4,1],[0.5,1],[0.6,1],[0.7,1],[0.8,1],[0.9,1],[1,0.1],[1,0.3],[1,0.5],[1,0.7],[1,0.9]];fontStyle=4" parent="1" vertex="1">
          <mxGeometry x="160" y="960" width="240" height="30" as="geometry" />
        </mxCell>
        <mxCell id="aysTpWYp_d0TLLfFKDWt-57" value="qk:AmountOfSubstanceConcentrationOfB" style="rounded=0;whiteSpace=wrap;html=1;snapToPoint=1;points=[[0.1,0],[0.2,0],[0.3,0],[0.4,0],[0.5,0],[0.6,0],[0.7,0],[0.8,0],[0.9,0],[0,0.1],[0,0.3],[0,0.5],[0,0.7],[0,0.9],[0.1,1],[0.2,1],[0.3,1],[0.4,1],[0.5,1],[0.6,1],[0.7,1],[0.8,1],[0.9,1],[1,0.1],[1,0.3],[1,0.5],[1,0.7],[1,0.9]];fontStyle=4" parent="1" vertex="1">
          <mxGeometry x="160" y="840" width="240" height="30" as="geometry" />
        </mxCell>
        <mxCell id="aysTpWYp_d0TLLfFKDWt-58" value="qk:AmountOfSubstancePerUnitVolume" style="rounded=0;whiteSpace=wrap;html=1;snapToPoint=1;points=[[0.1,0],[0.2,0],[0.3,0],[0.4,0],[0.5,0],[0.6,0],[0.7,0],[0.8,0],[0.9,0],[0,0.1],[0,0.3],[0,0.5],[0,0.7],[0,0.9],[0.1,1],[0.2,1],[0.3,1],[0.4,1],[0.5,1],[0.6,1],[0.7,1],[0.8,1],[0.9,1],[1,0.1],[1,0.3],[1,0.5],[1,0.7],[1,0.9]];fontStyle=4" parent="1" vertex="1">
          <mxGeometry x="160" y="920" width="240" height="30" as="geometry" />
        </mxCell>
        <mxCell id="aysTpWYp_d0TLLfFKDWt-59" value="qk:MassFraction" style="rounded=0;whiteSpace=wrap;html=1;snapToPoint=1;points=[[0.1,0],[0.2,0],[0.3,0],[0.4,0],[0.5,0],[0.6,0],[0.7,0],[0.8,0],[0.9,0],[0,0.1],[0,0.3],[0,0.5],[0,0.7],[0,0.9],[0.1,1],[0.2,1],[0.3,1],[0.4,1],[0.5,1],[0.6,1],[0.7,1],[0.8,1],[0.9,1],[1,0.1],[1,0.3],[1,0.5],[1,0.7],[1,0.9]];fontStyle=4" parent="1" vertex="1">
          <mxGeometry x="160" y="800" width="240" height="30" as="geometry" />
        </mxCell>
        <mxCell id="aysTpWYp_d0TLLfFKDWt-60" value="qk:MoleFraction" style="rounded=0;whiteSpace=wrap;html=1;snapToPoint=1;points=[[0.1,0],[0.2,0],[0.3,0],[0.4,0],[0.5,0],[0.6,0],[0.7,0],[0.8,0],[0.9,0],[0,0.1],[0,0.3],[0,0.5],[0,0.7],[0,0.9],[0.1,1],[0.2,1],[0.3,1],[0.4,1],[0.5,1],[0.6,1],[0.7,1],[0.8,1],[0.9,1],[1,0.1],[1,0.3],[1,0.5],[1,0.7],[1,0.9]];fontStyle=4" parent="1" vertex="1">
          <mxGeometry x="160" y="760" width="240" height="30" as="geometry" />
        </mxCell>
        <mxCell id="aysTpWYp_d0TLLfFKDWt-61" value="qk:VolumeFraction" style="rounded=0;whiteSpace=wrap;html=1;snapToPoint=1;points=[[0.1,0],[0.2,0],[0.3,0],[0.4,0],[0.5,0],[0.6,0],[0.7,0],[0.8,0],[0.9,0],[0,0.1],[0,0.3],[0,0.5],[0,0.7],[0,0.9],[0.1,1],[0.2,1],[0.3,1],[0.4,1],[0.5,1],[0.6,1],[0.7,1],[0.8,1],[0.9,1],[1,0.1],[1,0.3],[1,0.5],[1,0.7],[1,0.9]];fontStyle=4" parent="1" vertex="1">
          <mxGeometry x="160" y="720" width="240" height="30" as="geometry" />
        </mxCell>
        <mxCell id="aysTpWYp_d0TLLfFKDWt-62" value="" style="endArrow=open;html=1;fontColor=#000099;endFill=0;dashed=1;endSize=8;rounded=0;strokeColor=default;" parent="1" source="aysTpWYp_d0TLLfFKDWt-56" target="aysTpWYp_d0TLLfFKDWt-54" edge="1">
          <mxGeometry width="50" height="50" relative="1" as="geometry">
            <mxPoint x="300" y="979.01" as="sourcePoint" />
            <mxPoint x="520" y="854.01" as="targetPoint" />
            <Array as="points">
              <mxPoint x="100" y="975" />
            </Array>
          </mxGeometry>
        </mxCell>
        <mxCell id="aysTpWYp_d0TLLfFKDWt-63" value="&amp;lt;&amp;lt;rdf:type&amp;gt;&amp;gt;" style="text;html=1;align=center;verticalAlign=middle;resizable=0;points=[];fontColor=#000000;labelBackgroundColor=#ffffff;" parent="aysTpWYp_d0TLLfFKDWt-62" vertex="1" connectable="0">
          <mxGeometry x="-0.3277" relative="1" as="geometry">
            <mxPoint x="-50" y="-72" as="offset" />
          </mxGeometry>
        </mxCell>
        <mxCell id="aysTpWYp_d0TLLfFKDWt-64" value="" style="endArrow=open;html=1;fontColor=#000099;endFill=0;dashed=1;endSize=8;rounded=0;strokeColor=default;" parent="1" source="aysTpWYp_d0TLLfFKDWt-58" target="aysTpWYp_d0TLLfFKDWt-54" edge="1">
          <mxGeometry width="50" height="50" relative="1" as="geometry">
            <mxPoint x="409.91666666666674" y="984.0933333333335" as="sourcePoint" />
            <mxPoint x="520" y="854.01" as="targetPoint" />
            <Array as="points">
              <mxPoint x="100" y="935" />
            </Array>
          </mxGeometry>
        </mxCell>
        <mxCell id="aysTpWYp_d0TLLfFKDWt-65" value="&amp;lt;&amp;lt;rdf:type&amp;gt;&amp;gt;" style="text;html=1;align=center;verticalAlign=middle;resizable=0;points=[];fontColor=#000000;labelBackgroundColor=#ffffff;" parent="aysTpWYp_d0TLLfFKDWt-64" vertex="1" connectable="0">
          <mxGeometry x="-0.3277" relative="1" as="geometry">
            <mxPoint x="-50" y="-46" as="offset" />
          </mxGeometry>
        </mxCell>
        <mxCell id="aysTpWYp_d0TLLfFKDWt-66" value="" style="endArrow=open;html=1;fontColor=#000099;endFill=0;dashed=1;endSize=8;rounded=0;strokeColor=default;" parent="1" source="aysTpWYp_d0TLLfFKDWt-50" target="aysTpWYp_d0TLLfFKDWt-54" edge="1">
          <mxGeometry width="50" height="50" relative="1" as="geometry">
            <mxPoint x="409.91666666666674" y="949.9266666666667" as="sourcePoint" />
            <mxPoint x="520" y="854.01" as="targetPoint" />
            <Array as="points">
              <mxPoint x="100" y="895" />
            </Array>
          </mxGeometry>
        </mxCell>
        <mxCell id="aysTpWYp_d0TLLfFKDWt-67" value="&amp;lt;&amp;lt;rdf:type&amp;gt;&amp;gt;" style="text;html=1;align=center;verticalAlign=middle;resizable=0;points=[];fontColor=#000000;labelBackgroundColor=#ffffff;" parent="aysTpWYp_d0TLLfFKDWt-66" vertex="1" connectable="0">
          <mxGeometry x="-0.3277" relative="1" as="geometry">
            <mxPoint x="-50" y="-23" as="offset" />
          </mxGeometry>
        </mxCell>
        <mxCell id="aysTpWYp_d0TLLfFKDWt-68" value="" style="endArrow=open;html=1;fontColor=#000099;endFill=0;dashed=1;endSize=8;rounded=0;strokeColor=default;" parent="1" source="aysTpWYp_d0TLLfFKDWt-57" target="aysTpWYp_d0TLLfFKDWt-54" edge="1">
          <mxGeometry width="50" height="50" relative="1" as="geometry">
            <mxPoint x="410" y="984.01" as="sourcePoint" />
            <mxPoint x="520" y="854.01" as="targetPoint" />
            <Array as="points">
              <mxPoint x="100" y="855" />
            </Array>
          </mxGeometry>
        </mxCell>
        <mxCell id="aysTpWYp_d0TLLfFKDWt-69" value="&amp;lt;&amp;lt;rdf:type&amp;gt;&amp;gt;" style="text;html=1;align=center;verticalAlign=middle;resizable=0;points=[];fontColor=#000000;labelBackgroundColor=#ffffff;" parent="aysTpWYp_d0TLLfFKDWt-68" vertex="1" connectable="0">
          <mxGeometry x="-0.3277" relative="1" as="geometry">
            <mxPoint x="-50" y="7" as="offset" />
          </mxGeometry>
        </mxCell>
        <mxCell id="aysTpWYp_d0TLLfFKDWt-70" value="" style="endArrow=open;html=1;fontColor=#000099;endFill=0;dashed=1;endSize=8;rounded=0;strokeColor=default;" parent="1" source="aysTpWYp_d0TLLfFKDWt-59" target="aysTpWYp_d0TLLfFKDWt-54" edge="1">
          <mxGeometry width="50" height="50" relative="1" as="geometry">
            <mxPoint x="100" y="814.01" as="sourcePoint" />
            <mxPoint x="520" y="854.01" as="targetPoint" />
            <Array as="points">
              <mxPoint x="100" y="815" />
            </Array>
          </mxGeometry>
        </mxCell>
        <mxCell id="aysTpWYp_d0TLLfFKDWt-71" value="&amp;lt;&amp;lt;rdf:type&amp;gt;&amp;gt;" style="text;html=1;align=center;verticalAlign=middle;resizable=0;points=[];fontColor=#000000;labelBackgroundColor=#ffffff;" parent="aysTpWYp_d0TLLfFKDWt-70" vertex="1" connectable="0">
          <mxGeometry x="-0.3277" relative="1" as="geometry">
            <mxPoint x="-50" y="34" as="offset" />
          </mxGeometry>
        </mxCell>
        <mxCell id="aysTpWYp_d0TLLfFKDWt-72" value="" style="endArrow=open;html=1;fontColor=#000099;endFill=0;dashed=1;endSize=8;rounded=0;strokeColor=default;" parent="1" source="aysTpWYp_d0TLLfFKDWt-60" target="aysTpWYp_d0TLLfFKDWt-54" edge="1">
          <mxGeometry width="50" height="50" relative="1" as="geometry">
            <mxPoint x="100" y="769.01" as="sourcePoint" />
            <mxPoint x="520" y="854.01" as="targetPoint" />
            <Array as="points">
              <mxPoint x="100" y="775" />
            </Array>
          </mxGeometry>
        </mxCell>
        <mxCell id="aysTpWYp_d0TLLfFKDWt-73" value="&amp;lt;&amp;lt;rdf:type&amp;gt;&amp;gt;" style="text;html=1;align=center;verticalAlign=middle;resizable=0;points=[];fontColor=#000000;labelBackgroundColor=#ffffff;" parent="aysTpWYp_d0TLLfFKDWt-72" vertex="1" connectable="0">
          <mxGeometry x="-0.3277" relative="1" as="geometry">
            <mxPoint x="-55" y="65" as="offset" />
          </mxGeometry>
        </mxCell>
        <mxCell id="aysTpWYp_d0TLLfFKDWt-74" value="" style="endArrow=open;html=1;fontColor=#000099;endFill=0;dashed=1;endSize=8;rounded=0;strokeColor=default;" parent="1" source="aysTpWYp_d0TLLfFKDWt-61" target="aysTpWYp_d0TLLfFKDWt-54" edge="1">
          <mxGeometry width="50" height="50" relative="1" as="geometry">
            <mxPoint x="410" y="784.01" as="sourcePoint" />
            <mxPoint x="520" y="854.01" as="targetPoint" />
            <Array as="points">
              <mxPoint x="100" y="735" />
            </Array>
          </mxGeometry>
        </mxCell>
        <mxCell id="aysTpWYp_d0TLLfFKDWt-75" value="&amp;lt;&amp;lt;rdf:type&amp;gt;&amp;gt;" style="text;html=1;align=center;verticalAlign=middle;resizable=0;points=[];fontColor=#000000;labelBackgroundColor=#ffffff;" parent="aysTpWYp_d0TLLfFKDWt-74" vertex="1" connectable="0">
          <mxGeometry x="-0.3277" relative="1" as="geometry">
            <mxPoint x="-58" y="95" as="offset" />
          </mxGeometry>
        </mxCell>
        <mxCell id="aysTpWYp_d0TLLfFKDWt-76" value="" style="endArrow=block;html=1;fontColor=#000099;endFill=0;endSize=8;arcSize=0;rounded=0;" parent="1" source="aysTpWYp_d0TLLfFKDWt-46" target="aysTpWYp_d0TLLfFKDWt-41" edge="1">
          <mxGeometry width="50" height="50" relative="1" as="geometry">
            <mxPoint x="450" y="450" as="sourcePoint" />
            <mxPoint x="39.88235294117658" y="510.47058823529414" as="targetPoint" />
          </mxGeometry>
        </mxCell>
        <mxCell id="aysTpWYp_d0TLLfFKDWt-77" value="wd:Q11344" style="rounded=0;whiteSpace=wrap;html=1;snapToPoint=1;points=[[0.1,0],[0.2,0],[0.3,0],[0.4,0],[0.5,0],[0.6,0],[0.7,0],[0.8,0],[0.9,0],[0,0.1],[0,0.3],[0,0.5],[0,0.7],[0,0.9],[0.1,1],[0.2,1],[0.3,1],[0.4,1],[0.5,1],[0.6,1],[0.7,1],[0.8,1],[0.9,1],[1,0.1],[1,0.3],[1,0.5],[1,0.7],[1,0.9]];" parent="1" vertex="1">
          <mxGeometry x="420" y="480" width="80" height="30" as="geometry" />
        </mxCell>
        <mxCell id="aysTpWYp_d0TLLfFKDWt-78" value="≡" style="ellipse;whiteSpace=wrap;html=1;aspect=fixed;fontSize=17;" parent="1" vertex="1">
          <mxGeometry x="320" y="500" width="40" height="40" as="geometry" />
        </mxCell>
        <mxCell id="aysTpWYp_d0TLLfFKDWt-79" value="" style="endArrow=open;html=1;fontColor=#000099;endFill=0;dashed=1;endSize=8;arcSize=0;rounded=0;" parent="1" source="aysTpWYp_d0TLLfFKDWt-78" target="aysTpWYp_d0TLLfFKDWt-49" edge="1">
          <mxGeometry width="50" height="50" relative="1" as="geometry">
            <mxPoint x="442.53999999999996" y="572.5" as="sourcePoint" />
            <mxPoint x="430" y="555.25" as="targetPoint" />
          </mxGeometry>
        </mxCell>
        <mxCell id="aysTpWYp_d0TLLfFKDWt-80" value="" style="endArrow=open;html=1;fontColor=#000099;endFill=0;dashed=1;endSize=8;arcSize=0;rounded=0;" parent="1" source="aysTpWYp_d0TLLfFKDWt-78" target="aysTpWYp_d0TLLfFKDWt-77" edge="1">
          <mxGeometry width="50" height="50" relative="1" as="geometry">
            <mxPoint x="477.5" y="568.5" as="sourcePoint" />
            <mxPoint x="522.5" y="470" as="targetPoint" />
          </mxGeometry>
        </mxCell>
        <mxCell id="aysTpWYp_d0TLLfFKDWt-81" value="&lt;span style=&quot;font-size: 12px;&quot;&gt;(some) qudt:hasQuantityKind&lt;/span&gt;" style="endArrow=classic;html=1;endSize=8;dashed=1;arcSize=0;rounded=0;" parent="1" source="aysTpWYp_d0TLLfFKDWt-46" target="aysTpWYp_d0TLLfFKDWt-54" edge="1">
          <mxGeometry width="50" height="50" relative="1" as="geometry">
            <mxPoint x="30.04000000000002" y="585" as="sourcePoint" />
            <mxPoint x="-169.95999999999998" y="585" as="targetPoint" />
            <Array as="points">
              <mxPoint y="610" />
            </Array>
          </mxGeometry>
        </mxCell>
        <mxCell id="aysTpWYp_d0TLLfFKDWt-82" value="&lt;span style=&quot;color: rgba(0, 0, 0, 0); font-family: monospace; font-size: 0px; text-align: start; background-color: rgb(248, 249, 250);&quot;&gt;%3CmxGraphModel%3E%3Croot%3E%3CmxCell%20id%3D%220%22%2F%3E%3CmxCell%20id%3D%221%22%20parent%3D%220%22%2F%3E%3CmxCell%20id%3D%222%22%20value%3D%22%26lt%3Bdiv%26gt%3Bcd%3AfractionOfElement%20(1..1)%26lt%3B%2Fdiv%26gt%3B%22%20style%3D%22text%3Bhtml%3D1%3Balign%3Dcenter%3BverticalAlign%3Dmiddle%3Bresizable%3D0%3Bpoints%3D%5B%5D%3BlabelBackgroundColor%3D%23ffffff%3B%22%20vertex%3D%221%22%20connectable%3D%220%22%20parent%3D%221%22%3E%3CmxGeometry%20x%3D%2260%22%20y%3D%221052%22%20as%3D%22geometry%22%2F%3E%3C%2FmxCell%3E%3C%2Froot%3E%3C%2FmxGraphModel%3&lt;/span&gt;" style="edgeLabel;html=1;align=center;verticalAlign=middle;resizable=0;points=[];" parent="aysTpWYp_d0TLLfFKDWt-81" vertex="1" connectable="0">
          <mxGeometry x="-0.1912" y="-1" relative="1" as="geometry">
            <mxPoint as="offset" />
          </mxGeometry>
        </mxCell>
        <mxCell id="aysTpWYp_d0TLLfFKDWt-83" value="cd:Casting" style="rounded=0;whiteSpace=wrap;html=1;snapToPoint=1;points=[[0.1,0],[0.2,0],[0.3,0],[0.4,0],[0.5,0],[0.6,0],[0.7,0],[0.8,0],[0.9,0],[0,0.1],[0,0.3],[0,0.5],[0,0.7],[0,0.9],[0.1,1],[0.2,1],[0.3,1],[0.4,1],[0.5,1],[0.6,1],[0.7,1],[0.8,1],[0.9,1],[1,0.1],[1,0.3],[1,0.5],[1,0.7],[1,0.9]];fillColor=#f5f5f5;fontColor=#333333;strokeColor=#666666;" parent="1" vertex="1">
          <mxGeometry x="120" y="1200" width="80" height="30" as="geometry" />
        </mxCell>
        <mxCell id="aysTpWYp_d0TLLfFKDWt-84" value="cd:CentrifugalCasting" style="rounded=0;whiteSpace=wrap;html=1;snapToPoint=1;points=[[0.1,0],[0.2,0],[0.3,0],[0.4,0],[0.5,0],[0.6,0],[0.7,0],[0.8,0],[0.9,0],[0,0.1],[0,0.3],[0,0.5],[0,0.7],[0,0.9],[0.1,1],[0.2,1],[0.3,1],[0.4,1],[0.5,1],[0.6,1],[0.7,1],[0.8,1],[0.9,1],[1,0.1],[1,0.3],[1,0.5],[1,0.7],[1,0.9]];" parent="1" vertex="1">
          <mxGeometry x="240" y="1240" width="160" height="30" as="geometry" />
        </mxCell>
        <mxCell id="aysTpWYp_d0TLLfFKDWt-85" value="cd:ContinuousCasting" style="rounded=0;whiteSpace=wrap;html=1;snapToPoint=1;points=[[0.1,0],[0.2,0],[0.3,0],[0.4,0],[0.5,0],[0.6,0],[0.7,0],[0.8,0],[0.9,0],[0,0.1],[0,0.3],[0,0.5],[0,0.7],[0,0.9],[0.1,1],[0.2,1],[0.3,1],[0.4,1],[0.5,1],[0.6,1],[0.7,1],[0.8,1],[0.9,1],[1,0.1],[1,0.3],[1,0.5],[1,0.7],[1,0.9]];" parent="1" vertex="1">
          <mxGeometry x="240" y="1280" width="160" height="30" as="geometry" />
        </mxCell>
        <mxCell id="aysTpWYp_d0TLLfFKDWt-86" value="cd:PermanentMouldCasting" style="rounded=0;whiteSpace=wrap;html=1;snapToPoint=1;points=[[0.1,0],[0.2,0],[0.3,0],[0.4,0],[0.5,0],[0.6,0],[0.7,0],[0.8,0],[0.9,0],[0,0.1],[0,0.3],[0,0.5],[0,0.7],[0,0.9],[0.1,1],[0.2,1],[0.3,1],[0.4,1],[0.5,1],[0.6,1],[0.7,1],[0.8,1],[0.9,1],[1,0.1],[1,0.3],[1,0.5],[1,0.7],[1,0.9]];" parent="1" vertex="1">
          <mxGeometry x="240" y="1320" width="160" height="30" as="geometry" />
        </mxCell>
        <mxCell id="aysTpWYp_d0TLLfFKDWt-87" value="cd:PressureDieCasting" style="rounded=0;whiteSpace=wrap;html=1;snapToPoint=1;points=[[0.1,0],[0.2,0],[0.3,0],[0.4,0],[0.5,0],[0.6,0],[0.7,0],[0.8,0],[0.9,0],[0,0.1],[0,0.3],[0,0.5],[0,0.7],[0,0.9],[0.1,1],[0.2,1],[0.3,1],[0.4,1],[0.5,1],[0.6,1],[0.7,1],[0.8,1],[0.9,1],[1,0.1],[1,0.3],[1,0.5],[1,0.7],[1,0.9]];" parent="1" vertex="1">
          <mxGeometry x="240" y="1360" width="160" height="30" as="geometry" />
        </mxCell>
        <mxCell id="aysTpWYp_d0TLLfFKDWt-88" value="cd:SandCasting" style="rounded=0;whiteSpace=wrap;html=1;snapToPoint=1;points=[[0.1,0],[0.2,0],[0.3,0],[0.4,0],[0.5,0],[0.6,0],[0.7,0],[0.8,0],[0.9,0],[0,0.1],[0,0.3],[0,0.5],[0,0.7],[0,0.9],[0.1,1],[0.2,1],[0.3,1],[0.4,1],[0.5,1],[0.6,1],[0.7,1],[0.8,1],[0.9,1],[1,0.1],[1,0.3],[1,0.5],[1,0.7],[1,0.9]];" parent="1" vertex="1">
          <mxGeometry x="240" y="1400" width="160" height="30" as="geometry" />
        </mxCell>
        <mxCell id="aysTpWYp_d0TLLfFKDWt-89" value="iof:ManufacturingProcess" style="rounded=0;whiteSpace=wrap;html=1;snapToPoint=1;points=[[0.1,0],[0.2,0],[0.3,0],[0.4,0],[0.5,0],[0.6,0],[0.7,0],[0.8,0],[0.9,0],[0,0.1],[0,0.3],[0,0.5],[0,0.7],[0,0.9],[0.1,1],[0.2,1],[0.3,1],[0.4,1],[0.5,1],[0.6,1],[0.7,1],[0.8,1],[0.9,1],[1,0.1],[1,0.3],[1,0.5],[1,0.7],[1,0.9]];fillColor=#dae8fc;strokeColor=#6c8ebf;" parent="1" vertex="1">
          <mxGeometry y="1040" width="160" height="30" as="geometry" />
        </mxCell>
        <mxCell id="aysTpWYp_d0TLLfFKDWt-90" value="" style="endArrow=block;html=1;fontColor=#000099;endFill=0;endSize=8;arcSize=0;rounded=0;" parent="1" source="aysTpWYp_d0TLLfFKDWt-83" target="aysTpWYp_d0TLLfFKDWt-89" edge="1">
          <mxGeometry width="50" height="50" relative="1" as="geometry">
            <mxPoint x="489.96000000000004" y="889.01" as="sourcePoint" />
            <mxPoint x="489.96000000000004" y="839.01" as="targetPoint" />
            <Array as="points">
              <mxPoint x="80" y="1215" />
            </Array>
          </mxGeometry>
        </mxCell>
        <mxCell id="aysTpWYp_d0TLLfFKDWt-91" value="" style="endArrow=block;html=1;fontColor=#000099;endFill=0;endSize=8;arcSize=0;rounded=0;" parent="1" source="aysTpWYp_d0TLLfFKDWt-84" target="aysTpWYp_d0TLLfFKDWt-83" edge="1">
          <mxGeometry width="50" height="50" relative="1" as="geometry">
            <mxPoint x="169.96000000000004" y="1169.01" as="sourcePoint" />
            <mxPoint x="169.96000000000004" y="1119.01" as="targetPoint" />
            <Array as="points">
              <mxPoint x="160" y="1255" />
            </Array>
          </mxGeometry>
        </mxCell>
        <mxCell id="aysTpWYp_d0TLLfFKDWt-92" value="" style="endArrow=block;html=1;fontColor=#000099;endFill=0;endSize=8;arcSize=0;rounded=0;" parent="1" source="aysTpWYp_d0TLLfFKDWt-85" target="aysTpWYp_d0TLLfFKDWt-83" edge="1">
          <mxGeometry width="50" height="50" relative="1" as="geometry">
            <mxPoint x="273.96000000000004" y="1249.01" as="sourcePoint" />
            <mxPoint x="193.96000000000004" y="1199.01" as="targetPoint" />
            <Array as="points">
              <mxPoint x="160" y="1295" />
            </Array>
          </mxGeometry>
        </mxCell>
        <mxCell id="aysTpWYp_d0TLLfFKDWt-93" value="" style="endArrow=block;html=1;fontColor=#000099;endFill=0;endSize=8;arcSize=0;rounded=0;" parent="1" source="aysTpWYp_d0TLLfFKDWt-86" target="aysTpWYp_d0TLLfFKDWt-83" edge="1">
          <mxGeometry width="50" height="50" relative="1" as="geometry">
            <mxPoint x="273.96000000000004" y="1289.0100000000002" as="sourcePoint" />
            <mxPoint x="185.96000000000004" y="1199.01" as="targetPoint" />
            <Array as="points">
              <mxPoint x="160" y="1335" />
            </Array>
          </mxGeometry>
        </mxCell>
        <mxCell id="aysTpWYp_d0TLLfFKDWt-94" value="" style="endArrow=block;html=1;fontColor=#000099;endFill=0;endSize=8;arcSize=0;rounded=0;" parent="1" source="aysTpWYp_d0TLLfFKDWt-87" target="aysTpWYp_d0TLLfFKDWt-83" edge="1">
          <mxGeometry width="50" height="50" relative="1" as="geometry">
            <mxPoint x="273.96000000000004" y="1329.0100000000002" as="sourcePoint" />
            <mxPoint x="177.96000000000004" y="1199.01" as="targetPoint" />
            <Array as="points">
              <mxPoint x="160" y="1375" />
            </Array>
          </mxGeometry>
        </mxCell>
        <mxCell id="aysTpWYp_d0TLLfFKDWt-95" value="" style="endArrow=block;html=1;fontColor=#000099;endFill=0;endSize=8;arcSize=0;rounded=0;" parent="1" source="aysTpWYp_d0TLLfFKDWt-88" target="aysTpWYp_d0TLLfFKDWt-83" edge="1">
          <mxGeometry width="50" height="50" relative="1" as="geometry">
            <mxPoint x="273.96000000000004" y="1369.0100000000002" as="sourcePoint" />
            <mxPoint x="177.96000000000004" y="1199.01" as="targetPoint" />
            <Array as="points">
              <mxPoint x="160" y="1415" />
            </Array>
          </mxGeometry>
        </mxCell>
        <mxCell id="aysTpWYp_d0TLLfFKDWt-96" value="&lt;span style=&quot;font-size: 12px;&quot;&gt;(some) iof:isOutputOf&lt;/span&gt;" style="endArrow=classic;html=1;endSize=8;startArrow=none;startFill=0;dashed=1;arcSize=0;rounded=0;" parent="1" source="aysTpWYp_d0TLLfFKDWt-97" target="aysTpWYp_d0TLLfFKDWt-83" edge="1">
          <mxGeometry width="50" height="50" relative="1" as="geometry">
            <mxPoint x="469.98" y="1099.01" as="sourcePoint" />
            <mxPoint x="280.02" y="1214.01" as="targetPoint" />
          </mxGeometry>
        </mxCell>
        <mxCell id="aysTpWYp_d0TLLfFKDWt-97" value="cd:Cast" style="rounded=0;whiteSpace=wrap;html=1;snapToPoint=1;points=[[0.1,0],[0.2,0],[0.3,0],[0.4,0],[0.5,0],[0.6,0],[0.7,0],[0.8,0],[0.9,0],[0,0.1],[0,0.3],[0,0.5],[0,0.7],[0,0.9],[0.1,1],[0.2,1],[0.3,1],[0.4,1],[0.5,1],[0.6,1],[0.7,1],[0.8,1],[0.9,1],[1,0.1],[1,0.3],[1,0.5],[1,0.7],[1,0.9]];fillColor=#f5f5f5;fontColor=#333333;strokeColor=#666666;" parent="1" vertex="1">
          <mxGeometry x="760" y="1200" width="120" height="30" as="geometry" />
        </mxCell>
        <mxCell id="aysTpWYp_d0TLLfFKDWt-98" value="&lt;span style=&quot;font-size: 12px;&quot;&gt;(some) iof:isOutputOf&lt;/span&gt;" style="endArrow=classic;html=1;endSize=8;startArrow=none;startFill=0;dashed=1;arcSize=0;rounded=0;" parent="1" source="aysTpWYp_d0TLLfFKDWt-99" target="aysTpWYp_d0TLLfFKDWt-84" edge="1">
          <mxGeometry width="50" height="50" relative="1" as="geometry">
            <mxPoint x="509.98" y="1179.01" as="sourcePoint" />
            <mxPoint x="319.98" y="1254.01" as="targetPoint" />
          </mxGeometry>
        </mxCell>
        <mxCell id="aysTpWYp_d0TLLfFKDWt-99" value="cd:CentrifugalCast" style="rounded=0;whiteSpace=wrap;html=1;snapToPoint=1;points=[[0.1,0],[0.2,0],[0.3,0],[0.4,0],[0.5,0],[0.6,0],[0.7,0],[0.8,0],[0.9,0],[0,0.1],[0,0.3],[0,0.5],[0,0.7],[0,0.9],[0.1,1],[0.2,1],[0.3,1],[0.4,1],[0.5,1],[0.6,1],[0.7,1],[0.8,1],[0.9,1],[1,0.1],[1,0.3],[1,0.5],[1,0.7],[1,0.9]];" parent="1" vertex="1">
          <mxGeometry x="560" y="1240" width="160" height="30" as="geometry" />
        </mxCell>
        <mxCell id="aysTpWYp_d0TLLfFKDWt-100" value="cd:ContinuousCast" style="rounded=0;whiteSpace=wrap;html=1;snapToPoint=1;points=[[0.1,0],[0.2,0],[0.3,0],[0.4,0],[0.5,0],[0.6,0],[0.7,0],[0.8,0],[0.9,0],[0,0.1],[0,0.3],[0,0.5],[0,0.7],[0,0.9],[0.1,1],[0.2,1],[0.3,1],[0.4,1],[0.5,1],[0.6,1],[0.7,1],[0.8,1],[0.9,1],[1,0.1],[1,0.3],[1,0.5],[1,0.7],[1,0.9]];" parent="1" vertex="1">
          <mxGeometry x="560" y="1280" width="160" height="30" as="geometry" />
        </mxCell>
        <mxCell id="aysTpWYp_d0TLLfFKDWt-101" value="cd:PermanentMouldCast" style="rounded=0;whiteSpace=wrap;html=1;snapToPoint=1;points=[[0.1,0],[0.2,0],[0.3,0],[0.4,0],[0.5,0],[0.6,0],[0.7,0],[0.8,0],[0.9,0],[0,0.1],[0,0.3],[0,0.5],[0,0.7],[0,0.9],[0.1,1],[0.2,1],[0.3,1],[0.4,1],[0.5,1],[0.6,1],[0.7,1],[0.8,1],[0.9,1],[1,0.1],[1,0.3],[1,0.5],[1,0.7],[1,0.9]];" parent="1" vertex="1">
          <mxGeometry x="560" y="1320" width="160" height="30" as="geometry" />
        </mxCell>
        <mxCell id="aysTpWYp_d0TLLfFKDWt-102" value="cd:PressureDieCast" style="rounded=0;whiteSpace=wrap;html=1;snapToPoint=1;points=[[0.1,0],[0.2,0],[0.3,0],[0.4,0],[0.5,0],[0.6,0],[0.7,0],[0.8,0],[0.9,0],[0,0.1],[0,0.3],[0,0.5],[0,0.7],[0,0.9],[0.1,1],[0.2,1],[0.3,1],[0.4,1],[0.5,1],[0.6,1],[0.7,1],[0.8,1],[0.9,1],[1,0.1],[1,0.3],[1,0.5],[1,0.7],[1,0.9]];" parent="1" vertex="1">
          <mxGeometry x="560" y="1360" width="160" height="30" as="geometry" />
        </mxCell>
        <mxCell id="aysTpWYp_d0TLLfFKDWt-103" value="cd:SandCast" style="rounded=0;whiteSpace=wrap;html=1;snapToPoint=1;points=[[0.1,0],[0.2,0],[0.3,0],[0.4,0],[0.5,0],[0.6,0],[0.7,0],[0.8,0],[0.9,0],[0,0.1],[0,0.3],[0,0.5],[0,0.7],[0,0.9],[0.1,1],[0.2,1],[0.3,1],[0.4,1],[0.5,1],[0.6,1],[0.7,1],[0.8,1],[0.9,1],[1,0.1],[1,0.3],[1,0.5],[1,0.7],[1,0.9]];" parent="1" vertex="1">
          <mxGeometry x="560" y="1400" width="160" height="30" as="geometry" />
        </mxCell>
        <mxCell id="aysTpWYp_d0TLLfFKDWt-104" value="&lt;span style=&quot;font-size: 12px;&quot;&gt;(some) iof:isOutputOf&lt;/span&gt;" style="endArrow=classic;html=1;endSize=8;startArrow=none;startFill=0;dashed=1;arcSize=0;rounded=0;" parent="1" source="aysTpWYp_d0TLLfFKDWt-100" target="aysTpWYp_d0TLLfFKDWt-85" edge="1">
          <mxGeometry width="50" height="50" relative="1" as="geometry">
            <mxPoint x="569.98" y="1264.01" as="sourcePoint" />
            <mxPoint x="409.98" y="1264.01" as="targetPoint" />
          </mxGeometry>
        </mxCell>
        <mxCell id="aysTpWYp_d0TLLfFKDWt-105" value="&lt;span style=&quot;font-size: 12px;&quot;&gt;(some) iof:isOutputOf&lt;/span&gt;" style="endArrow=classic;html=1;endSize=8;startArrow=none;startFill=0;dashed=1;arcSize=0;rounded=0;" parent="1" source="aysTpWYp_d0TLLfFKDWt-101" target="aysTpWYp_d0TLLfFKDWt-86" edge="1">
          <mxGeometry width="50" height="50" relative="1" as="geometry">
            <mxPoint x="569.98" y="1304.0100000000002" as="sourcePoint" />
            <mxPoint x="409.98" y="1304.0100000000002" as="targetPoint" />
          </mxGeometry>
        </mxCell>
        <mxCell id="aysTpWYp_d0TLLfFKDWt-106" value="&lt;span style=&quot;font-size: 12px;&quot;&gt;(some) iof:isOutputOf&lt;/span&gt;" style="endArrow=classic;html=1;endSize=8;startArrow=none;startFill=0;dashed=1;arcSize=0;rounded=0;" parent="1" source="aysTpWYp_d0TLLfFKDWt-102" target="aysTpWYp_d0TLLfFKDWt-87" edge="1">
          <mxGeometry width="50" height="50" relative="1" as="geometry">
            <mxPoint x="569.98" y="1344.0100000000002" as="sourcePoint" />
            <mxPoint x="409.98" y="1344.0100000000002" as="targetPoint" />
          </mxGeometry>
        </mxCell>
        <mxCell id="aysTpWYp_d0TLLfFKDWt-107" value="&lt;span style=&quot;font-size: 12px;&quot;&gt;(some) iof:isOutputOf&lt;/span&gt;" style="endArrow=classic;html=1;endSize=8;startArrow=none;startFill=0;dashed=1;arcSize=0;rounded=0;" parent="1" source="aysTpWYp_d0TLLfFKDWt-103" target="aysTpWYp_d0TLLfFKDWt-88" edge="1">
          <mxGeometry width="50" height="50" relative="1" as="geometry">
            <mxPoint x="569.98" y="1384.0100000000002" as="sourcePoint" />
            <mxPoint x="409.98" y="1384.0100000000002" as="targetPoint" />
          </mxGeometry>
        </mxCell>
        <mxCell id="aysTpWYp_d0TLLfFKDWt-108" value="" style="endArrow=block;html=1;fontColor=#000099;endFill=0;endSize=8;arcSize=0;rounded=0;" parent="1" source="aysTpWYp_d0TLLfFKDWt-97" target="aysTpWYp_d0TLLfFKDWt-119" edge="1">
          <mxGeometry width="50" height="50" relative="1" as="geometry">
            <mxPoint x="210" y="1169.01" as="sourcePoint" />
            <mxPoint x="920" y="1109" as="targetPoint" />
            <Array as="points">
              <mxPoint x="920" y="1215" />
            </Array>
          </mxGeometry>
        </mxCell>
        <mxCell id="aysTpWYp_d0TLLfFKDWt-109" value="" style="endArrow=block;html=1;fontColor=#000099;endFill=0;endSize=8;arcSize=0;rounded=0;" parent="1" source="aysTpWYp_d0TLLfFKDWt-99" target="aysTpWYp_d0TLLfFKDWt-97" edge="1">
          <mxGeometry width="50" height="50" relative="1" as="geometry">
            <mxPoint x="919.98" y="1254.01" as="sourcePoint" />
            <mxPoint x="839.98" y="1229.01" as="targetPoint" />
            <Array as="points">
              <mxPoint x="820" y="1255" />
            </Array>
          </mxGeometry>
        </mxCell>
        <mxCell id="aysTpWYp_d0TLLfFKDWt-110" value="" style="endArrow=block;html=1;fontColor=#000099;endFill=0;endSize=8;arcSize=0;rounded=0;" parent="1" source="aysTpWYp_d0TLLfFKDWt-100" target="aysTpWYp_d0TLLfFKDWt-97" edge="1">
          <mxGeometry width="50" height="50" relative="1" as="geometry">
            <mxPoint x="919.98" y="1294.0100000000002" as="sourcePoint" />
            <mxPoint x="839.98" y="1229.01" as="targetPoint" />
            <Array as="points">
              <mxPoint x="820" y="1295" />
            </Array>
          </mxGeometry>
        </mxCell>
        <mxCell id="aysTpWYp_d0TLLfFKDWt-111" value="" style="endArrow=block;html=1;fontColor=#000099;endFill=0;endSize=8;arcSize=0;rounded=0;" parent="1" source="aysTpWYp_d0TLLfFKDWt-101" target="aysTpWYp_d0TLLfFKDWt-97" edge="1">
          <mxGeometry width="50" height="50" relative="1" as="geometry">
            <mxPoint x="919.98" y="1334.0100000000002" as="sourcePoint" />
            <mxPoint x="839.98" y="1229.01" as="targetPoint" />
            <Array as="points">
              <mxPoint x="820" y="1335" />
            </Array>
          </mxGeometry>
        </mxCell>
        <mxCell id="aysTpWYp_d0TLLfFKDWt-112" value="" style="endArrow=block;html=1;fontColor=#000099;endFill=0;endSize=8;arcSize=0;rounded=0;" parent="1" source="aysTpWYp_d0TLLfFKDWt-102" target="aysTpWYp_d0TLLfFKDWt-97" edge="1">
          <mxGeometry width="50" height="50" relative="1" as="geometry">
            <mxPoint x="919.98" y="1374.0100000000002" as="sourcePoint" />
            <mxPoint x="839.98" y="1229.01" as="targetPoint" />
            <Array as="points">
              <mxPoint x="820" y="1375" />
            </Array>
          </mxGeometry>
        </mxCell>
        <mxCell id="aysTpWYp_d0TLLfFKDWt-113" value="" style="endArrow=block;html=1;fontColor=#000099;endFill=0;endSize=8;arcSize=0;rounded=0;" parent="1" source="aysTpWYp_d0TLLfFKDWt-103" target="aysTpWYp_d0TLLfFKDWt-97" edge="1">
          <mxGeometry width="50" height="50" relative="1" as="geometry">
            <mxPoint x="919.98" y="1414.0100000000002" as="sourcePoint" />
            <mxPoint x="839.98" y="1229.01" as="targetPoint" />
            <Array as="points">
              <mxPoint x="820" y="1415" />
            </Array>
          </mxGeometry>
        </mxCell>
        <mxCell id="aysTpWYp_d0TLLfFKDWt-114" value="cd:Wroughting" style="rounded=0;whiteSpace=wrap;html=1;snapToPoint=1;points=[[0.1,0],[0.2,0],[0.3,0],[0.4,0],[0.5,0],[0.6,0],[0.7,0],[0.8,0],[0.9,0],[0,0.1],[0,0.3],[0,0.5],[0,0.7],[0,0.9],[0.1,1],[0.2,1],[0.3,1],[0.4,1],[0.5,1],[0.6,1],[0.7,1],[0.8,1],[0.9,1],[1,0.1],[1,0.3],[1,0.5],[1,0.7],[1,0.9]];fillColor=#f5f5f5;fontColor=#333333;strokeColor=#666666;" parent="1" vertex="1">
          <mxGeometry x="120.03999999999999" y="1440" width="120" height="30" as="geometry" />
        </mxCell>
        <mxCell id="aysTpWYp_d0TLLfFKDWt-115" value="cd:WroughtMaterial" style="rounded=0;whiteSpace=wrap;html=1;snapToPoint=1;points=[[0.1,0],[0.2,0],[0.3,0],[0.4,0],[0.5,0],[0.6,0],[0.7,0],[0.8,0],[0.9,0],[0,0.1],[0,0.3],[0,0.5],[0,0.7],[0,0.9],[0.1,1],[0.2,1],[0.3,1],[0.4,1],[0.5,1],[0.6,1],[0.7,1],[0.8,1],[0.9,1],[1,0.1],[1,0.3],[1,0.5],[1,0.7],[1,0.9]];fillColor=#f5f5f5;fontColor=#333333;strokeColor=#666666;" parent="1" vertex="1">
          <mxGeometry x="760" y="1440" width="120" height="30" as="geometry" />
        </mxCell>
        <mxCell id="aysTpWYp_d0TLLfFKDWt-116" value="&lt;span style=&quot;font-size: 12px;&quot;&gt;(some) iof:isOutputOf&lt;/span&gt;" style="endArrow=classic;html=1;endSize=8;startArrow=none;startFill=0;dashed=1;arcSize=0;rounded=0;" parent="1" source="aysTpWYp_d0TLLfFKDWt-115" target="aysTpWYp_d0TLLfFKDWt-114" edge="1">
          <mxGeometry width="50" height="50" relative="1" as="geometry">
            <mxPoint x="810" y="1264.01" as="sourcePoint" />
            <mxPoint x="250" y="1264.01" as="targetPoint" />
          </mxGeometry>
        </mxCell>
        <mxCell id="aysTpWYp_d0TLLfFKDWt-117" value="" style="endArrow=block;html=1;fontColor=#000099;endFill=0;endSize=8;arcSize=0;rounded=0;" parent="1" source="aysTpWYp_d0TLLfFKDWt-115" target="aysTpWYp_d0TLLfFKDWt-119" edge="1">
          <mxGeometry width="50" height="50" relative="1" as="geometry">
            <mxPoint x="890" y="1264.01" as="sourcePoint" />
            <mxPoint x="920" y="1109" as="targetPoint" />
            <Array as="points">
              <mxPoint x="920" y="1455" />
              <mxPoint x="920" y="1175" />
            </Array>
          </mxGeometry>
        </mxCell>
        <mxCell id="aysTpWYp_d0TLLfFKDWt-118" value="" style="endArrow=block;html=1;fontColor=#000099;endFill=0;endSize=8;arcSize=0;rounded=0;" parent="1" source="aysTpWYp_d0TLLfFKDWt-114" target="aysTpWYp_d0TLLfFKDWt-89" edge="1">
          <mxGeometry width="50" height="50" relative="1" as="geometry">
            <mxPoint x="130" y="1264.01" as="sourcePoint" />
            <mxPoint x="90" y="1119.01" as="targetPoint" />
            <Array as="points">
              <mxPoint x="80" y="1455" />
            </Array>
          </mxGeometry>
        </mxCell>
        <mxCell id="aysTpWYp_d0TLLfFKDWt-119" value="&lt;div style=&quot;text-align: start;&quot;&gt;iof:MaterialArtifact&lt;/div&gt;" style="rounded=0;whiteSpace=wrap;html=1;snapToPoint=1;points=[[0.1,0],[0.2,0],[0.3,0],[0.4,0],[0.5,0],[0.6,0],[0.7,0],[0.8,0],[0.9,0],[0,0.1],[0,0.3],[0,0.5],[0,0.7],[0,0.9],[0.1,1],[0.2,1],[0.3,1],[0.4,1],[0.5,1],[0.6,1],[0.7,1],[0.8,1],[0.9,1],[1,0.1],[1,0.3],[1,0.5],[1,0.7],[1,0.9]];fillColor=#dae8fc;strokeColor=#6c8ebf;" parent="1" vertex="1">
          <mxGeometry x="860" y="960" width="120" height="30" as="geometry" />
        </mxCell>
        <mxCell id="aysTpWYp_d0TLLfFKDWt-123" value="&lt;div&gt;&amp;lt;&amp;lt;owl:ObjectProperty&amp;gt;&amp;gt; iof:subjectOf&lt;br&gt;&lt;/div&gt;" style="rhombus;whiteSpace=wrap;html=1;fillColor=#dae8fc;strokeColor=#6c8ebf;" parent="1" vertex="1">
          <mxGeometry x="1320" y="200" width="200" height="80" as="geometry" />
        </mxCell>
        <mxCell id="aysTpWYp_d0TLLfFKDWt-124" value="" style="endArrow=open;html=1;fontColor=#000099;endFill=0;dashed=1;endSize=8;arcSize=0;rounded=0;" parent="1" source="aysTpWYp_d0TLLfFKDWt-3" target="aysTpWYp_d0TLLfFKDWt-126" edge="1">
          <mxGeometry width="50" height="50" relative="1" as="geometry">
            <mxPoint x="1180" y="680" as="sourcePoint" />
            <mxPoint x="1180" y="1010" as="targetPoint" />
          </mxGeometry>
        </mxCell>
        <mxCell id="aysTpWYp_d0TLLfFKDWt-125" value="&amp;lt;&amp;lt;rdfs:subPropertyOf&amp;gt;&amp;gt;" style="text;html=1;align=center;verticalAlign=middle;resizable=0;points=[];fontColor=#000000;labelBackgroundColor=#ffffff;" parent="aysTpWYp_d0TLLfFKDWt-124" vertex="1" connectable="0">
          <mxGeometry x="-0.3277" relative="1" as="geometry">
            <mxPoint y="2" as="offset" />
          </mxGeometry>
        </mxCell>
        <mxCell id="aysTpWYp_d0TLLfFKDWt-126" value="&lt;div&gt;&amp;lt;&amp;lt;owl:ObjectProperty&amp;gt;&amp;gt; iof:prescribes&lt;br&gt;&lt;/div&gt;" style="rhombus;whiteSpace=wrap;html=1;fillColor=#dae8fc;strokeColor=#6c8ebf;" parent="1" vertex="1">
          <mxGeometry x="1080" y="560" width="200" height="80" as="geometry" />
        </mxCell>
        <mxCell id="aysTpWYp_d0TLLfFKDWt-127" value="" style="endArrow=open;html=1;fontColor=#000099;endFill=0;dashed=1;endSize=8;arcSize=0;rounded=0;" parent="1" source="aysTpWYp_d0TLLfFKDWt-30" target="aysTpWYp_d0TLLfFKDWt-29" edge="1">
          <mxGeometry width="50" height="50" relative="1" as="geometry">
            <mxPoint x="1314.4444444444443" y="1187.7777777777778" as="sourcePoint" />
            <mxPoint x="1465.5555555555557" y="1112.2222222222222" as="targetPoint" />
          </mxGeometry>
        </mxCell>
        <mxCell id="aysTpWYp_d0TLLfFKDWt-128" value="&amp;lt;&amp;lt;rdfs:subPropertyOf&amp;gt;&amp;gt;" style="text;html=1;align=center;verticalAlign=middle;resizable=0;points=[];fontColor=#000000;labelBackgroundColor=#ffffff;" parent="aysTpWYp_d0TLLfFKDWt-127" vertex="1" connectable="0">
          <mxGeometry x="-0.3277" relative="1" as="geometry">
            <mxPoint y="-7" as="offset" />
          </mxGeometry>
        </mxCell>
        <mxCell id="aysTpWYp_d0TLLfFKDWt-129" value="" style="endArrow=open;html=1;fontColor=#000099;endFill=0;dashed=1;endSize=8;arcSize=0;rounded=0;" parent="1" source="aysTpWYp_d0TLLfFKDWt-43" target="aysTpWYp_d0TLLfFKDWt-131" edge="1">
          <mxGeometry width="50" height="50" relative="1" as="geometry">
            <mxPoint x="1420" y="520" as="sourcePoint" />
            <mxPoint x="1420" y="1010" as="targetPoint" />
          </mxGeometry>
        </mxCell>
        <mxCell id="aysTpWYp_d0TLLfFKDWt-130" value="&amp;lt;&amp;lt;rdfs:subPropertyOf&amp;gt;&amp;gt;" style="text;html=1;align=center;verticalAlign=middle;resizable=0;points=[];fontColor=#000000;labelBackgroundColor=#ffffff;" parent="aysTpWYp_d0TLLfFKDWt-129" vertex="1" connectable="0">
          <mxGeometry x="-0.3277" relative="1" as="geometry">
            <mxPoint y="2" as="offset" />
          </mxGeometry>
        </mxCell>
        <mxCell id="aysTpWYp_d0TLLfFKDWt-131" value="&lt;div&gt;&amp;lt;&amp;lt;owl:ObjectProperty&amp;gt;&amp;gt;&lt;/div&gt;&lt;div&gt;iof:isAbout&lt;br&gt;&lt;/div&gt;" style="rhombus;whiteSpace=wrap;html=1;fillColor=#dae8fc;strokeColor=#6c8ebf;" parent="1" vertex="1">
          <mxGeometry x="1320" y="560" width="200" height="80" as="geometry" />
        </mxCell>
        <mxCell id="aysTpWYp_d0TLLfFKDWt-132" value="&lt;div&gt;&amp;lt;&amp;lt;owl:ObjectProperty&amp;gt;&amp;gt; iof:prescribedBy&lt;br&gt;&lt;/div&gt;" style="rhombus;whiteSpace=wrap;html=1;fillColor=#dae8fc;strokeColor=#6c8ebf;" parent="1" vertex="1">
          <mxGeometry x="1080" y="200" width="200" height="80" as="geometry" />
        </mxCell>
        <mxCell id="aysTpWYp_d0TLLfFKDWt-133" value="" style="endArrow=open;html=1;fontColor=#000099;endFill=0;dashed=1;endSize=8;arcSize=0;rounded=0;" parent="1" source="aysTpWYp_d0TLLfFKDWt-29" target="aysTpWYp_d0TLLfFKDWt-135" edge="1">
          <mxGeometry width="50" height="50" relative="1" as="geometry">
            <mxPoint x="1500" y="880" as="sourcePoint" />
            <mxPoint x="1500" y="1370" as="targetPoint" />
          </mxGeometry>
        </mxCell>
        <mxCell id="aysTpWYp_d0TLLfFKDWt-134" value="&amp;lt;&amp;lt;rdfs:subPropertyOf&amp;gt;&amp;gt;" style="text;html=1;align=center;verticalAlign=middle;resizable=0;points=[];fontColor=#000000;labelBackgroundColor=#ffffff;" parent="aysTpWYp_d0TLLfFKDWt-133" vertex="1" connectable="0">
          <mxGeometry x="-0.3277" relative="1" as="geometry">
            <mxPoint y="2" as="offset" />
          </mxGeometry>
        </mxCell>
        <mxCell id="aysTpWYp_d0TLLfFKDWt-135" value="&lt;div&gt;&amp;lt;&amp;lt;owl:DataatypeProperty&amp;gt;&amp;gt;&amp;nbsp;&lt;span style=&quot;background-color: initial;&quot;&gt;iof:hasValue&lt;/span&gt;&lt;/div&gt;" style="rhombus;whiteSpace=wrap;html=1;fillColor=#dae8fc;strokeColor=#6c8ebf;" parent="1" vertex="1">
          <mxGeometry x="1400" y="920" width="200" height="80" as="geometry" />
        </mxCell>
        <mxCell id="aysTpWYp_d0TLLfFKDWt-136" value="" style="endArrow=open;html=1;fontColor=#000099;endFill=0;dashed=1;endSize=8;arcSize=0;rounded=0;" parent="1" source="aysTpWYp_d0TLLfFKDWt-2" target="aysTpWYp_d0TLLfFKDWt-132" edge="1">
          <mxGeometry width="50" height="50" relative="1" as="geometry">
            <mxPoint x="1430" y="330" as="sourcePoint" />
            <mxPoint x="1430" y="290" as="targetPoint" />
          </mxGeometry>
        </mxCell>
        <mxCell id="aysTpWYp_d0TLLfFKDWt-137" value="&amp;lt;&amp;lt;rdfs:subPropertyOf&amp;gt;&amp;gt;" style="text;html=1;align=center;verticalAlign=middle;resizable=0;points=[];fontColor=#000000;labelBackgroundColor=#ffffff;" parent="aysTpWYp_d0TLLfFKDWt-136" vertex="1" connectable="0">
          <mxGeometry x="-0.3277" relative="1" as="geometry">
            <mxPoint y="-7" as="offset" />
          </mxGeometry>
        </mxCell>
        <mxCell id="aysTpWYp_d0TLLfFKDWt-138" value="" style="endArrow=open;html=1;fontColor=#000099;endFill=0;dashed=1;endSize=8;arcSize=0;rounded=0;" parent="1" source="aysTpWYp_d0TLLfFKDWt-22" target="aysTpWYp_d0TLLfFKDWt-135" edge="1">
          <mxGeometry width="50" height="50" relative="1" as="geometry">
            <mxPoint x="1510" y="1050" as="sourcePoint" />
            <mxPoint x="1510" y="1010" as="targetPoint" />
          </mxGeometry>
        </mxCell>
        <mxCell id="aysTpWYp_d0TLLfFKDWt-139" value="&amp;lt;&amp;lt;rdfs:subPropertyOf&amp;gt;&amp;gt;" style="text;html=1;align=center;verticalAlign=middle;resizable=0;points=[];fontColor=#000000;labelBackgroundColor=#ffffff;" parent="aysTpWYp_d0TLLfFKDWt-138" vertex="1" connectable="0">
          <mxGeometry x="-0.3277" relative="1" as="geometry">
            <mxPoint y="2" as="offset" />
          </mxGeometry>
        </mxCell>
        <mxCell id="aysTpWYp_d0TLLfFKDWt-140" value="cd:Alloy" style="rounded=0;whiteSpace=wrap;html=1;snapToPoint=1;points=[[0.1,0],[0.2,0],[0.3,0],[0.4,0],[0.5,0],[0.6,0],[0.7,0],[0.8,0],[0.9,0],[0,0.1],[0,0.3],[0,0.5],[0,0.7],[0,0.9],[0.1,1],[0.2,1],[0.3,1],[0.4,1],[0.5,1],[0.6,1],[0.7,1],[0.8,1],[0.9,1],[1,0.1],[1,0.3],[1,0.5],[1,0.7],[1,0.9]];fillColor=#f5f5f5;fontColor=#333333;strokeColor=#666666;" parent="1" vertex="1">
          <mxGeometry x="730" y="1600" width="160" height="30" as="geometry" />
        </mxCell>
        <mxCell id="aysTpWYp_d0TLLfFKDWt-141" value="" style="endArrow=block;html=1;fontColor=#000099;endFill=0;endSize=8;arcSize=0;rounded=0;" parent="1" source="aysTpWYp_d0TLLfFKDWt-140" target="aysTpWYp_d0TLLfFKDWt-119" edge="1">
          <mxGeometry width="50" height="50" relative="1" as="geometry">
            <mxPoint x="890.4705882352941" y="1265.1764705882356" as="sourcePoint" />
            <mxPoint x="930.4705882352941" y="1040.4705882352941" as="targetPoint" />
            <Array as="points">
              <mxPoint x="920" y="1615" />
            </Array>
          </mxGeometry>
        </mxCell>
        <mxCell id="aysTpWYp_d0TLLfFKDWt-142" value="" style="endArrow=block;html=1;fontColor=#000099;endFill=0;endSize=8;arcSize=0;rounded=0;" parent="1" source="aysTpWYp_d0TLLfFKDWt-41" target="aysTpWYp_d0TLLfFKDWt-149" edge="1">
          <mxGeometry width="50" height="50" relative="1" as="geometry">
            <mxPoint x="354.5882352941178" y="409.8823529411766" as="sourcePoint" />
            <mxPoint x="99.82352941176475" y="350.47058823529414" as="targetPoint" />
          </mxGeometry>
        </mxCell>
        <mxCell id="aysTpWYp_d0TLLfFKDWt-143" value="iof:ValueSpecification" style="rounded=0;whiteSpace=wrap;html=1;snapToPoint=1;points=[[0.1,0],[0.2,0],[0.3,0],[0.4,0],[0.5,0],[0.6,0],[0.7,0],[0.8,0],[0.9,0],[0,0.1],[0,0.3],[0,0.5],[0,0.7],[0,0.9],[0.1,1],[0.2,1],[0.3,1],[0.4,1],[0.5,1],[0.6,1],[0.7,1],[0.8,1],[0.9,1],[1,0.1],[1,0.3],[1,0.5],[1,0.7],[1,0.9]];fillColor=#f8cecc;strokeColor=#b85450;" parent="1" vertex="1">
          <mxGeometry x="600" y="600" width="160" height="30" as="geometry" />
        </mxCell>
        <mxCell id="aysTpWYp_d0TLLfFKDWt-144" value="" style="endArrow=block;html=1;fontColor=#000099;endFill=0;endSize=8;arcSize=0;rounded=0;" parent="1" source="aysTpWYp_d0TLLfFKDWt-49" target="aysTpWYp_d0TLLfFKDWt-143" edge="1">
          <mxGeometry width="50" height="50" relative="1" as="geometry">
            <mxPoint x="249.82352941176475" y="665.1764705882351" as="sourcePoint" />
            <mxPoint x="389.82352941176475" y="665.1764705882351" as="targetPoint" />
          </mxGeometry>
        </mxCell>
        <mxCell id="aysTpWYp_d0TLLfFKDWt-145" value="" style="endArrow=block;html=1;fontColor=#000099;endFill=0;endSize=8;arcSize=0;rounded=0;" parent="1" source="aysTpWYp_d0TLLfFKDWt-51" target="aysTpWYp_d0TLLfFKDWt-143" edge="1">
          <mxGeometry width="50" height="50" relative="1" as="geometry">
            <mxPoint x="509.82352941176464" y="596.9411764705883" as="sourcePoint" />
            <mxPoint x="589.8235294117646" y="613.4117647058824" as="targetPoint" />
          </mxGeometry>
        </mxCell>
        <mxCell id="aysTpWYp_d0TLLfFKDWt-146" value="≡" style="ellipse;whiteSpace=wrap;html=1;aspect=fixed;fontSize=17;" parent="1" vertex="1">
          <mxGeometry x="80.03999999999999" y="235" width="40" height="40" as="geometry" />
        </mxCell>
        <mxCell id="aysTpWYp_d0TLLfFKDWt-147" value="" style="endArrow=open;html=1;fontColor=#000099;endFill=0;dashed=1;endSize=8;arcSize=0;rounded=0;" parent="1" source="aysTpWYp_d0TLLfFKDWt-146" target="aysTpWYp_d0TLLfFKDWt-149" edge="1">
          <mxGeometry width="50" height="50" relative="1" as="geometry">
            <mxPoint x="41.97999999999996" y="282.49" as="sourcePoint" />
            <mxPoint x="99.82352941176475" y="319.8823529411766" as="targetPoint" />
          </mxGeometry>
        </mxCell>
        <mxCell id="aysTpWYp_d0TLLfFKDWt-148" value="" style="endArrow=open;html=1;fontColor=#000099;endFill=0;dashed=1;endSize=8;arcSize=0;rounded=0;" parent="1" source="aysTpWYp_d0TLLfFKDWt-146" target="aysTpWYp_d0TLLfFKDWt-150" edge="1">
          <mxGeometry width="50" height="50" relative="1" as="geometry">
            <mxPoint x="76.94" y="278.49" as="sourcePoint" />
            <mxPoint x="179.82352941176475" y="255.17647058823513" as="targetPoint" />
          </mxGeometry>
        </mxCell>
        <mxCell id="aysTpWYp_d0TLLfFKDWt-149" value="cd:Quality" style="rounded=0;whiteSpace=wrap;html=1;snapToPoint=1;points=[[0.1,0],[0.2,0],[0.3,0],[0.4,0],[0.5,0],[0.6,0],[0.7,0],[0.8,0],[0.9,0],[0,0.1],[0,0.3],[0,0.5],[0,0.7],[0,0.9],[0.1,1],[0.2,1],[0.3,1],[0.4,1],[0.5,1],[0.6,1],[0.7,1],[0.8,1],[0.9,1],[1,0.1],[1,0.3],[1,0.5],[1,0.7],[1,0.9]];fillColor=#f5f5f5;fontColor=#333333;strokeColor=#666666;" parent="1" vertex="1">
          <mxGeometry x="60.04000000000002" y="320" width="80" height="30" as="geometry" />
        </mxCell>
        <mxCell id="aysTpWYp_d0TLLfFKDWt-150" value="bfo:BFO_0000019" style="rounded=0;whiteSpace=wrap;html=1;snapToPoint=1;points=[[0.1,0],[0.2,0],[0.3,0],[0.4,0],[0.5,0],[0.6,0],[0.7,0],[0.8,0],[0.9,0],[0,0.1],[0,0.3],[0,0.5],[0,0.7],[0,0.9],[0.1,1],[0.2,1],[0.3,1],[0.4,1],[0.5,1],[0.6,1],[0.7,1],[0.8,1],[0.9,1],[1,0.1],[1,0.3],[1,0.5],[1,0.7],[1,0.9]];fillColor=#dae8fc;strokeColor=#6c8ebf;" parent="1" vertex="1">
          <mxGeometry x="20" y="180" width="160" height="30" as="geometry" />
        </mxCell>
        <mxCell id="aysTpWYp_d0TLLfFKDWt-151" value="cd:CopperAlloy" style="rounded=0;whiteSpace=wrap;html=1;snapToPoint=1;points=[[0.1,0],[0.2,0],[0.3,0],[0.4,0],[0.5,0],[0.6,0],[0.7,0],[0.8,0],[0.9,0],[0,0.1],[0,0.3],[0,0.5],[0,0.7],[0,0.9],[0.1,1],[0.2,1],[0.3,1],[0.4,1],[0.5,1],[0.6,1],[0.7,1],[0.8,1],[0.9,1],[1,0.1],[1,0.3],[1,0.5],[1,0.7],[1,0.9]];" parent="1" vertex="1">
          <mxGeometry x="570" y="1600" width="120" height="30" as="geometry" />
        </mxCell>
        <mxCell id="aysTpWYp_d0TLLfFKDWt-152" value="" style="endArrow=block;html=1;fontColor=#000099;endFill=0;endSize=8;arcSize=0;rounded=0;" parent="1" source="aysTpWYp_d0TLLfFKDWt-151" target="aysTpWYp_d0TLLfFKDWt-140" edge="1">
          <mxGeometry width="50" height="50" relative="1" as="geometry">
            <mxPoint x="600" y="1157" as="sourcePoint" />
            <mxPoint x="680" y="1173.666666666667" as="targetPoint" />
          </mxGeometry>
        </mxCell>
        <mxCell id="aysTpWYp_d0TLLfFKDWt-153" value="&lt;div&gt;&amp;lt;&amp;lt;owl:ObjectProperty&amp;gt;&amp;gt; rdfs:isDefinedBy&lt;br&gt;&lt;/div&gt;" style="rhombus;whiteSpace=wrap;html=1;fillColor=#f5f5f5;fontColor=#333333;strokeColor=#666666;" parent="1" vertex="1">
          <mxGeometry x="840" y="320" width="200" height="80" as="geometry" />
        </mxCell>
        <mxCell id="aysTpWYp_d0TLLfFKDWt-154" value="&lt;div&gt;&amp;lt;&amp;lt;owl:ObjectProperty&amp;gt;&amp;gt;&amp;nbsp;&lt;br&gt;&lt;/div&gt;&lt;div&gt;cd:defines&lt;/div&gt;" style="rhombus;whiteSpace=wrap;html=1;fillColor=#f5f5f5;fontColor=#333333;strokeColor=#666666;" parent="1" vertex="1">
          <mxGeometry x="840" y="440" width="200" height="80" as="geometry" />
        </mxCell>
        <mxCell id="aysTpWYp_d0TLLfFKDWt-157" value="" style="endArrow=open;html=1;fontColor=#000099;endFill=0;dashed=1;endSize=8;arcSize=0;rounded=0;" parent="1" source="aysTpWYp_d0TLLfFKDWt-154" target="aysTpWYp_d0TLLfFKDWt-159" edge="1">
          <mxGeometry width="50" height="50" relative="1" as="geometry">
            <mxPoint x="940" y="680" as="sourcePoint" />
            <mxPoint x="940" y="1010" as="targetPoint" />
          </mxGeometry>
        </mxCell>
        <mxCell id="aysTpWYp_d0TLLfFKDWt-158" value="&amp;lt;&amp;lt;rdfs:subPropertyOf&amp;gt;&amp;gt;" style="text;html=1;align=center;verticalAlign=middle;resizable=0;points=[];fontColor=#000000;labelBackgroundColor=#ffffff;" parent="aysTpWYp_d0TLLfFKDWt-157" vertex="1" connectable="0">
          <mxGeometry x="-0.3277" relative="1" as="geometry">
            <mxPoint y="2" as="offset" />
          </mxGeometry>
        </mxCell>
        <mxCell id="aysTpWYp_d0TLLfFKDWt-159" value="&lt;div&gt;&amp;lt;&amp;lt;owl:ObjectProperty&amp;gt;&amp;gt; iof:prescribes&lt;br&gt;&lt;/div&gt;" style="rhombus;whiteSpace=wrap;html=1;fillColor=#dae8fc;strokeColor=#6c8ebf;" parent="1" vertex="1">
          <mxGeometry x="840" y="560" width="200" height="80" as="geometry" />
        </mxCell>
        <mxCell id="aysTpWYp_d0TLLfFKDWt-160" value="&lt;div&gt;&amp;lt;&amp;lt;owl:ObjectProperty&amp;gt;&amp;gt; iof:prescribedBy&lt;br&gt;&lt;/div&gt;" style="rhombus;whiteSpace=wrap;html=1;fillColor=#dae8fc;strokeColor=#6c8ebf;" parent="1" vertex="1">
          <mxGeometry x="840" y="200" width="200" height="80" as="geometry" />
        </mxCell>
        <mxCell id="aysTpWYp_d0TLLfFKDWt-161" value="" style="endArrow=open;html=1;fontColor=#000099;endFill=0;dashed=1;endSize=8;arcSize=0;rounded=0;" parent="1" source="aysTpWYp_d0TLLfFKDWt-153" target="aysTpWYp_d0TLLfFKDWt-160" edge="1">
          <mxGeometry width="50" height="50" relative="1" as="geometry">
            <mxPoint x="1190" y="330" as="sourcePoint" />
            <mxPoint x="1190" y="290" as="targetPoint" />
          </mxGeometry>
        </mxCell>
        <mxCell id="aysTpWYp_d0TLLfFKDWt-162" value="&amp;lt;&amp;lt;rdfs:subPropertyOf&amp;gt;&amp;gt;" style="text;html=1;align=center;verticalAlign=middle;resizable=0;points=[];fontColor=#000000;labelBackgroundColor=#ffffff;" parent="aysTpWYp_d0TLLfFKDWt-161" vertex="1" connectable="0">
          <mxGeometry x="-0.3277" relative="1" as="geometry">
            <mxPoint y="-7" as="offset" />
          </mxGeometry>
        </mxCell>
        <mxCell id="aysTpWYp_d0TLLfFKDWt-163" value="cd:Ingot" style="rounded=0;whiteSpace=wrap;html=1;snapToPoint=1;points=[[0.1,0],[0.2,0],[0.3,0],[0.4,0],[0.5,0],[0.6,0],[0.7,0],[0.8,0],[0.9,0],[0,0.1],[0,0.3],[0,0.5],[0,0.7],[0,0.9],[0.1,1],[0.2,1],[0.3,1],[0.4,1],[0.5,1],[0.6,1],[0.7,1],[0.8,1],[0.9,1],[1,0.1],[1,0.3],[1,0.5],[1,0.7],[1,0.9]];fillColor=#f5f5f5;fontColor=#333333;strokeColor=#666666;" parent="1" vertex="1">
          <mxGeometry x="960" y="1320" width="80" height="30" as="geometry" />
        </mxCell>
        <mxCell id="aysTpWYp_d0TLLfFKDWt-164" value="" style="endArrow=block;html=1;fontColor=#000099;endFill=0;endSize=8;arcSize=0;rounded=0;" parent="1" source="aysTpWYp_d0TLLfFKDWt-163" target="aysTpWYp_d0TLLfFKDWt-119" edge="1">
          <mxGeometry width="50" height="50" relative="1" as="geometry">
            <mxPoint x="890" y="1145.1764705882351" as="sourcePoint" />
            <mxPoint x="930" y="1080.4705882352941" as="targetPoint" />
            <Array as="points">
              <mxPoint x="920" y="1335" />
            </Array>
          </mxGeometry>
        </mxCell>
        <mxCell id="aysTpWYp_d0TLLfFKDWt-166" value="" style="endArrow=block;html=1;fontColor=#000099;endFill=0;endSize=8;arcSize=0;rounded=0;" parent="1" source="WhgTSOJUOoCT2jA4TBbM-3" target="aysTpWYp_d0TLLfFKDWt-121" edge="1">
          <mxGeometry width="50" height="50" relative="1" as="geometry">
            <mxPoint x="560" y="235" as="sourcePoint" />
            <mxPoint x="730" y="220" as="targetPoint" />
          </mxGeometry>
        </mxCell>
        <mxCell id="aysTpWYp_d0TLLfFKDWt-168" value="cd:Forging" style="rounded=0;whiteSpace=wrap;html=1;snapToPoint=1;points=[[0.1,0],[0.2,0],[0.3,0],[0.4,0],[0.5,0],[0.6,0],[0.7,0],[0.8,0],[0.9,0],[0,0.1],[0,0.3],[0,0.5],[0,0.7],[0,0.9],[0.1,1],[0.2,1],[0.3,1],[0.4,1],[0.5,1],[0.6,1],[0.7,1],[0.8,1],[0.9,1],[1,0.1],[1,0.3],[1,0.5],[1,0.7],[1,0.9]];fillColor=#f5f5f5;fontColor=#333333;strokeColor=#666666;" parent="1" vertex="1">
          <mxGeometry x="960" y="1280" width="80" height="30" as="geometry" />
        </mxCell>
        <mxCell id="aysTpWYp_d0TLLfFKDWt-169" value="" style="endArrow=block;html=1;fontColor=#000099;endFill=0;endSize=8;arcSize=0;rounded=0;" parent="1" source="aysTpWYp_d0TLLfFKDWt-168" target="aysTpWYp_d0TLLfFKDWt-119" edge="1">
          <mxGeometry width="50" height="50" relative="1" as="geometry">
            <mxPoint x="890" y="1105" as="sourcePoint" />
            <mxPoint x="920" y="1030" as="targetPoint" />
            <Array as="points">
              <mxPoint x="920" y="1295" />
              <mxPoint x="920" y="1135" />
            </Array>
          </mxGeometry>
        </mxCell>
        <mxCell id="aysTpWYp_d0TLLfFKDWt-170" value="cd:Profile" style="rounded=0;whiteSpace=wrap;html=1;snapToPoint=1;points=[[0.1,0],[0.2,0],[0.3,0],[0.4,0],[0.5,0],[0.6,0],[0.7,0],[0.8,0],[0.9,0],[0,0.1],[0,0.3],[0,0.5],[0,0.7],[0,0.9],[0.1,1],[0.2,1],[0.3,1],[0.4,1],[0.5,1],[0.6,1],[0.7,1],[0.8,1],[0.9,1],[1,0.1],[1,0.3],[1,0.5],[1,0.7],[1,0.9]];fillColor=#f5f5f5;fontColor=#333333;strokeColor=#666666;" parent="1" vertex="1">
          <mxGeometry x="960" y="1040" width="80" height="30" as="geometry" />
        </mxCell>
        <mxCell id="aysTpWYp_d0TLLfFKDWt-171" value="cd:Rod" style="rounded=0;whiteSpace=wrap;html=1;snapToPoint=1;points=[[0.1,0],[0.2,0],[0.3,0],[0.4,0],[0.5,0],[0.6,0],[0.7,0],[0.8,0],[0.9,0],[0,0.1],[0,0.3],[0,0.5],[0,0.7],[0,0.9],[0.1,1],[0.2,1],[0.3,1],[0.4,1],[0.5,1],[0.6,1],[0.7,1],[0.8,1],[0.9,1],[1,0.1],[1,0.3],[1,0.5],[1,0.7],[1,0.9]];fillColor=#f5f5f5;fontColor=#333333;strokeColor=#666666;" parent="1" vertex="1">
          <mxGeometry x="960" y="1080" width="80" height="30" as="geometry" />
        </mxCell>
        <mxCell id="aysTpWYp_d0TLLfFKDWt-172" value="cd:Sheet" style="rounded=0;whiteSpace=wrap;html=1;snapToPoint=1;points=[[0.1,0],[0.2,0],[0.3,0],[0.4,0],[0.5,0],[0.6,0],[0.7,0],[0.8,0],[0.9,0],[0,0.1],[0,0.3],[0,0.5],[0,0.7],[0,0.9],[0.1,1],[0.2,1],[0.3,1],[0.4,1],[0.5,1],[0.6,1],[0.7,1],[0.8,1],[0.9,1],[1,0.1],[1,0.3],[1,0.5],[1,0.7],[1,0.9]];fillColor=#f5f5f5;fontColor=#333333;strokeColor=#666666;" parent="1" vertex="1">
          <mxGeometry x="960" y="1120" width="80" height="30" as="geometry" />
        </mxCell>
        <mxCell id="aysTpWYp_d0TLLfFKDWt-173" value="cd:Strip" style="rounded=0;whiteSpace=wrap;html=1;snapToPoint=1;points=[[0.1,0],[0.2,0],[0.3,0],[0.4,0],[0.5,0],[0.6,0],[0.7,0],[0.8,0],[0.9,0],[0,0.1],[0,0.3],[0,0.5],[0,0.7],[0,0.9],[0.1,1],[0.2,1],[0.3,1],[0.4,1],[0.5,1],[0.6,1],[0.7,1],[0.8,1],[0.9,1],[1,0.1],[1,0.3],[1,0.5],[1,0.7],[1,0.9]];fillColor=#f5f5f5;fontColor=#333333;strokeColor=#666666;" parent="1" vertex="1">
          <mxGeometry x="960" y="1160" width="80" height="30" as="geometry" />
        </mxCell>
        <mxCell id="aysTpWYp_d0TLLfFKDWt-174" value="cd:Tube" style="rounded=0;whiteSpace=wrap;html=1;snapToPoint=1;points=[[0.1,0],[0.2,0],[0.3,0],[0.4,0],[0.5,0],[0.6,0],[0.7,0],[0.8,0],[0.9,0],[0,0.1],[0,0.3],[0,0.5],[0,0.7],[0,0.9],[0.1,1],[0.2,1],[0.3,1],[0.4,1],[0.5,1],[0.6,1],[0.7,1],[0.8,1],[0.9,1],[1,0.1],[1,0.3],[1,0.5],[1,0.7],[1,0.9]];fillColor=#f5f5f5;fontColor=#333333;strokeColor=#666666;" parent="1" vertex="1">
          <mxGeometry x="960" y="1200" width="80" height="30" as="geometry" />
        </mxCell>
        <mxCell id="aysTpWYp_d0TLLfFKDWt-175" value="cd:Wire" style="rounded=0;whiteSpace=wrap;html=1;snapToPoint=1;points=[[0.1,0],[0.2,0],[0.3,0],[0.4,0],[0.5,0],[0.6,0],[0.7,0],[0.8,0],[0.9,0],[0,0.1],[0,0.3],[0,0.5],[0,0.7],[0,0.9],[0.1,1],[0.2,1],[0.3,1],[0.4,1],[0.5,1],[0.6,1],[0.7,1],[0.8,1],[0.9,1],[1,0.1],[1,0.3],[1,0.5],[1,0.7],[1,0.9]];fillColor=#f5f5f5;fontColor=#333333;strokeColor=#666666;" parent="1" vertex="1">
          <mxGeometry x="960" y="1240" width="80" height="30" as="geometry" />
        </mxCell>
        <mxCell id="aysTpWYp_d0TLLfFKDWt-176" value="" style="endArrow=block;html=1;fontColor=#000099;endFill=0;endSize=8;arcSize=0;rounded=0;" parent="1" source="aysTpWYp_d0TLLfFKDWt-170" target="aysTpWYp_d0TLLfFKDWt-119" edge="1">
          <mxGeometry width="50" height="50" relative="1" as="geometry">
            <mxPoint x="1040" y="1055" as="sourcePoint" />
            <mxPoint x="1120" y="1030" as="targetPoint" />
            <Array as="points">
              <mxPoint x="920" y="1055" />
            </Array>
          </mxGeometry>
        </mxCell>
        <mxCell id="aysTpWYp_d0TLLfFKDWt-177" value="" style="endArrow=block;html=1;fontColor=#000099;endFill=0;endSize=8;arcSize=0;rounded=0;" parent="1" source="aysTpWYp_d0TLLfFKDWt-171" target="aysTpWYp_d0TLLfFKDWt-119" edge="1">
          <mxGeometry width="50" height="50" relative="1" as="geometry">
            <mxPoint x="1040" y="1095" as="sourcePoint" />
            <mxPoint x="1120" y="1030" as="targetPoint" />
            <Array as="points">
              <mxPoint x="920" y="1095" />
            </Array>
          </mxGeometry>
        </mxCell>
        <mxCell id="aysTpWYp_d0TLLfFKDWt-178" value="" style="endArrow=block;html=1;fontColor=#000099;endFill=0;endSize=8;arcSize=0;rounded=0;" parent="1" source="aysTpWYp_d0TLLfFKDWt-172" target="aysTpWYp_d0TLLfFKDWt-119" edge="1">
          <mxGeometry width="50" height="50" relative="1" as="geometry">
            <mxPoint x="1040" y="1135" as="sourcePoint" />
            <mxPoint x="1120" y="1030" as="targetPoint" />
            <Array as="points">
              <mxPoint x="920" y="1135" />
            </Array>
          </mxGeometry>
        </mxCell>
        <mxCell id="aysTpWYp_d0TLLfFKDWt-179" value="" style="endArrow=block;html=1;fontColor=#000099;endFill=0;endSize=8;arcSize=0;rounded=0;" parent="1" source="aysTpWYp_d0TLLfFKDWt-173" target="aysTpWYp_d0TLLfFKDWt-119" edge="1">
          <mxGeometry width="50" height="50" relative="1" as="geometry">
            <mxPoint x="1040" y="1175" as="sourcePoint" />
            <mxPoint x="1120" y="1030" as="targetPoint" />
            <Array as="points">
              <mxPoint x="920" y="1175" />
            </Array>
          </mxGeometry>
        </mxCell>
        <mxCell id="aysTpWYp_d0TLLfFKDWt-180" value="" style="endArrow=block;html=1;fontColor=#000099;endFill=0;endSize=8;arcSize=0;rounded=0;" parent="1" source="aysTpWYp_d0TLLfFKDWt-174" target="aysTpWYp_d0TLLfFKDWt-119" edge="1">
          <mxGeometry width="50" height="50" relative="1" as="geometry">
            <mxPoint x="1040" y="1215" as="sourcePoint" />
            <mxPoint x="1120" y="1030" as="targetPoint" />
            <Array as="points">
              <mxPoint x="920" y="1215" />
            </Array>
          </mxGeometry>
        </mxCell>
        <mxCell id="aysTpWYp_d0TLLfFKDWt-181" value="" style="endArrow=block;html=1;fontColor=#000099;endFill=0;endSize=8;arcSize=0;rounded=0;" parent="1" source="aysTpWYp_d0TLLfFKDWt-175" target="aysTpWYp_d0TLLfFKDWt-119" edge="1">
          <mxGeometry width="50" height="50" relative="1" as="geometry">
            <mxPoint x="1050" y="1225" as="sourcePoint" />
            <mxPoint x="1120" y="1030" as="targetPoint" />
            <Array as="points">
              <mxPoint x="920" y="1255" />
            </Array>
          </mxGeometry>
        </mxCell>
        <mxCell id="iyjyoEuWTB5_EPGAEMHq-2" value="cd:materialDesignation" style="rounded=0;whiteSpace=wrap;html=1;snapToPoint=1;points=[[0.1,0],[0.2,0],[0.3,0],[0.4,0],[0.5,0],[0.6,0],[0.7,0],[0.8,0],[0.9,0],[0,0.1],[0,0.3],[0,0.5],[0,0.7],[0,0.9],[0.1,1],[0.2,1],[0.3,1],[0.4,1],[0.5,1],[0.6,1],[0.7,1],[0.8,1],[0.9,1],[1,0.1],[1,0.3],[1,0.5],[1,0.7],[1,0.9]];" parent="1" vertex="1">
          <mxGeometry x="730" y="1630" width="160" height="30" as="geometry" />
        </mxCell>
        <mxCell id="iyjyoEuWTB5_EPGAEMHq-3" value="" style="endArrow=classic;html=1;endSize=8;arcSize=0;rounded=0;dashed=1;" parent="1" source="aysTpWYp_d0TLLfFKDWt-6" target="aysTpWYp_d0TLLfFKDWt-13" edge="1">
          <mxGeometry width="50" height="50" relative="1" as="geometry">
            <mxPoint x="490" y="345" as="sourcePoint" />
            <mxPoint x="690" y="345" as="targetPoint" />
          </mxGeometry>
        </mxCell>
        <mxCell id="iyjyoEuWTB5_EPGAEMHq-4" value="(some) cd:defines" style="text;html=1;align=center;verticalAlign=middle;resizable=0;points=[];labelBackgroundColor=#ffffff;" parent="iyjyoEuWTB5_EPGAEMHq-3" vertex="1" connectable="0">
          <mxGeometry x="-0.1269" relative="1" as="geometry">
            <mxPoint x="8" as="offset" />
          </mxGeometry>
        </mxCell>
        <mxCell id="35yOEi3cJMJewAmpZ71--1" value="" style="endArrow=open;html=1;fontColor=#000099;endFill=0;dashed=1;endSize=8;startArrow=open;startFill=0;startSize=8;rounded=0;" parent="1" source="aysTpWYp_d0TLLfFKDWt-3" target="aysTpWYp_d0TLLfFKDWt-2" edge="1">
          <mxGeometry width="50" height="50" relative="1" as="geometry">
            <mxPoint x="1180" y="440" as="sourcePoint" />
            <mxPoint x="1180" y="400" as="targetPoint" />
          </mxGeometry>
        </mxCell>
        <mxCell id="35yOEi3cJMJewAmpZ71--2" value="&amp;lt;&amp;lt;owl:inverseOf&amp;gt;&amp;gt;" style="text;html=1;align=center;verticalAlign=middle;resizable=0;points=[];fontColor=#000000;labelBackgroundColor=#ffffff;" parent="35yOEi3cJMJewAmpZ71--1" vertex="1" connectable="0">
          <mxGeometry x="-0.3277" relative="1" as="geometry">
            <mxPoint y="-7.14" as="offset" />
          </mxGeometry>
        </mxCell>
        <mxCell id="35yOEi3cJMJewAmpZ71--3" value="" style="endArrow=open;html=1;fontColor=#000099;endFill=0;dashed=1;endSize=8;startArrow=open;startFill=0;startSize=8;rounded=0;" parent="1" source="aysTpWYp_d0TLLfFKDWt-43" target="aysTpWYp_d0TLLfFKDWt-42" edge="1">
          <mxGeometry width="50" height="50" relative="1" as="geometry">
            <mxPoint x="1420" y="440" as="sourcePoint" />
            <mxPoint x="1420" y="400" as="targetPoint" />
          </mxGeometry>
        </mxCell>
        <mxCell id="35yOEi3cJMJewAmpZ71--4" value="&amp;lt;&amp;lt;owl:inverseOf&amp;gt;&amp;gt;" style="text;html=1;align=center;verticalAlign=middle;resizable=0;points=[];fontColor=#000000;labelBackgroundColor=#ffffff;" parent="35yOEi3cJMJewAmpZ71--3" vertex="1" connectable="0">
          <mxGeometry x="-0.3277" relative="1" as="geometry">
            <mxPoint y="-7.14" as="offset" />
          </mxGeometry>
        </mxCell>
        <mxCell id="35yOEi3cJMJewAmpZ71--5" value="" style="endArrow=open;html=1;fontColor=#000099;endFill=0;dashed=1;endSize=8;startArrow=open;startFill=0;startSize=8;rounded=0;" parent="1" source="aysTpWYp_d0TLLfFKDWt-154" target="aysTpWYp_d0TLLfFKDWt-153" edge="1">
          <mxGeometry width="50" height="50" relative="1" as="geometry">
            <mxPoint x="940" y="440" as="sourcePoint" />
            <mxPoint x="940" y="400" as="targetPoint" />
          </mxGeometry>
        </mxCell>
        <mxCell id="35yOEi3cJMJewAmpZ71--6" value="&amp;lt;&amp;lt;owl:inverseOf&amp;gt;&amp;gt;" style="text;html=1;align=center;verticalAlign=middle;resizable=0;points=[];fontColor=#000000;labelBackgroundColor=#ffffff;" parent="35yOEi3cJMJewAmpZ71--5" vertex="1" connectable="0">
          <mxGeometry x="-0.3277" relative="1" as="geometry">
            <mxPoint y="-7.14" as="offset" />
          </mxGeometry>
        </mxCell>
        <mxCell id="WhgTSOJUOoCT2jA4TBbM-3" value="cd:Specification" style="rounded=0;whiteSpace=wrap;html=1;snapToPoint=1;points=[[0.1,0],[0.2,0],[0.3,0],[0.4,0],[0.5,0],[0.6,0],[0.7,0],[0.8,0],[0.9,0],[0,0.1],[0,0.3],[0,0.5],[0,0.7],[0,0.9],[0.1,1],[0.2,1],[0.3,1],[0.4,1],[0.5,1],[0.6,1],[0.7,1],[0.8,1],[0.9,1],[1,0.1],[1,0.3],[1,0.5],[1,0.7],[1,0.9]];" parent="1" vertex="1">
          <mxGeometry x="500" y="240" width="120" height="30" as="geometry" />
        </mxCell>
        <mxCell id="WhgTSOJUOoCT2jA4TBbM-5" value="" style="endArrow=block;html=1;fontColor=#000099;endFill=0;endSize=8;arcSize=0;rounded=0;" parent="1" source="aysTpWYp_d0TLLfFKDWt-6" target="WhgTSOJUOoCT2jA4TBbM-3" edge="1">
          <mxGeometry width="50" height="50" relative="1" as="geometry">
            <mxPoint x="710" y="289" as="sourcePoint" />
            <mxPoint x="430" y="360" as="targetPoint" />
          </mxGeometry>
        </mxCell>
        <mxCell id="WhgTSOJUOoCT2jA4TBbM-7" value="" style="endArrow=block;html=1;fontColor=#000099;endFill=0;endSize=8;arcSize=0;rounded=0;" parent="1" source="aysTpWYp_d0TLLfFKDWt-10" target="WhgTSOJUOoCT2jA4TBbM-3" edge="1">
          <mxGeometry width="50" height="50" relative="1" as="geometry">
            <mxPoint x="962.9411764705883" y="209.88235294117658" as="sourcePoint" />
            <mxPoint x="778.2352941176473" y="160.47058823529414" as="targetPoint" />
            <Array as="points" />
          </mxGeometry>
        </mxCell>
        <mxCell id="WhgTSOJUOoCT2jA4TBbM-8" value="&lt;div&gt;&lt;div&gt;cd:&amp;nbsp;https://kupferdigital.gitlab.io/ontologies/materials#&lt;/div&gt;&lt;/div&gt;&lt;div&gt;rdfs:&amp;nbsp;http://www.w3.org/2000/01/rdf-schema#&lt;/div&gt;&lt;div&gt;sto: https://w3id.org/i40/sto#&lt;/div&gt;&lt;div&gt;wd:&amp;nbsp;https://www.wikidata.org/wiki/&lt;/div&gt;&lt;div&gt;qk:&amp;nbsp;http://qudt.org/2.1/vocab/quantitykind/&lt;/div&gt;&lt;div&gt;qudt:&amp;nbsp;http://qudt.org/2.1/schema/qudt/&lt;/div&gt;&lt;div&gt;dx:&amp;nbsp;https://dx.doi.org/10.31030/&lt;/div&gt;&lt;div&gt;bfo:&amp;nbsp;http://purl.obolibrary.org/obo/&lt;/div&gt;&lt;div&gt;owl: http://www.w3.org/2002/07/owl#&lt;br&gt;&lt;/div&gt;&lt;div&gt;iof:&amp;nbsp;https://purl.industrialontologies.org/ontology/core/Core/&lt;/div&gt;" style="shape=note;whiteSpace=wrap;html=1;backgroundOutline=1;darkOpacity=0.05;align=left;spacingLeft=10;direction=east;" parent="1" vertex="1">
          <mxGeometry width="360" height="160" as="geometry" />
        </mxCell>
        <mxCell id="aysTpWYp_d0TLLfFKDWt-6" value="sto:Standard" style="rounded=0;whiteSpace=wrap;html=1;snapToPoint=1;points=[[0.1,0],[0.2,0],[0.3,0],[0.4,0],[0.5,0],[0.6,0],[0.7,0],[0.8,0],[0.9,0],[0,0.1],[0,0.3],[0,0.5],[0,0.7],[0,0.9],[0.1,1],[0.2,1],[0.3,1],[0.4,1],[0.5,1],[0.6,1],[0.7,1],[0.8,1],[0.9,1],[1,0.1],[1,0.3],[1,0.5],[1,0.7],[1,0.9]];" parent="1" vertex="1">
          <mxGeometry x="640" y="320" width="80" height="30" as="geometry" />
        </mxCell>
        <mxCell id="aysTpWYp_d0TLLfFKDWt-10" value="&lt;span style=&quot;color: rgb(0, 0, 0);&quot;&gt;iof:RequirementSpecification&lt;/span&gt;" style="rounded=0;whiteSpace=wrap;html=1;snapToPoint=1;points=[[0.1,0],[0.2,0],[0.3,0],[0.4,0],[0.5,0],[0.6,0],[0.7,0],[0.8,0],[0.9,0],[0,0.1],[0,0.3],[0,0.5],[0,0.7],[0,0.9],[0.1,1],[0.2,1],[0.3,1],[0.4,1],[0.5,1],[0.6,1],[0.7,1],[0.8,1],[0.9,1],[1,0.1],[1,0.3],[1,0.5],[1,0.7],[1,0.9]];fillColor=#dae8fc;strokeColor=#6c8ebf;" parent="1" vertex="1">
          <mxGeometry x="320" y="320" width="160" height="30" as="geometry" />
        </mxCell>
        <mxCell id="aysTpWYp_d0TLLfFKDWt-1" value="&lt;div&gt;&lt;div&gt;cd:&amp;nbsp;https://kupferdigital.gitlab.io/ontologies/copper-key#&lt;/div&gt;&lt;/div&gt;&lt;div&gt;rdfs:&amp;nbsp;http://www.w3.org/2000/01/rdf-schema#&lt;/div&gt;&lt;div&gt;sto: https://w3id.org/i40/sto#&lt;/div&gt;&lt;div&gt;wd:&amp;nbsp;https://www.wikidata.org/wiki/&lt;/div&gt;&lt;div&gt;qk:&amp;nbsp;http://qudt.org/2.1/vocab/quantitykind/&lt;/div&gt;&lt;div&gt;qudt:&amp;nbsp;http://qudt.org/2.1/schema/qudt/&lt;/div&gt;&lt;div&gt;dx:&amp;nbsp;https://dx.doi.org/10.31030/&lt;/div&gt;&lt;div&gt;bfo:&amp;nbsp;http://purl.obolibrary.org/obo/&lt;/div&gt;&lt;div&gt;owl: http://www.w3.org/2002/07/owl#&lt;br&gt;&lt;/div&gt;&lt;div&gt;iof:&amp;nbsp;https://purl.industrialontologies.org/ontology/core/Core/&lt;/div&gt;&lt;div&gt;dc:&amp;nbsp;&lt;span style=&quot;background-color: initial;&quot;&gt;http://purl.org/dc/terms/&lt;/span&gt;&lt;br&gt;&lt;/div&gt;" style="shape=note;whiteSpace=wrap;html=1;backgroundOutline=1;darkOpacity=0.05;align=left;spacingLeft=10;direction=east;" parent="1" vertex="1">
          <mxGeometry width="360" height="160" as="geometry" />
        </mxCell>
        <mxCell id="aysTpWYp_d0TLLfFKDWt-121" value="iof:InformationContentEntity" style="rounded=0;whiteSpace=wrap;html=1;snapToPoint=1;points=[[0.1,0],[0.2,0],[0.3,0],[0.4,0],[0.5,0],[0.6,0],[0.7,0],[0.8,0],[0.9,0],[0,0.1],[0,0.3],[0,0.5],[0,0.7],[0,0.9],[0.1,1],[0.2,1],[0.3,1],[0.4,1],[0.5,1],[0.6,1],[0.7,1],[0.8,1],[0.9,1],[1,0.1],[1,0.3],[1,0.5],[1,0.7],[1,0.9]];fillColor=#dae8fc;strokeColor=#6c8ebf;" parent="1" vertex="1">
          <mxGeometry x="460" y="160" width="200" height="30" as="geometry" />
        </mxCell>
        <mxCell id="EluLbjGSOWs91FyRfb0l-9" value="cd:WroughtAlloy" style="rounded=0;whiteSpace=wrap;html=1;snapToPoint=1;points=[[0.1,0],[0.2,0],[0.3,0],[0.4,0],[0.5,0],[0.6,0],[0.7,0],[0.8,0],[0.9,0],[0,0.1],[0,0.3],[0,0.5],[0,0.7],[0,0.9],[0.1,1],[0.2,1],[0.3,1],[0.4,1],[0.5,1],[0.6,1],[0.7,1],[0.8,1],[0.9,1],[1,0.1],[1,0.3],[1,0.5],[1,0.7],[1,0.9]];" parent="1" vertex="1">
          <mxGeometry x="120.03999999999996" y="1520" width="120" height="30" as="geometry" />
        </mxCell>
        <mxCell id="1BRkxf9iYKba-tQX4ne6-13" value="&lt;span style=&quot;color: rgb(0, 0, 0);&quot;&gt;iof:RequirementSpecification&lt;/span&gt;" style="rounded=0;whiteSpace=wrap;html=1;snapToPoint=1;points=[[0.1,0],[0.2,0],[0.3,0],[0.4,0],[0.5,0],[0.6,0],[0.7,0],[0.8,0],[0.9,0],[0,0.1],[0,0.3],[0,0.5],[0,0.7],[0,0.9],[0.1,1],[0.2,1],[0.3,1],[0.4,1],[0.5,1],[0.6,1],[0.7,1],[0.8,1],[0.9,1],[1,0.1],[1,0.3],[1,0.5],[1,0.7],[1,0.9]];fillColor=#dae8fc;strokeColor=#6c8ebf;" parent="1" vertex="1">
          <mxGeometry y="1600" width="160" height="30" as="geometry" />
        </mxCell>
        <mxCell id="1BRkxf9iYKba-tQX4ne6-14" value="cd:CopperKeyDatasheet" style="rounded=0;whiteSpace=wrap;html=1;snapToPoint=1;points=[[0.1,0],[0.2,0],[0.3,0],[0.4,0],[0.5,0],[0.6,0],[0.7,0],[0.8,0],[0.9,0],[0,0.1],[0,0.3],[0,0.5],[0,0.7],[0,0.9],[0.1,1],[0.2,1],[0.3,1],[0.4,1],[0.5,1],[0.6,1],[0.7,1],[0.8,1],[0.9,1],[1,0.1],[1,0.3],[1,0.5],[1,0.7],[1,0.9]];" parent="1" vertex="1">
          <mxGeometry x="250.04" y="1600" width="160" height="30" as="geometry" />
        </mxCell>
        <mxCell id="1BRkxf9iYKba-tQX4ne6-15" value="" style="endArrow=block;html=1;fontColor=#000099;endFill=0;endSize=8;arcSize=0;rounded=0;" parent="1" source="1BRkxf9iYKba-tQX4ne6-14" target="1BRkxf9iYKba-tQX4ne6-13" edge="1">
          <mxGeometry width="50" height="50" relative="1" as="geometry">
            <mxPoint x="260.03999999999996" y="1543" as="sourcePoint" />
            <mxPoint x="370.04" y="1680" as="targetPoint" />
          </mxGeometry>
        </mxCell>
        <mxCell id="1BRkxf9iYKba-tQX4ne6-16" value="" style="endArrow=classic;html=1;endSize=8;startArrow=none;startFill=0;dashed=1;arcSize=0;rounded=0;" parent="1" source="1BRkxf9iYKba-tQX4ne6-14" target="aysTpWYp_d0TLLfFKDWt-151" edge="1">
          <mxGeometry width="50" height="50" relative="1" as="geometry">
            <mxPoint x="474" y="1754" as="sourcePoint" />
            <mxPoint x="570" y="1804" as="targetPoint" />
          </mxGeometry>
        </mxCell>
        <mxCell id="1BRkxf9iYKba-tQX4ne6-17" value="(some) cd:specifies" style="text;html=1;align=center;verticalAlign=middle;resizable=0;points=[];labelBackgroundColor=#ffffff;" parent="1BRkxf9iYKba-tQX4ne6-16" vertex="1" connectable="0">
          <mxGeometry x="-0.1269" relative="1" as="geometry">
            <mxPoint as="offset" />
          </mxGeometry>
        </mxCell>
        <mxCell id="3mgD4tBSYZwq_SneKy5x-1" value="&lt;div&gt;&lt;b&gt;dc:creator:&lt;/b&gt;&amp;nbsp;Gordian Dziwis&lt;/div&gt;&lt;div&gt;&lt;b&gt;owl:versionInfo:&lt;/b&gt; 0.0.1&lt;/div&gt;&lt;div&gt;&lt;b&gt;dc:title:&lt;/b&gt;&amp;nbsp;Copper Key Ontology&lt;/div&gt;&lt;div&gt;&lt;b&gt;dc:description:&amp;nbsp;&amp;nbsp;&lt;/b&gt;An ontology describing the Copper Key.&lt;/div&gt;" style="shape=document;whiteSpace=wrap;html=1;boundedLbl=1;labelBackgroundColor=#ffffff;strokeColor=#000000;fontSize=12;fontColor=#000000;size=0.23333333333333334;" parent="1" vertex="1">
          <mxGeometry x="680" width="320" height="120" as="geometry" />
        </mxCell>
        <mxCell id="MBU4Ub27HTqkq-lWpCmb-1" value="cd:CastAlloy" style="rounded=0;whiteSpace=wrap;html=1;snapToPoint=1;points=[[0.1,0],[0.2,0],[0.3,0],[0.4,0],[0.5,0],[0.6,0],[0.7,0],[0.8,0],[0.9,0],[0,0.1],[0,0.3],[0,0.5],[0,0.7],[0,0.9],[0.1,1],[0.2,1],[0.3,1],[0.4,1],[0.5,1],[0.6,1],[0.7,1],[0.8,1],[0.9,1],[1,0.1],[1,0.3],[1,0.5],[1,0.7],[1,0.9]];" parent="1" vertex="1">
          <mxGeometry x="120" y="1120" width="80" height="30" as="geometry" />
        </mxCell>
        <mxCell id="MBU4Ub27HTqkq-lWpCmb-3" value="" style="endArrow=block;html=1;fontColor=#000099;endFill=0;endSize=8;arcSize=0;rounded=0;edgeStyle=elbowEdgeStyle;" parent="1" source="4b0k2Hj-_6pz2WMlAF0A-3" target="aysTpWYp_d0TLLfFKDWt-140" edge="1">
          <mxGeometry width="50" height="50" relative="1" as="geometry">
            <mxPoint x="700" y="1625" as="sourcePoint" />
            <mxPoint x="740" y="1625" as="targetPoint" />
          </mxGeometry>
        </mxCell>
        <mxCell id="MBU4Ub27HTqkq-lWpCmb-4" value="&lt;span style=&quot;font-size: 12px;&quot;&gt;(some) iof:isInputOf&lt;/span&gt;" style="endArrow=classic;html=1;endSize=8;startArrow=none;startFill=0;dashed=1;arcSize=0;rounded=0;" parent="1" source="EluLbjGSOWs91FyRfb0l-9" target="aysTpWYp_d0TLLfFKDWt-114" edge="1">
          <mxGeometry width="50" height="50" relative="1" as="geometry">
            <mxPoint x="780" y="1465" as="sourcePoint" />
            <mxPoint x="250" y="1465" as="targetPoint" />
          </mxGeometry>
        </mxCell>
        <mxCell id="MBU4Ub27HTqkq-lWpCmb-5" value="" style="endArrow=block;html=1;fontColor=#000099;endFill=0;endSize=8;arcSize=0;rounded=0;edgeStyle=elbowEdgeStyle;" parent="1" source="4b0k2Hj-_6pz2WMlAF0A-2" target="aysTpWYp_d0TLLfFKDWt-140" edge="1">
          <mxGeometry width="50" height="50" relative="1" as="geometry">
            <mxPoint x="820" y="1734" as="sourcePoint" />
            <mxPoint x="850" y="1610" as="targetPoint" />
          </mxGeometry>
        </mxCell>
        <mxCell id="MBU4Ub27HTqkq-lWpCmb-6" value="&lt;span style=&quot;font-size: 12px;&quot;&gt;(some) iof:isInputOf&lt;/span&gt;" style="endArrow=classic;html=1;endSize=8;startArrow=none;startFill=0;dashed=1;arcSize=0;rounded=0;" parent="1" source="MBU4Ub27HTqkq-lWpCmb-1" target="aysTpWYp_d0TLLfFKDWt-83" edge="1">
          <mxGeometry width="50" height="50" relative="1" as="geometry">
            <mxPoint x="785" y="1733" as="sourcePoint" />
            <mxPoint x="225" y="1479" as="targetPoint" />
          </mxGeometry>
        </mxCell>
        <mxCell id="4b0k2Hj-_6pz2WMlAF0A-2" value="cd:CastAlloy" style="rounded=0;whiteSpace=wrap;html=1;snapToPoint=1;points=[[0.1,0],[0.2,0],[0.3,0],[0.4,0],[0.5,0],[0.6,0],[0.7,0],[0.8,0],[0.9,0],[0,0.1],[0,0.3],[0,0.5],[0,0.7],[0,0.9],[0.1,1],[0.2,1],[0.3,1],[0.4,1],[0.5,1],[0.6,1],[0.7,1],[0.8,1],[0.9,1],[1,0.1],[1,0.3],[1,0.5],[1,0.7],[1,0.9]];" vertex="1" parent="1">
          <mxGeometry x="570" y="1640" width="120" height="30" as="geometry" />
        </mxCell>
        <mxCell id="4b0k2Hj-_6pz2WMlAF0A-3" value="cd:WroughtAlloy" style="rounded=0;whiteSpace=wrap;html=1;snapToPoint=1;points=[[0.1,0],[0.2,0],[0.3,0],[0.4,0],[0.5,0],[0.6,0],[0.7,0],[0.8,0],[0.9,0],[0,0.1],[0,0.3],[0,0.5],[0,0.7],[0,0.9],[0.1,1],[0.2,1],[0.3,1],[0.4,1],[0.5,1],[0.6,1],[0.7,1],[0.8,1],[0.9,1],[1,0.1],[1,0.3],[1,0.5],[1,0.7],[1,0.9]];" vertex="1" parent="1">
          <mxGeometry x="570" y="1680" width="120" height="30" as="geometry" />
        </mxCell>
      </root>
    </mxGraphModel>
  </diagram>
</mxfile>
