{
    "Australia": [
      {
        "type": "text",
        "label": "name",
        "value": "stark 1",
        "placeholder": "Add a name for your company"
      },
      {
        "type": "dropdown",
        "label": "countryCode",
        "dropdownplaceholder": "Choose an option",
        "value": "Australia"
      },
      {
        "type": "abn",
        "label": "abn",
        "value": "35991756644",
        "placeholder": "ABN"
      },
      {
        "type": "text",
        "label": "locationName",
        "placeholder": "Add a name for the primary location",
        "value": "Primary Location 1"
      },
      {
        "type": "dropdown",
        "label": "regionId",
        "dropdownplaceholder": "Select a state",
        "value": "Queensland"
      },
      {
        "type": "dropdown",
        "dropdownplaceholder": "Choose an option",
        "label": "timeZone",
        "value": "Asia/Singapore"
      },
      {
        "type": "dropdown",
        "dropdownplaceholder": "Choose an option",
        "label": "locale",
        "value": "Singapore (en-SG)"
      }
      
    ],
"New Zealand": [
      {
        "type": "text",
        "label": "name",
        "value": "stark 2",
        "placeholder": "Add a name for your company"
      },
      {
        "type": "dropdown",
        "label": "countryCode",
        "dropdownplaceholder": "Choose an option",
        "value": "New Zealand"
      },
      {
        "type": "text",
        "label": "locationName",
        "placeholder": "Add a name for the primary location",
        "value": "Primary Location 2"
      },
      {
        "type": "dropdown",
        "label": "regionId",
        "dropdownplaceholder": "Select a state",
        "value": "Auckland"
      },
      {
        "type": "dropdown",
        "dropdownplaceholder": "Choose an option",
        "label": "timeZone",
        "value": "Pacific/Auckland"
      },
      {
        "type": "dropdown",
        "dropdownplaceholder": "Choose an option",
        "label": "locale",
        "value": "Cyprus (en-CY)"
      }
    ],
    "Hong Kong": [
      {
        "type": "text",
        "label": "name",
        "value": "stark 2",
        "placeholder": "Add a name for your company"
      },
      {
        "type": "dropdown",
        "label": "countryCode",
        "dropdownplaceholder": "Choose an option",
        "value": "Hong Kong"
      },
      {
        "type": "text",
        "label": "locationName",
        "placeholder": "Add a name for the primary location",
        "value": "Primary Location 2"
      },
      {
        "type": "dropdown",
        "dropdownplaceholder": "Choose an option",
        "label": "timeZone",
        "value": "Australia/Brisbane"
      },
      {
        "type": "dropdown",
        "dropdownplaceholder": "Choose an option",
        "label": "locale",
        "value": "Hong Kong (en-HK)"
      }
    ],
    "Singapore": [
      {
        "type": "text",
        "label": "name",
        "value": "stark 2",
        "placeholder": "Add a name for your company"
      },
      {
        "type": "dropdown",
        "label": "countryCode",
        "dropdownplaceholder": "Choose an option",
        "value": "Singapore"
      },
      {
        "type": "text",
        "label": "locationName",
        "placeholder": "Add a name for the primary location",
        "value": "Primary Location 2"
      },
      {
        "type": "dropdown",
        "dropdownplaceholder": "Choose an option",
        "label": "timeZone",
        "value": "Africa/Johannesburg"
      },
      {
        "type": "dropdown",
        "dropdownplaceholder": "Choose an option",
        "label": "locale",
        "value": "Singapore (en-SG)"
      }
    ],
    "South Africa": [
      {
        "type": "text",
        "label": "name",
        "value": "stark 2",
        "placeholder": "Add a name for your company"
      },
      {
        "type": "dropdown",
        "label": "countryCode",
        "dropdownplaceholder": "Choose an option",
        "value": "South Africa"
      },
      {
        "type": "text",
        "label": "locationName",
        "placeholder": "Add a name for the primary location",
        "value": "Primary Location 2"
      },
      {
        "type": "dropdown",
        "dropdownplaceholder": "Choose an option",
        "label": "timeZone",
        "value": "Pacific/Auckland"
      },
      {
        "type": "dropdown",
        "dropdownplaceholder": "Choose an option",
        "label": "locale",
        "value": "South Africa (en-SA)"
      }
    ],
    "United Kingdom": [
      {
        "type": "text",
        "label": "name",
        "value": "stark 2",
        "placeholder": "Add a name for your company"
      },
      {
        "type": "dropdown",
        "label": "countryCode",
        "dropdownplaceholder": "Choose an option",
        "value": "United Kingdom"
      },
      {
        "type": "text",
        "label": "locationName",
        "placeholder": "Add a name for the primary location",
        "value": "Primary Location 2"
      },
      {
        "type": "dropdown",
        "dropdownplaceholder": "Choose an option",
        "label": "timeZone",
        "value": "Asia/Singapore"
      },
      {
        "type": "dropdown",
        "dropdownplaceholder": "Choose an option",
        "label": "locale",
        "value": "United Kingdom (en-UK)"
      }
    ],
    "Cyprus": [
      {
        "type": "text",
        "label": "name",
        "value": "stark 2",
        "placeholder": "Add a name for your company"
      },
      {
        "type": "dropdown",
        "label": "countryCode",
        "dropdownplaceholder": "Choose an option",
        "value": "Cyprus"
      },
      {
        "type": "text",
        "label": "locationName",
        "placeholder": "Add a name for the primary location",
        "value": "Primary Location 2"
      },
      {
        "type": "dropdown",
        "dropdownplaceholder": "Choose an option",
        "label": "timeZone",
        "value": "Europe/London"
      },
      {
        "type": "dropdown",
        "dropdownplaceholder": "Choose an option",
        "label": "locale",
        "value": "Cyprus (en-CY)"
      }
    ]




  }
  