{
	"info": {
		"_postman_id": "dbd943de-deaa-4030-87ae-6e7606818d71",
		"name": "MONITOR - REST API'S",
		"description": "### Johannes Kepler University - Linz, Austria.\n##### Project Title: Software monitoring system - Monitor Component.\n##### Advisor: Prof. Christoph Mayr-Dorn\n##### Developer: Muthukumar Neelamegam\n### **Introduction**\n\nAn application to Monitor the changes in the GitHub repository using the WebHook technique.\n\n### **Currently this app supports**\n* Commits/Push,\n* Issues,\n* Pull Requests.\n\n### **Provides API for**\n* getObjectById\n* monitorObjectById\n* getObjectHistoryById\n* monitorIssues\n* monitorCommits\n* monitorPullRequests\n* monitorAll\n* startRemoteHookURL\n* stopRemoteHookURL\n* createWebHook\n* getIssuefromGitHub",
		"schema": "https://schema.getpostman.com/json/collection/v2.1.0/collection.json"
	},
	"item": [
		{
			"name": "/getObjectById/:Id",
			"request": {
				"method": "GET",
				"header": [],
				"url": {
					"raw": "http://localhost:5000/getObjectById/37c7e100-95ca-11ea-83e2-a1592671dedf\n",
					"protocol": "http",
					"host": [
						"localhost"
					],
					"port": "5000",
					"path": [
						"getObjectById",
						"37c7e100-95ca-11ea-83e2-a1592671dedf\n"
					]
				},
				"description": "returns latest object state"
			},
			"response": []
		},
		{
			"name": "/monitorIssues/:repoId",
			"request": {
				"method": "GET",
				"header": [],
				"url": {
					"raw": "https://ffe56bd5.ngrok.io/monitorIssues/262132990",
					"protocol": "https",
					"host": [
						"ffe56bd5",
						"ngrok",
						"io"
					],
					"path": [
						"monitorIssues",
						"262132990"
					]
				},
				"description": "provides all new issue updates, including new issues, deleted issues, for the identified repository) via SSE - using the repository id"
			},
			"response": []
		},
		{
			"name": "/monitorCommits/:repoId",
			"request": {
				"method": "GET",
				"header": [],
				"url": {
					"raw": "https://ffe56bd5.ngrok.io/monitorCommits/262132990",
					"protocol": "https",
					"host": [
						"ffe56bd5",
						"ngrok",
						"io"
					],
					"path": [
						"monitorCommits",
						"262132990"
					]
				},
				"description": "provide events on all new commits, via SSE (i.e., new commits and commenting thereof) - using the repository id"
			},
			"response": []
		},
		{
			"name": "/monitorPullRequests/:reopId",
			"request": {
				"method": "GET",
				"header": [],
				"url": {
					"raw": "https://ffe56bd5.ngrok.io/monitorPullRequests/262132990",
					"protocol": "https",
					"host": [
						"ffe56bd5",
						"ngrok",
						"io"
					],
					"path": [
						"monitorPullRequests",
						"262132990"
					]
				},
				"description": "provide events on all new pull requests via SSE (i.e., new pull requests and changes thereof) - using the repository id"
			},
			"response": []
		},
		{
			"name": "/monitorObjectById/:Id",
			"request": {
				"method": "GET",
				"header": [],
				"url": {
					"raw": "https://ffe56bd5.ngrok.io/monitorObjectById/81fb4a80-92ca-11ea-9c46-0009c304a9e2",
					"protocol": "https",
					"host": [
						"ffe56bd5",
						"ngrok",
						"io"
					],
					"path": [
						"monitorObjectById",
						"81fb4a80-92ca-11ea-9c46-0009c304a9e2"
					]
				},
				"description": "provides via server sent events (SSE) any new change events limited to the ids mentioned above"
			},
			"response": []
		},
		{
			"name": "/getObjectHistoryById/:id",
			"request": {
				"method": "GET",
				"header": [],
				"url": {
					"raw": "https://ffe56bd5.ngrok.io/getObjectHistoryById/0e523280-9223-11ea-996d-f9b3abc69e8f",
					"protocol": "https",
					"host": [
						"ffe56bd5",
						"ngrok",
						"io"
					],
					"path": [
						"getObjectHistoryById",
						"0e523280-9223-11ea-996d-f9b3abc69e8f"
					]
				},
				"description": "returns all previous events for that object"
			},
			"response": []
		},
		{
			"name": "/monitorAll/",
			"request": {
				"method": "GET",
				"header": [],
				"url": {
					"raw": "https://ffe56bd5.ngrok.io/monitorAll/",
					"protocol": "https",
					"host": [
						"ffe56bd5",
						"ngrok",
						"io"
					],
					"path": [
						"monitorAll",
						""
					]
				},
				"description": "a simple pass through of all events received via the web hook"
			},
			"response": []
		},
		{
			"name": "/startRemoteHookURL/",
			"request": {
				"method": "GET",
				"header": [],
				"url": {
					"raw": "http://localhost:5000/startRemoteHookURL",
					"protocol": "http",
					"host": [
						"localhost"
					],
					"port": "5000",
					"path": [
						"startRemoteHookURL"
					]
				}
			},
			"response": []
		},
		{
			"name": "/stopRemoteHookURL/",
			"request": {
				"method": "GET",
				"header": [],
				"url": {
					"raw": "http://localhost:5000/stopRemoteHookURL",
					"protocol": "http",
					"host": [
						"localhost"
					],
					"port": "5000",
					"path": [
						"stopRemoteHookURL"
					]
				}
			},
			"response": []
		},
		{
			"name": "/createWebHook/",
			"request": {
				"method": "POST",
				"header": [],
				"body": {
					"mode": "raw",
					"raw": "{\r\n\t\"auth\":\"52270fa9afb54978b114e75a50e7e41d9174a407\",\r\n\t\"owner\":\"Kumar-Neelamegam\",\r\n\t\"repo\":\"Experiment\",\r\n  \"name\": \"web\",\r\n  \"active\": true,\r\n  \"events\": [\r\n    \"push\",\r\n    \"pull_request\",\r\n    \"issues\", \r\n    \"issue_comment\",\r\n    \"commit_comment\"\r\n  ],\r\n  \"config\": {\r\n    \"url\": \"https://example.com/webhook3\",\r\n    \"content_type\": \"json\",\r\n    \"insecure_ssl\": \"0\"\r\n  }\r\n}",
					"options": {
						"raw": {
							"language": "json"
						}
					}
				},
				"url": {
					"raw": "http://localhost:5000/createWebHook/",
					"protocol": "http",
					"host": [
						"localhost"
					],
					"port": "5000",
					"path": [
						"createWebHook",
						""
					]
				}
			},
			"response": []
		},
		{
			"name": "/getIssuefromGitHub/",
			"request": {
				"method": "GET",
				"header": [],
				"url": {
					"raw": "http://localhost:5000/getIssuefromGitHub/Kumar-Neelamegam/Experiment/9",
					"protocol": "http",
					"host": [
						"localhost"
					],
					"port": "5000",
					"path": [
						"getIssuefromGitHub",
						"Kumar-Neelamegam",
						"Experiment",
						"9"
					]
				}
			},
			"response": []
		},
		{
			"name": "/getRepositoryInfo/",
			"request": {
				"method": "GET",
				"header": [],
				"url": {
					"raw": "http://localhost:5000/getRepositoryInfo/",
					"protocol": "http",
					"host": [
						"localhost"
					],
					"port": "5000",
					"path": [
						"getRepositoryInfo",
						""
					]
				}
			},
			"response": []
		}
	],
	"protocolProfileBehavior": {}
}