{
  "project_info": {
    "project_number": "988906112",
    "firebase_url": "https://donnie-kalyanam.firebaseio.com",
    "project_id": "donnie-kalyanam",
    "storage_bucket": "donnie-kalyanam.appspot.com"
  },
  "client": [
    {
      "client_info": {
        "mobilesdk_app_id": "1:988906112:android:a7887d08afd113d7",
        "android_client_info": {
          "package_name": "com.creativemindsz.donniekalyanaform"
        }
      },
      "oauth_client": [
        {
          "client_id": "988906112-2gm2g3v3j3usmhv34mql0ui5i1jm8jao.apps.googleusercontent.com",
          "client_type": 3
        }
      ],
      "api_key": [
        {
          "current_key": "AIzaSyAxi_aTJzHEFV9F2fSXWt3h1p9m3YKGOXs"
        }
      ],
      "services": {
        "analytics_service": {
          "status": 1
        },
        "appinvite_service": {
          "status": 1,
          "other_platform_oauth_client": []
        },
        "ads_service": {
          "status": 2
        }
      }
    },
    {
      "client_info": {
        "mobilesdk_app_id": "1:988906112:android:b6e2159bb640329e",
        "android_client_info": {
          "package_name": "com.creativemindsz.donniekalyanam"
        }
      },
      "oauth_client": [
        {
          "client_id": "988906112-2gm2g3v3j3usmhv34mql0ui5i1jm8jao.apps.googleusercontent.com",
          "client_type": 3
        }
      ],
      "api_key": [
        {
          "current_key": "AIzaSyAxi_aTJzHEFV9F2fSXWt3h1p9m3YKGOXs"
        }
      ],
      "services": {
        "analytics_service": {
          "status": 1
        },
        "appinvite_service": {
          "status": 1,
          "other_platform_oauth_client": []
        },
        "ads_service": {
          "status": 2
        }
      }
    }
  ],
  "configuration_version": "1"
}