module github.com/metaverse/truss

require (
	github.com/Sirupsen/logrus v1.0.5
	github.com/davecgh/go-spew v1.1.0
	github.com/go-kit/kit v0.7.0 // indirect
	github.com/go-logfmt/logfmt v0.3.0 // indirect
	github.com/go-stack/stack v1.7.0 // indirect
	github.com/gogo/protobuf v1.2.2-0.20190601103108-21df5aa0e680
	github.com/golang/protobuf v1.3.1 // indirect
	github.com/gorilla/context v1.1.1 // indirect
	github.com/gorilla/mux v1.6.2 // indirect
	github.com/kevinburke/go-bindata v3.13.0+incompatible // indirect
	github.com/kisielk/errcheck v1.2.0 // indirect
	github.com/kr/logfmt v0.0.0-20140226030751-b84e30acd515 // indirect
	github.com/pkg/errors v0.8.0
	github.com/pmezard/go-difflib v1.0.0
	github.com/spf13/pflag v1.0.1
	golang.org/x/crypto v0.0.0-20190605123033-f99c8df09eb5 // indirect
	golang.org/x/net v0.0.0-20190607181551-461777fb6f67 // indirect
	golang.org/x/sys v0.0.0-20190606203320-7fc4e5ec1444 // indirect
	golang.org/x/text v0.3.2 // indirect
	golang.org/x/tools v0.0.0-20190607224622-755ce86c7629
	google.golang.org/genproto v0.0.0-20180523212516-694d95ba50e6 // indirect
	google.golang.org/grpc v1.12.0 // indirect
)
