10;23;PLAN_PREPAGO;S/N
30;31;PLAN_POSTPAGO;S/N
40;12;PLAN_PREPAGO;S/N
20;21;PLAN_WOW;2,3,4
1;10;PLAN_PREPAGO;S/N
2;20;PLAN_WOW;1,4
3;300;PLAN_POSTPAGO;S/N
4;40;PLAN_WOW;2,3
5;103;PLAN_POSTPAGO;S/N
6;46;PLAN_PREPAGO;S/N
