D:\Universidad\8. Octavo Semestre\Ingenieria de Calidad\Proyecto SonarQube\pruebas-de-software-estaticas-sonarqube\src\main\java\Entities\Phone_Number.java
D:\Universidad\8. Octavo Semestre\Ingenieria de Calidad\Proyecto SonarQube\pruebas-de-software-estaticas-sonarqube\src\main\java\Entities\Bill.java
D:\Universidad\8. Octavo Semestre\Ingenieria de Calidad\Proyecto SonarQube\pruebas-de-software-estaticas-sonarqube\src\main\java\plans\TimeController.java
D:\Universidad\8. Octavo Semestre\Ingenieria de Calidad\Proyecto SonarQube\pruebas-de-software-estaticas-sonarqube\src\main\java\useCases\LoadCDRsFromExternalFile.java
D:\Universidad\8. Octavo Semestre\Ingenieria de Calidad\Proyecto SonarQube\pruebas-de-software-estaticas-sonarqube\src\main\java\constructors\PersistenceFactory.java
D:\Universidad\8. Octavo Semestre\Ingenieria de Calidad\Proyecto SonarQube\pruebas-de-software-estaticas-sonarqube\src\main\java\controllers\CDRsController.java
D:\Universidad\8. Octavo Semestre\Ingenieria de Calidad\Proyecto SonarQube\pruebas-de-software-estaticas-sonarqube\src\main\java\data\CDRRepository.java
D:\Universidad\8. Octavo Semestre\Ingenieria de Calidad\Proyecto SonarQube\pruebas-de-software-estaticas-sonarqube\src\main\java\controllers\PhoneNumbersController.java
D:\Universidad\8. Octavo Semestre\Ingenieria de Calidad\Proyecto SonarQube\pruebas-de-software-estaticas-sonarqube\src\main\java\Entities\CDR.java
D:\Universidad\8. Octavo Semestre\Ingenieria de Calidad\Proyecto SonarQube\pruebas-de-software-estaticas-sonarqube\src\main\java\plans\Plan_Prepago.java
D:\Universidad\8. Octavo Semestre\Ingenieria de Calidad\Proyecto SonarQube\pruebas-de-software-estaticas-sonarqube\src\main\java\useCases\IShowPhoneNumbers.java
D:\Universidad\8. Octavo Semestre\Ingenieria de Calidad\Proyecto SonarQube\pruebas-de-software-estaticas-sonarqube\src\main\java\useCases\ShowPhoneNumbers.java
D:\Universidad\8. Octavo Semestre\Ingenieria de Calidad\Proyecto SonarQube\pruebas-de-software-estaticas-sonarqube\src\main\java\data\IPhoneNumberRepository.java
D:\Universidad\8. Octavo Semestre\Ingenieria de Calidad\Proyecto SonarQube\pruebas-de-software-estaticas-sonarqube\src\main\java\useCases\ShowCDRs.java
D:\Universidad\8. Octavo Semestre\Ingenieria de Calidad\Proyecto SonarQube\pruebas-de-software-estaticas-sonarqube\src\main\java\Persistence\FileTxt.java
D:\Universidad\8. Octavo Semestre\Ingenieria de Calidad\Proyecto SonarQube\pruebas-de-software-estaticas-sonarqube\src\main\java\plans\Plan_Wow.java
D:\Universidad\8. Octavo Semestre\Ingenieria de Calidad\Proyecto SonarQube\pruebas-de-software-estaticas-sonarqube\src\main\java\Main\Main.java
D:\Universidad\8. Octavo Semestre\Ingenieria de Calidad\Proyecto SonarQube\pruebas-de-software-estaticas-sonarqube\src\main\java\useCases\LoadPhoneNumbersFromExternalFile.java
D:\Universidad\8. Octavo Semestre\Ingenieria de Calidad\Proyecto SonarQube\pruebas-de-software-estaticas-sonarqube\src\main\java\Persistence\IDataPersistence.java
D:\Universidad\8. Octavo Semestre\Ingenieria de Calidad\Proyecto SonarQube\pruebas-de-software-estaticas-sonarqube\src\main\java\useCases\ICalculateCostCDR.java
D:\Universidad\8. Octavo Semestre\Ingenieria de Calidad\Proyecto SonarQube\pruebas-de-software-estaticas-sonarqube\src\main\java\useCases\CalculateCostCDR.java
D:\Universidad\8. Octavo Semestre\Ingenieria de Calidad\Proyecto SonarQube\pruebas-de-software-estaticas-sonarqube\src\main\java\constructors\Plan_Factory.java
D:\Universidad\8. Octavo Semestre\Ingenieria de Calidad\Proyecto SonarQube\pruebas-de-software-estaticas-sonarqube\src\main\java\Persistence\FileSQL.java
D:\Universidad\8. Octavo Semestre\Ingenieria de Calidad\Proyecto SonarQube\pruebas-de-software-estaticas-sonarqube\src\main\java\useCases\ILoadAndSaveCDRandNumbersPersistence.java
D:\Universidad\8. Octavo Semestre\Ingenieria de Calidad\Proyecto SonarQube\pruebas-de-software-estaticas-sonarqube\src\main\java\data\CurrentDate.java
D:\Universidad\8. Octavo Semestre\Ingenieria de Calidad\Proyecto SonarQube\pruebas-de-software-estaticas-sonarqube\src\main\java\data\ICDRRepository.java
D:\Universidad\8. Octavo Semestre\Ingenieria de Calidad\Proyecto SonarQube\pruebas-de-software-estaticas-sonarqube\src\main\java\plans\Plan_PostPago.java
D:\Universidad\8. Octavo Semestre\Ingenieria de Calidad\Proyecto SonarQube\pruebas-de-software-estaticas-sonarqube\src\main\java\useCases\ILoadPhoneNumberFromExternalFile.java
D:\Universidad\8. Octavo Semestre\Ingenieria de Calidad\Proyecto SonarQube\pruebas-de-software-estaticas-sonarqube\src\main\java\useCases\IShowCDRs.java
D:\Universidad\8. Octavo Semestre\Ingenieria de Calidad\Proyecto SonarQube\pruebas-de-software-estaticas-sonarqube\src\main\java\plans\IPlan.java
D:\Universidad\8. Octavo Semestre\Ingenieria de Calidad\Proyecto SonarQube\pruebas-de-software-estaticas-sonarqube\src\main\java\data\PhoneNumberRepository.java
D:\Universidad\8. Octavo Semestre\Ingenieria de Calidad\Proyecto SonarQube\pruebas-de-software-estaticas-sonarqube\src\main\java\useCases\ILoadCDRsFromExternalFile.java
D:\Universidad\8. Octavo Semestre\Ingenieria de Calidad\Proyecto SonarQube\pruebas-de-software-estaticas-sonarqube\src\main\java\useCases\LoadAndSaveCDRandNumbersPersistence.java
