2020-09-26 02:00:04,976 - Loaded System Directive: org.apache.velocity.runtime.directive.Parse
2020-09-26 02:00:04,979 - Loaded System Directive: org.apache.velocity.runtime.directive.Include
2020-09-26 02:00:04,979 - Loaded System Directive: org.apache.velocity.runtime.directive.Foreach
2020-09-26 02:00:04,980 - Created '20' parsers.
2020-09-26 02:00:04,980 - Velocimacro : "velocimacro.library" is not set.  Trying default library: VM_global_library.vm
2020-09-26 02:00:04,981 - Could not load resource 'VM_global_library.vm' from ResourceLoader org.apache.velocity.runtime.resource.loader.ClasspathResourceLoader: ClasspathResourceLoader Error: cannot find resource VM_global_library.vm
2020-09-26 02:00:04,981 - Velocimacro : Default library not found.
2020-09-26 02:00:04,981 - Velocimacro : allowInline = true : VMs can be defined inline in templates
2020-09-26 02:00:04,981 - Velocimacro : allowInlineToOverride = false : VMs defined inline may NOT replace previous VM definitions
2020-09-26 02:00:04,981 - Velocimacro : allowInlineLocal = false : VMs defined inline will be global in scope if allowed.
2020-09-26 02:00:04,981 - Velocimacro : autoload off : VM system will not automatically reload global library macros
2020-09-26 02:00:04,982 - Velocimacro : added VM mainLayout: source=velocity/nav.vm
2020-09-26 02:00:04,982 - ResourceManager : found velocity/nav.vm with loader org.apache.velocity.runtime.resource.loader.ClasspathResourceLoader
2020-09-26 02:00:04,984 - Log4JLogChute initialized using file 'velocity.log'
2020-09-26 02:00:04,984 - Initializing Velocity, Calling init()...
2020-09-26 02:00:04,984 - Starting Apache Velocity v1.7 (compiled: 2010-11-19 12:14:37)
2020-09-26 02:00:04,984 - Default Properties File: org/apache/velocity/runtime/defaults/velocity.properties
2020-09-26 02:00:04,984 - Trying to use logger class org.apache.velocity.runtime.log.AvalonLogChute
2020-09-26 02:00:04,984 - Target log system for org.apache.velocity.runtime.log.AvalonLogChute is not available (java.lang.NoClassDefFoundError: org/apache/log/format/Formatter).  Falling back to next log system...
2020-09-26 02:00:04,984 - Trying to use logger class org.apache.velocity.runtime.log.Log4JLogChute
2020-09-26 02:00:04,984 - Using logger class org.apache.velocity.runtime.log.Log4JLogChute
2020-09-26 02:00:04,984 - ResourceLoader instantiated: org.apache.velocity.runtime.resource.loader.ClasspathResourceLoader
2020-09-26 02:00:04,985 - ResourceCache: initialized (class org.apache.velocity.runtime.resource.ResourceCacheImpl) with class java.util.Collections$SynchronizedMap cache map.
2020-09-26 02:00:04,985 - Loaded System Directive: org.apache.velocity.runtime.directive.Stop
2020-09-26 02:00:04,985 - Loaded System Directive: org.apache.velocity.runtime.directive.Define
2020-09-26 02:00:04,985 - Loaded System Directive: org.apache.velocity.runtime.directive.Break
2020-09-26 02:00:04,985 - Loaded System Directive: org.apache.velocity.runtime.directive.Evaluate
2020-09-26 02:00:04,985 - Loaded System Directive: org.apache.velocity.runtime.directive.Literal
2020-09-26 02:00:04,985 - Loaded System Directive: org.apache.velocity.runtime.directive.Macro
2020-09-26 02:00:04,985 - Loaded System Directive: org.apache.velocity.runtime.directive.Parse
2020-09-26 02:00:04,985 - Loaded System Directive: org.apache.velocity.runtime.directive.Include
2020-09-26 02:00:04,985 - Loaded System Directive: org.apache.velocity.runtime.directive.Foreach
2020-09-26 02:00:04,986 - Created '20' parsers.
2020-09-26 02:00:04,986 - Velocimacro : "velocimacro.library" is not set.  Trying default library: VM_global_library.vm
2020-09-26 02:00:04,986 - Could not load resource 'VM_global_library.vm' from ResourceLoader org.apache.velocity.runtime.resource.loader.ClasspathResourceLoader: ClasspathResourceLoader Error: cannot find resource VM_global_library.vm
2020-09-26 02:00:04,986 - Velocimacro : Default library not found.
2020-09-26 02:00:04,986 - Velocimacro : allowInline = true : VMs can be defined inline in templates
2020-09-26 02:00:04,986 - Velocimacro : allowInlineToOverride = false : VMs defined inline may NOT replace previous VM definitions
2020-09-26 02:00:04,986 - Velocimacro : allowInlineLocal = false : VMs defined inline will be global in scope if allowed.
2020-09-26 02:00:04,986 - Velocimacro : autoload off : VM system will not automatically reload global library macros
2020-09-26 02:00:04,987 - ResourceManager : found velocity/loadFile/IULoad.vm with loader org.apache.velocity.runtime.resource.loader.ClasspathResourceLoader
2020-09-26 02:00:04,988 - Velocimacro : added VM mainLayout: source=/velocity/nav.vm
2020-09-26 02:00:04,988 - ResourceManager : found /velocity/nav.vm with loader org.apache.velocity.runtime.resource.loader.ClasspathResourceLoader
2020-09-26 02:00:05,453 - Log4JLogChute initialized using file 'velocity.log'
2020-09-26 02:00:05,454 - Initializing Velocity, Calling init()...
2020-09-26 02:00:05,454 - Starting Apache Velocity v1.7 (compiled: 2010-11-19 12:14:37)
2020-09-26 02:00:05,454 - Default Properties File: org/apache/velocity/runtime/defaults/velocity.properties
2020-09-26 02:00:05,454 - Trying to use logger class org.apache.velocity.runtime.log.AvalonLogChute
2020-09-26 02:00:05,454 - Target log system for org.apache.velocity.runtime.log.AvalonLogChute is not available (java.lang.NoClassDefFoundError: org/apache/log/format/Formatter).  Falling back to next log system...
2020-09-26 02:00:05,455 - Trying to use logger class org.apache.velocity.runtime.log.Log4JLogChute
2020-09-26 02:00:05,455 - Using logger class org.apache.velocity.runtime.log.Log4JLogChute
2020-09-26 02:00:05,455 - ResourceLoader instantiated: org.apache.velocity.runtime.resource.loader.ClasspathResourceLoader
2020-09-26 02:00:05,455 - ResourceCache: initialized (class org.apache.velocity.runtime.resource.ResourceCacheImpl) with class java.util.Collections$SynchronizedMap cache map.
2020-09-26 02:00:05,456 - Loaded System Directive: org.apache.velocity.runtime.directive.Stop
2020-09-26 02:00:05,456 - Loaded System Directive: org.apache.velocity.runtime.directive.Define
2020-09-26 02:00:05,456 - Loaded System Directive: org.apache.velocity.runtime.directive.Break
2020-09-26 02:00:05,456 - Loaded System Directive: org.apache.velocity.runtime.directive.Evaluate
2020-09-26 02:00:05,456 - Loaded System Directive: org.apache.velocity.runtime.directive.Literal
2020-09-26 02:00:05,456 - Loaded System Directive: org.apache.velocity.runtime.directive.Macro
2020-09-26 02:00:05,456 - Loaded System Directive: org.apache.velocity.runtime.directive.Parse
2020-09-26 02:00:05,456 - Loaded System Directive: org.apache.velocity.runtime.directive.Include
2020-09-26 02:00:05,457 - Loaded System Directive: org.apache.velocity.runtime.directive.Foreach
2020-09-26 02:00:05,457 - Created '20' parsers.
2020-09-26 02:00:05,457 - Velocimacro : "velocimacro.library" is not set.  Trying default library: VM_global_library.vm
2020-09-26 02:00:05,458 - Could not load resource 'VM_global_library.vm' from ResourceLoader org.apache.velocity.runtime.resource.loader.ClasspathResourceLoader: ClasspathResourceLoader Error: cannot find resource VM_global_library.vm
2020-09-26 02:00:05,458 - Velocimacro : Default library not found.
2020-09-26 02:00:05,458 - Velocimacro : allowInline = true : VMs can be defined inline in templates
2020-09-26 02:00:05,458 - Velocimacro : allowInlineToOverride = false : VMs defined inline may NOT replace previous VM definitions
2020-09-26 02:00:05,458 - Velocimacro : allowInlineLocal = false : VMs defined inline will be global in scope if allowed.
2020-09-26 02:00:05,458 - Velocimacro : autoload off : VM system will not automatically reload global library macros
2020-09-26 02:00:05,459 - Velocimacro : added VM mainLayout: source=velocity/nav.vm
2020-09-26 02:00:05,460 - ResourceManager : found velocity/nav.vm with loader org.apache.velocity.runtime.resource.loader.ClasspathResourceLoader
2020-09-26 02:00:05,461 - Log4JLogChute initialized using file 'velocity.log'
2020-09-26 02:00:05,461 - Initializing Velocity, Calling init()...
2020-09-26 02:00:05,461 - Starting Apache Velocity v1.7 (compiled: 2010-11-19 12:14:37)
2020-09-26 02:00:05,461 - Default Properties File: org/apache/velocity/runtime/defaults/velocity.properties
2020-09-26 02:00:05,461 - Trying to use logger class org.apache.velocity.runtime.log.AvalonLogChute
2020-09-26 02:00:05,461 - Target log system for org.apache.velocity.runtime.log.AvalonLogChute is not available (java.lang.NoClassDefFoundError: org/apache/log/format/Formatter).  Falling back to next log system...
2020-09-26 02:00:05,462 - Trying to use logger class org.apache.velocity.runtime.log.Log4JLogChute
2020-09-26 02:00:05,462 - Using logger class org.apache.velocity.runtime.log.Log4JLogChute
2020-09-26 02:00:05,462 - ResourceLoader instantiated: org.apache.velocity.runtime.resource.loader.ClasspathResourceLoader
2020-09-26 02:00:05,462 - ResourceCache: initialized (class org.apache.velocity.runtime.resource.ResourceCacheImpl) with class java.util.Collections$SynchronizedMap cache map.
2020-09-26 02:00:05,463 - Loaded System Directive: org.apache.velocity.runtime.directive.Stop
2020-09-26 02:00:05,463 - Loaded System Directive: org.apache.velocity.runtime.directive.Define
2020-09-26 02:00:05,463 - Loaded System Directive: org.apache.velocity.runtime.directive.Break
2020-09-26 02:00:05,463 - Loaded System Directive: org.apache.velocity.runtime.directive.Evaluate
2020-09-26 02:00:05,463 - Loaded System Directive: org.apache.velocity.runtime.directive.Literal
2020-09-26 02:00:05,463 - Loaded System Directive: org.apache.velocity.runtime.directive.Macro
2020-09-26 02:00:05,463 - Loaded System Directive: org.apache.velocity.runtime.directive.Parse
2020-09-26 02:00:05,463 - Loaded System Directive: org.apache.velocity.runtime.directive.Include
2020-09-26 02:00:05,463 - Loaded System Directive: org.apache.velocity.runtime.directive.Foreach
2020-09-26 02:00:05,465 - Created '20' parsers.
2020-09-26 02:00:05,465 - Velocimacro : "velocimacro.library" is not set.  Trying default library: VM_global_library.vm
2020-09-26 02:00:05,465 - Could not load resource 'VM_global_library.vm' from ResourceLoader org.apache.velocity.runtime.resource.loader.ClasspathResourceLoader: ClasspathResourceLoader Error: cannot find resource VM_global_library.vm
2020-09-26 02:00:05,465 - Velocimacro : Default library not found.
2020-09-26 02:00:05,465 - Velocimacro : allowInline = true : VMs can be defined inline in templates
2020-09-26 02:00:05,466 - Velocimacro : allowInlineToOverride = false : VMs defined inline may NOT replace previous VM definitions
2020-09-26 02:00:05,466 - Velocimacro : allowInlineLocal = false : VMs defined inline will be global in scope if allowed.
2020-09-26 02:00:05,466 - Velocimacro : autoload off : VM system will not automatically reload global library macros
2020-09-26 02:00:05,468 - ResourceManager : found velocity/loadFile/IULoadPhoneNumbers.vm with loader org.apache.velocity.runtime.resource.loader.ClasspathResourceLoader
2020-09-26 02:00:05,469 - Velocimacro : added VM mainLayout: source=/velocity/nav.vm
2020-09-26 02:00:05,469 - ResourceManager : found /velocity/nav.vm with loader org.apache.velocity.runtime.resource.loader.ClasspathResourceLoader
pache.velocity.runtime.resource.loader.ClasspathResourceLoader
2020-09-26 02:00:05,461 - Log4JLogChute initialized using file 'velocity.log'
2020-09-26 02:00:05,461 - Log4JLogChute initialized using file 'velocity.log'
2020-09-26 02:00:05,461 - Log4JLogChute initialized using file 'velocity.log'
2020-09-26 02:00:05,461 - Initializing Velocity, Calling init()...
2020-09-26 02:00:05,461 - Initializing Velocity, Calling init()...
2020-09-26 02:00:05,461 - Initializing Velocity, Calling init()...
2020-09-26 02:00:05,461 - Starting Apache Velocity v1.7 (compiled: 2010-11-19 12:14:37)
2020-09-26 02:00:05,461 - Starting Apache Velocity v1.7 (compiled: 2010-11-19 12:14:37)
2020-09-26 02:00:05,461 - Starting Apache Velocity v1.7 (compiled: 2010-11-19 12:14:37)
2020-09-26 02:00:05,461 - Default Properties File: org/apache/velocity/runtime/defaults/velocity.properties
2020-09-26 02:00:05,461 - Default Properties File: org/apache/velocity/runtime/defaults/velocity.properties
2020-09-26 02:00:05,461 - Default Properties File: org/apache/velocity/runtime/defaults/velocity.properties
2020-09-26 02:00:05,461 - Trying to use logger class org.apache.velocity.runtime.log.AvalonLogChute
2020-09-26 02:00:05,461 - Trying to use logger class org.apache.velocity.runtime.log.AvalonLogChute
2020-09-26 02:00:05,461 - Trying to use logger class org.apache.velocity.runtime.log.AvalonLogChute
2020-09-26 02:00:05,461 - Target log system for org.apache.velocity.runtime.log.AvalonLogChute is not available (java.lang.NoClassDefFoundError: org/apache/log/format/Formatter).  Falling back to next log system...
2020-09-26 02:00:05,461 - Target log system for org.apache.velocity.runtime.log.AvalonLogChute is not available (java.lang.NoClassDefFoundError: org/apache/log/format/Formatter).  Falling back to next log system...
2020-09-26 02:00:05,461 - Target log system for org.apache.velocity.runtime.log.AvalonLogChute is not available (java.lang.NoClassDefFoundError: org/apache/log/format/Formatter).  Falling back to next log system...
2020-09-26 02:00:05,462 - Trying to use logger class org.apache.velocity.runtime.log.Log4JLogChute
2020-09-26 02:00:05,462 - Trying to use logger class org.apache.velocity.runtime.log.Log4JLogChute
2020-09-26 02:00:05,462 - Trying to use logger class org.apache.velocity.runtime.log.Log4JLogChute
2020-09-26 02:00:05,462 - Using logger class org.apache.velocity.runtime.log.Log4JLogChute
2020-09-26 02:00:05,462 - Using logger class org.apache.velocity.runtime.log.Log4JLogChute
2020-09-26 02:00:05,462 - Using logger class org.apache.velocity.runtime.log.Log4JLogChute
2020-09-26 02:00:05,462 - ResourceLoader instantiated: org.apache.velocity.runtime.resource.loader.ClasspathResourceLoader
2020-09-26 02:00:05,462 - ResourceLoader instantiated: org.apache.velocity.runtime.resource.loader.ClasspathResourceLoader
2020-09-26 02:00:05,462 - ResourceLoader instantiated: org.apache.velocity.runtime.resource.loader.ClasspathResourceLoader
2020-09-26 02:00:05,462 - ResourceCache: initialized (class org.apache.velocity.runtime.resource.ResourceCacheImpl) with class java.util.Collections$SynchronizedMap cache map.
2020-09-26 02:00:05,462 - ResourceCache: initialized (class org.apache.velocity.runtime.resource.ResourceCacheImpl) with class java.util.Collections$SynchronizedMap cache map.
2020-09-26 02:00:05,462 - ResourceCache: initialized (class org.apache.velocity.runtime.resource.ResourceCacheImpl) with class java.util.Collections$SynchronizedMap cache map.
2020-09-26 02:00:05,463 - Loaded System Directive: org.apache.velocity.runtime.directive.Stop
2020-09-26 02:00:05,463 - Loaded System Directive: org.apache.velocity.runtime.directive.Stop
2020-09-26 02:00:05,463 - Loaded System Directive: org.apache.velocity.runtime.directive.Stop
2020-09-26 02:00:05,463 - Loaded System Directive: org.apache.velocity.runtime.directive.Define
2020-09-26 02:00:05,463 - Loaded System Directive: org.apache.velocity.runtime.directive.Define
2020-09-26 02:00:05,463 - Loaded System Directive: org.apache.velocity.runtime.directive.Define
2020-09-26 02:00:05,463 - Loaded System Directive: org.apache.velocity.runtime.directive.Break
2020-09-26 02:00:05,463 - Loaded System Directive: org.apache.velocity.runtime.directive.Break
2020-09-26 02:00:05,463 - Loaded System Directive: org.apache.velocity.runtime.directive.Break
2020-09-26 02:00:05,463 - Loaded System Directive: org.apache.velocity.runtime.directive.Evaluate
2020-09-26 02:00:05,463 - Loaded System Directive: org.apache.velocity.runtime.directive.Evaluate
2020-09-26 02:00:05,463 - Loaded System Directive: org.apache.velocity.runtime.directive.Evaluate
2020-09-26 02:00:05,463 - Loaded System Directive: org.apache.velocity.runtime.directive.Literal
2020-09-26 02:00:05,463 - Loaded System Directive: org.apache.velocity.runtime.directive.Literal
2020-09-26 02:00:05,463 - Loaded System Directive: org.apache.velocity.runtime.directive.Literal
2020-09-26 02:00:05,463 - Loaded System Directive: org.apache.velocity.runtime.directive.Macro
2020-09-26 02:00:05,463 - Loaded System Directive: org.apache.velocity.runtime.directive.Macro
2020-09-26 02:00:05,463 - Loaded System Directive: org.apache.velocity.runtime.directive.Macro
2020-09-26 02:00:05,463 - Loaded System Directive: org.apache.velocity.runtime.directive.Parse
2020-09-26 02:00:05,463 - Loaded System Directive: org.apache.velocity.runtime.directive.Parse
2020-09-26 02:00:05,463 - Loaded System Directive: org.apache.velocity.runtime.directive.Parse
2020-09-26 02:00:05,463 - Loaded System Directive: org.apache.velocity.runtime.directive.Include
2020-09-26 02:00:05,463 - Loaded System Directive: org.apache.velocity.runtime.directive.Include
2020-09-26 02:00:05,463 - Loaded System Directive: org.apache.velocity.runtime.directive.Include
2020-09-26 02:00:05,463 - Loaded System Directive: org.apache.velocity.runtime.directive.Foreach
2020-09-26 02:00:05,463 - Loaded System Directive: org.apache.velocity.runtime.directive.Foreach
2020-09-26 02:00:05,463 - Loaded System Directive: org.apache.velocity.runtime.directive.Foreach
2020-09-26 02:00:05,465 - Created '20' parsers.
2020-09-26 02:00:05,465 - Created '20' parsers.
2020-09-26 02:00:05,465 - Created '20' parsers.
2020-09-26 02:00:05,465 - Velocimacro : "velocimacro.library" is not set.  Trying default library: VM_global_library.vm
2020-09-26 02:00:05,465 - Velocimacro : "velocimacro.library" is not set.  Trying default library: VM_global_library.vm
2020-09-26 02:00:05,465 - Velocimacro : "velocimacro.library" is not set.  Trying default library: VM_global_library.vm
2020-09-26 02:00:05,465 - Could not load resource 'VM_global_library.vm' from ResourceLoader org.apache.velocity.runtime.resource.loader.ClasspathResourceLoader: ClasspathResourceLoader Error: cannot find resource VM_global_library.vm
2020-09-26 02:00:05,465 - Could not load resource 'VM_global_library.vm' from ResourceLoader org.apache.velocity.runtime.resource.loader.ClasspathResourceLoader: ClasspathResourceLoader Error: cannot find resource VM_global_library.vm
2020-09-26 02:00:05,465 - Could not load resource 'VM_global_library.vm' from ResourceLoader org.apache.velocity.runtime.resource.loader.ClasspathResourceLoader: ClasspathResourceLoader Error: cannot find resource VM_global_library.vm
2020-09-26 02:00:05,465 - Velocimacro : Default library not found.
2020-09-26 02:00:05,465 - Velocimacro : Default library not found.
2020-09-26 02:00:05,465 - Velocimacro : Default library not found.
2020-09-26 02:00:05,465 - Velocimacro : allowInline = true : VMs can be defined inline in templates
2020-09-26 02:00:05,465 - Velocimacro : allowInline = true : VMs can be defined inline in templates
2020-09-26 02:00:05,465 - Velocimacro : allowInline = true : VMs can be defined inline in templates
2020-09-26 02:00:05,466 - Velocimacro : allowInlineToOverride = false : VMs defined inline may NOT replace previous VM definitions
2020-09-26 02:00:05,466 - Velocimacro : allowInlineToOverride = false : VMs defined inline may NOT replace previous VM definitions
2020-09-26 02:00:05,466 - Velocimacro : allowInlineToOverride = false : VMs defined inline may NOT replace previous VM definitions
2020-09-26 02:00:05,466 - Velocimacro : allowInlineLocal = false : VMs defined inline will be global in scope if allowed.
2020-09-26 02:00:05,466 - Velocimacro : allowInlineLocal = false : VMs defined inline will be global in scope if allowed.
2020-09-26 02:00:05,466 - Velocimacro : allowInlineLocal = false : VMs defined inline will be global in scope if allowed.
2020-09-26 02:00:05,466 - Velocimacro : autoload off : VM system will not automatically reload global library macros
2020-09-26 02:00:05,466 - Velocimacro : autoload off : VM system will not automatically reload global library macros
2020-09-26 02:00:05,466 - Velocimacro : autoload off : VM system will not automatically reload global library macros
2020-09-26 02:00:05,468 - ResourceManager : found velocity/loadFile/IULoadPhoneNumbers.vm with loader org.apache.velocity.runtime.resource.loader.ClasspathResourceLoader
2020-09-26 02:00:05,468 - ResourceManager : found velocity/loadFile/IULoadPhoneNumbers.vm with loader org.apache.velocity.runtime.resource.loader.ClasspathResourceLoader
2020-09-26 02:00:05,468 - ResourceManager : found velocity/loadFile/IULoadPhoneNumbers.vm with loader org.apache.velocity.runtime.resource.loader.ClasspathResourceLoader
2020-09-26 02:00:05,469 - Velocimacro : added VM mainLayout: source=/velocity/nav.vm
2020-09-26 02:00:05,469 - Velocimacro : added VM mainLayout: source=/velocity/nav.vm
2020-09-26 02:00:05,469 - Velocimacro : added VM mainLayout: source=/velocity/nav.vm
2020-09-26 02:00:05,469 - ResourceManager : found /velocity/nav.vm with loader org.apache.velocity.runtime.resource.loader.ClasspathResourceLoader
2020-09-26 02:00:05,469 - ResourceManager : found /velocity/nav.vm with loader org.apache.velocity.runtime.resource.loader.ClasspathResourceLoader
2020-09-26 02:00:05,469 - ResourceManager : found /velocity/nav.vm with loader org.apache.velocity.runtime.resource.loader.ClasspathResourceLoader
