[
    {
        "id": 1,
        "categoryQuechua": "Ñuqa",
        "categorySpanish": "Yo",
        "type": "noun"
    },
    {
        "id": 2,
        "categoryQuechua": "Qam",
        "categorySpanish": "Tu",
        "type": "noun"
    },
    {
        "id": 3,
        "categoryQuechua": "Pay",
        "categorySpanish": "El",
        "type": "noun"
    }       
]