<?xml version="1.0" encoding="UTF-8" standalone="no"?>
<!DOCTYPE svg PUBLIC "-//W3C//DTD SVG 1.1//EN" "http://www.w3.org/Graphics/SVG/1.1/DTD/svg11.dtd">
<svg width="100%" height="100%" viewBox="0 0 155 50" version="1.1" xmlns="http://www.w3.org/2000/svg" xmlns:xlink="http://www.w3.org/1999/xlink" xml:space="preserve" xmlns:serif="http://www.serif.com/" style="fill-rule:evenodd;clip-rule:evenodd;stroke-linejoin:round;stroke-miterlimit:2;">
    <g>
        <g transform="matrix(1.13861,0,0,1.13861,-10.8451,-10.9154)">
            <path d="M140,50L15,50C12.25,50 10,47.75 10,45L10,15C10,12.25 12.25,10 15,10L140,10C142.75,10 145,12.25 145,15L145,45C145,47.75 142.75,50 140,50Z" style="fill-rule:nonzero;"/>
        </g>
        <g transform="matrix(1.13861,0,0,1.13861,-10.8451,-10.9154)">
            <path d="M140,10.001L15,10.001C12.25,10.001 10,12.251 10,15L10,45.001C10,47.75 12.25,50.001 15,50.001L140,50.001C142.75,50.001 145,47.75 145,45.001L145,15C145,12.251 142.75,10.001 140,10.001ZM140,10.8C142.316,10.8 144.2,12.685 144.2,15L144.2,45.001C144.2,47.316 142.316,49.201 140,49.201L15,49.201C12.684,49.201 10.8,47.316 10.8,45.001L10.8,15C10.8,12.685 12.684,10.8 15,10.8L140,10.8Z" style="fill:rgb(166,166,166);fill-rule:nonzero;"/>
        </g>
        <g transform="matrix(1.13861,0,0,1.13861,-10.8451,-10.9154)">
            <path d="M108.64,30.001L110.27,30.001L110.27,19.073L108.64,19.073L108.64,30.001ZM123.331,23.009L121.461,27.747L121.405,27.747L119.465,23.009L117.707,23.009L120.617,29.631L118.958,33.314L120.659,33.314L125.144,23.009L123.331,23.009ZM114.08,28.759C113.546,28.759 112.801,28.492 112.801,27.831C112.801,26.988 113.729,26.665 114.53,26.665C115.247,26.665 115.584,26.819 116.02,27.03C115.894,28.042 115.022,28.759 114.08,28.759ZM114.277,22.77C113.096,22.77 111.873,23.291 111.367,24.443L112.815,25.048C113.124,24.443 113.701,24.247 114.305,24.247C115.149,24.247 116.006,24.753 116.02,25.652L116.02,25.765C115.725,25.596 115.092,25.343 114.319,25.343C112.759,25.343 111.17,26.201 111.17,27.803C111.17,29.265 112.449,30.207 113.883,30.207C114.98,30.207 115.584,29.715 115.964,29.139L116.02,29.139L116.02,29.982L117.595,29.982L117.595,25.793C117.595,23.853 116.147,22.77 114.277,22.77ZM104.197,24.34L101.878,24.34L101.878,20.594L104.197,20.594C105.417,20.594 106.109,21.604 106.109,22.467C106.109,23.314 105.417,24.34 104.197,24.34ZM104.155,19.073L100.247,19.073L100.247,30.001L101.878,30.001L101.878,25.861L104.155,25.861C105.963,25.861 107.74,24.552 107.74,22.467C107.74,20.382 105.963,19.073 104.155,19.073ZM82.844,28.761C81.717,28.761 80.773,27.818 80.773,26.522C80.773,25.213 81.717,24.255 82.844,24.255C83.956,24.255 84.829,25.213 84.829,26.522C84.829,27.818 83.956,28.761 82.844,28.761ZM84.716,23.621L84.66,23.621C84.294,23.185 83.59,22.791 82.703,22.791C80.844,22.791 79.14,24.424 79.14,26.522C79.14,28.606 80.844,30.226 82.703,30.226C83.59,30.226 84.294,29.832 84.66,29.381L84.716,29.381L84.716,29.916C84.716,31.338 83.956,32.099 82.731,32.099C81.731,32.099 81.111,31.381 80.858,30.775L79.436,31.367C79.844,32.352 80.928,33.563 82.731,33.563C84.646,33.563 86.265,32.437 86.265,29.691L86.265,23.016L84.716,23.016L84.716,23.621ZM87.392,30.001L89.025,30.001L89.025,19.073L87.392,19.073L87.392,30.001ZM91.434,26.396C91.391,24.959 92.546,24.227 93.377,24.227C94.025,24.227 94.574,24.551 94.757,25.016L91.434,26.396ZM96.503,25.156C96.193,24.326 95.25,22.791 93.321,22.791C91.405,22.791 89.814,24.297 89.814,26.508C89.814,28.592 91.391,30.226 93.504,30.226C95.207,30.226 96.193,29.184 96.602,28.578L95.334,27.733C94.912,28.353 94.334,28.761 93.504,28.761C92.673,28.761 92.081,28.381 91.701,27.635L96.672,25.579L96.503,25.156ZM56.9,23.931L56.9,25.508L60.674,25.508C60.561,26.396 60.265,27.043 59.814,27.494C59.265,28.043 58.406,28.649 56.9,28.649C54.576,28.649 52.759,26.776 52.759,24.452C52.759,22.129 54.576,20.256 56.9,20.256C58.153,20.256 59.068,20.749 59.744,21.382L60.857,20.27C59.913,19.369 58.66,18.679 56.9,18.679C53.717,18.679 51.041,21.27 51.041,24.452C51.041,27.635 53.717,30.226 56.9,30.226C58.617,30.226 59.913,29.663 60.927,28.606C61.969,27.564 62.293,26.1 62.293,24.917C62.293,24.551 62.265,24.213 62.208,23.931L56.9,23.931ZM66.583,28.761C65.457,28.761 64.485,27.832 64.485,26.508C64.485,25.17 65.457,24.255 66.583,24.255C67.71,24.255 68.682,25.17 68.682,26.508C68.682,27.832 67.71,28.761 66.583,28.761ZM66.583,22.791C64.527,22.791 62.852,24.354 62.852,26.508C62.852,28.649 64.527,30.226 66.583,30.226C68.639,30.226 70.315,28.649 70.315,26.508C70.315,24.354 68.639,22.791 66.583,22.791ZM74.724,28.761C73.598,28.761 72.626,27.832 72.626,26.508C72.626,25.17 73.598,24.255 74.724,24.255C75.851,24.255 76.822,25.17 76.822,26.508C76.822,27.832 75.851,28.761 74.724,28.761ZM74.724,22.791C72.668,22.791 70.992,24.354 70.992,26.508C70.992,28.649 72.668,30.226 74.724,30.226C76.78,30.226 78.456,28.649 78.456,26.508C78.456,24.354 76.78,22.791 74.724,22.791Z" style="fill:white;fill-rule:nonzero;"/>
        </g>
        <g transform="matrix(1.13861,0,0,1.13861,-10.8451,-10.9154)">
            <path d="M20.509,42.39L20.435,42.319C20.144,42.011 19.972,41.533 19.972,40.914L19.972,41.059L19.972,18.938L19.972,19.09C19.972,18.42 20.173,17.914 20.508,17.612L32.898,30.001L20.509,42.39ZM19.972,18.937C19.972,18.882 19.974,18.828 19.976,18.776C19.974,18.828 19.972,18.882 19.972,18.937ZM19.977,18.773L19.977,18.771L19.977,18.773ZM19.977,18.766L19.977,18.765L19.977,18.766Z" style="fill:url(#_Linear1);"/>
        </g>
        <g transform="matrix(1.13861,0,0,1.13861,-10.8451,-10.9154)">
            <path d="M37.027,34.279L37.121,34.225L42.014,31.445C42.481,31.18 42.792,30.859 42.947,30.518C42.792,30.859 42.481,31.18 42.014,31.446L37.121,34.226L37.027,34.279ZM37.028,34.132L32.898,30.001L37.028,25.871L42.014,28.704C42.648,29.063 43.003,29.527 43.062,30.001L43.062,30.003C43.003,30.475 42.648,30.939 42.014,31.299L37.028,34.132Z" style="fill:url(#_Linear2);"/>
        </g>
        <g transform="matrix(1.13861,0,0,1.13861,-10.8451,-10.9154)">
            <path d="M21.392,42.862C21.046,42.862 20.745,42.749 20.509,42.537L20.509,42.536C20.745,42.749 21.047,42.862 21.393,42.862C21.423,42.862 21.454,42.861 21.485,42.859C21.454,42.861 21.423,42.862 21.392,42.862ZM21.393,42.715C21.047,42.716 20.745,42.603 20.509,42.39L32.898,30.001L37.028,34.132L22.513,42.38C22.112,42.608 21.731,42.715 21.393,42.715ZM20.506,42.534C20.484,42.514 20.462,42.493 20.441,42.471L20.506,42.534Z" style="fill:url(#_Linear3);"/>
        </g>
        <g transform="matrix(1.13861,0,0,1.13861,-10.8451,-10.9154)">
            <path d="M32.898,30.001L20.508,17.612C20.744,17.4 21.045,17.287 21.391,17.287C21.73,17.287 22.111,17.395 22.513,17.624L37.028,25.871L32.898,30.001ZM37.121,25.778L22.513,17.478C22.111,17.249 21.73,17.141 21.391,17.141L21.387,17.141L21.392,17.141C21.731,17.141 22.111,17.249 22.513,17.477L37.121,25.777L37.121,25.778Z" style="fill:url(#_Linear4);"/>
        </g>
        <g transform="matrix(1.13861,0,0,1.13861,-10.8451,-10.9154)">
            <path d="M21.485,42.859C21.799,42.841 22.147,42.733 22.513,42.526L37.027,34.279L22.513,42.526C22.147,42.734 21.799,42.842 21.485,42.859ZM20.509,42.537L20.506,42.534C20.507,42.535 20.508,42.536 20.509,42.537ZM20.441,42.471L20.435,42.465C20.437,42.467 20.439,42.469 20.441,42.471Z" style="fill-rule:nonzero;"/>
        </g>
        <g transform="matrix(1.13861,0,0,1.13861,-10.8451,-10.9154)">
            <path d="M37.027,34.279L37.121,34.225L37.027,34.279Z" style="fill:url(#_Linear5);"/>
        </g>
        <g transform="matrix(1.13861,0,0,1.13861,-10.8451,-10.9154)">
            <path d="M21.393,42.862C21.047,42.862 20.745,42.749 20.509,42.536L20.509,42.537C20.508,42.536 20.507,42.535 20.506,42.534L20.441,42.471C20.439,42.469 20.437,42.467 20.435,42.465L20.509,42.39C20.745,42.603 21.047,42.716 21.393,42.715C21.731,42.715 22.112,42.608 22.513,42.38L37.028,34.132L37.121,34.225L37.027,34.279L22.513,42.526C22.147,42.733 21.799,42.841 21.485,42.859C21.454,42.861 21.423,42.862 21.393,42.862Z" style="fill:url(#_Linear6);"/>
        </g>
        <g transform="matrix(1.13861,0,0,1.13861,-10.8451,-10.9154)">
            <path d="M20.435,42.465C20.144,42.157 19.972,41.679 19.972,41.06L19.972,41.059C19.972,41.679 20.144,42.157 20.435,42.464L20.435,42.465Z" style="fill-rule:nonzero;"/>
        </g>
        <g transform="matrix(1.13861,0,0,1.13861,-10.8451,-10.9154)">
            <path d="M20.435,42.464C20.144,42.157 19.972,41.679 19.972,41.059L19.972,40.914C19.972,41.533 20.144,42.011 20.435,42.319L20.509,42.39L20.435,42.464Z" style="fill:url(#_Linear7);"/>
        </g>
        <g transform="matrix(1.13861,0,0,1.13861,-10.8451,-10.9154)">
            <path d="M20.435,42.465L20.435,42.464L20.509,42.39L20.435,42.465Z" style="fill:url(#_Linear8);"/>
        </g>
        <g transform="matrix(1.13861,0,0,1.13861,-10.8451,-10.9154)">
            <path d="M42.947,30.518C43.024,30.35 43.062,30.176 43.062,30.003C43.062,30.002 43.063,30.002 43.063,30.002C43.063,30.176 43.024,30.349 42.947,30.518Z" style="fill-rule:nonzero;"/>
        </g>
        <g transform="matrix(1.13861,0,0,1.13861,-10.8451,-10.9154)">
            <path d="M37.121,34.225L37.028,34.132L42.014,31.299C42.648,30.939 43.003,30.475 43.062,30.003C43.062,30.176 43.024,30.35 42.947,30.518C42.792,30.859 42.481,31.18 42.014,31.445L37.121,34.225Z" style="fill:url(#_Linear9);"/>
        </g>
        <g transform="matrix(1.13861,0,0,1.13861,-10.8451,-10.9154)">
            <path d="M43.063,30.001L43.062,30.001C43.062,29.478 42.713,28.955 42.014,28.558L37.121,25.778L37.121,25.777L42.014,28.558C42.713,28.955 43.063,29.478 43.063,30.001Z" style="fill:rgb(64,64,64);fill-rule:nonzero;"/>
        </g>
        <g transform="matrix(1.13861,0,0,1.13861,-10.8451,-10.9154)">
            <path d="M43.062,30.001C43.003,29.527 42.648,29.063 42.014,28.704L37.028,25.871L37.121,25.778L42.014,28.558C42.713,28.955 43.062,29.478 43.062,30.001Z" style="fill:url(#_Linear10);"/>
        </g>
        <g transform="matrix(1.13861,0,0,1.13861,-10.8451,-10.9154)">
            <path d="M19.972,18.938L19.972,18.937L19.972,18.938ZM19.976,18.776C19.977,18.775 19.977,18.774 19.977,18.773C19.977,18.774 19.977,18.775 19.976,18.776ZM19.977,18.771L19.977,18.766L19.977,18.771ZM19.977,18.765C20.035,17.738 20.593,17.145 21.383,17.141C21.041,17.143 20.743,17.255 20.509,17.466L20.506,17.469C20.482,17.491 20.458,17.514 20.435,17.538C20.173,17.816 20.007,18.232 19.977,18.765Z" style="fill:rgb(64,64,64);fill-rule:nonzero;"/>
        </g>
        <g transform="matrix(1.13861,0,0,1.13861,-10.8451,-10.9154)">
            <path d="M19.972,19.09L19.972,18.937C19.972,18.882 19.974,18.828 19.976,18.776C19.977,18.775 19.977,18.774 19.977,18.773L19.977,18.765C20.007,18.232 20.173,17.816 20.435,17.538L20.508,17.612C20.173,17.914 19.972,18.42 19.972,19.09ZM20.506,17.469L20.509,17.466C20.508,17.467 20.507,17.468 20.506,17.469Z" style="fill:url(#_Linear11);"/>
        </g>
        <g transform="matrix(1.13861,0,0,1.13861,-10.8451,-10.9154)">
            <path d="M21.383,17.141L21.387,17.141L21.383,17.141Z" style="fill:rgb(64,64,64);fill-rule:nonzero;"/>
        </g>
        <g transform="matrix(1.13861,0,0,1.13861,-10.8451,-10.9154)">
            <path d="M37.028,25.871L22.513,17.624C22.111,17.395 21.73,17.287 21.391,17.287C21.045,17.287 20.744,17.4 20.508,17.612L20.435,17.538C20.458,17.514 20.482,17.491 20.506,17.469C20.507,17.468 20.508,17.467 20.509,17.466C20.743,17.255 21.041,17.143 21.383,17.141L21.391,17.141C21.73,17.141 22.111,17.249 22.513,17.478L37.121,25.778L37.028,25.871Z" style="fill:url(#_Linear12);"/>
        </g>
        <g transform="matrix(1.13861,0,0,1.13861,-10.8451,-10.9154)">
            <path d="M58.615,39.19L58.147,39.406C57.931,38.973 57.67,38.533 57.382,38.155L57.832,37.948C58.048,38.245 58.399,38.793 58.615,39.19ZM57.589,39.577L57.13,39.792C56.923,39.361 56.662,38.893 56.392,38.524L56.851,38.326C57.058,38.623 57.4,39.181 57.589,39.577ZM51.8,37.029C52.385,36.975 54.069,36.813 55.708,36.668C56.68,36.588 57.517,36.542 58.111,36.516L58.111,37.236C57.598,37.236 56.824,37.245 56.365,37.38C55.095,37.786 54.33,39.145 54.33,40.198C54.33,41.935 55.95,42.485 57.4,42.539L57.139,43.294C55.491,43.223 53.61,42.34 53.61,40.351C53.61,38.964 54.447,37.831 55.266,37.344C54.483,37.434 52.052,37.668 51.089,37.867L51.008,37.074C51.35,37.065 51.629,37.047 51.8,37.029Z" style="fill:white;fill-rule:nonzero;"/>
        </g>
        <g transform="matrix(1.13861,0,0,1.13861,-10.8451,-10.9154)">
            <path d="M58.615,39.19L58.573,39.099L58.105,39.315L58.147,39.406L58.236,39.361C58.018,38.924 57.754,38.479 57.461,38.094L57.382,38.155L57.424,38.246L57.874,38.039L57.832,37.948L57.751,38.007C57.963,38.298 58.315,38.847 58.527,39.238L58.615,39.19L58.573,39.099L58.615,39.19L58.703,39.142C58.484,38.74 58.132,38.191 57.913,37.889L57.865,37.823L57.34,38.064L57.227,38.116L57.302,38.215C57.585,38.587 57.844,39.022 58.058,39.45L58.101,39.537L58.657,39.281L58.754,39.236L58.703,39.142L58.615,39.19ZM57.589,39.577L57.546,39.486L57.087,39.702L57.13,39.792L57.22,39.749C57.011,39.313 56.748,38.842 56.472,38.465L56.392,38.524L56.431,38.616L56.89,38.417L56.851,38.326L56.769,38.383C56.972,38.674 57.314,39.233 57.499,39.62L57.589,39.577L57.546,39.486L57.589,39.577L57.679,39.534C57.486,39.129 57.143,38.571 56.933,38.268L56.886,38.201L56.352,38.432L56.237,38.482L56.311,38.583C56.576,38.944 56.835,39.408 57.04,39.836L57.083,39.925L57.631,39.667L57.723,39.624L57.679,39.534L57.589,39.577ZM51.8,37.029L51.809,37.128C52.395,37.075 54.078,36.913 55.716,36.768C56.686,36.688 57.523,36.642 58.116,36.616L58.111,36.516L58.011,36.516L58.011,37.236L58.111,37.236L58.111,37.136C57.595,37.137 56.821,37.143 56.336,37.284L56.335,37.285L56.334,37.285C55.014,37.712 54.233,39.101 54.23,40.198C54.228,41.099 54.659,41.712 55.269,42.085C55.878,42.459 56.66,42.611 57.396,42.638L57.4,42.539L57.305,42.506L57.044,43.262L57.139,43.294L57.143,43.194C56.335,43.16 55.469,42.924 54.814,42.46C54.159,41.995 53.711,41.313 53.71,40.351C53.708,39.006 54.528,37.897 55.317,37.43L55.719,37.192L55.255,37.245C54.472,37.335 52.044,37.568 51.069,37.769L51.089,37.867L51.188,37.856L51.107,37.064L51.008,37.074L51.01,37.174C51.355,37.165 51.635,37.147 51.811,37.128L51.8,37.029L51.809,37.128L51.8,37.029L51.79,36.929C51.623,36.947 51.345,36.965 51.005,36.974L50.897,36.976L50.989,37.877L51.001,37.987L51.109,37.965C52.06,37.769 54.494,37.533 55.278,37.444L55.266,37.344L55.215,37.258C54.366,37.764 53.512,38.922 53.51,40.351C53.508,41.379 54.001,42.133 54.699,42.624C55.396,43.116 56.295,43.358 57.134,43.394L57.209,43.398L57.494,42.571L57.539,42.444L57.404,42.439C56.69,42.413 55.937,42.262 55.374,41.914C54.811,41.564 54.433,41.034 54.43,40.198C54.427,39.189 55.177,37.86 56.395,37.476L56.365,37.38L56.393,37.476C56.827,37.347 57.601,37.335 58.111,37.336L58.211,37.336L58.211,36.412L58.107,36.416C57.512,36.443 56.673,36.489 55.699,36.569C54.06,36.713 52.376,36.876 51.791,36.929L51.79,36.929L51.8,37.029Z" style="fill:white;fill-rule:nonzero;"/>
        </g>
        <g transform="matrix(1.13861,0,0,1.13861,-10.8451,-10.9154)">
            <path d="M67.555,40.756L63.864,40.756L63.864,42.754C63.864,43.232 63.72,43.43 63.387,43.538C63.053,43.646 62.477,43.664 61.532,43.655C61.478,43.466 61.352,43.168 61.244,42.989C62,43.016 62.702,43.006 62.909,42.998C63.107,42.998 63.189,42.935 63.189,42.746L63.189,40.756L59.488,40.756L59.488,40.099L63.189,40.099L63.189,38.64L60.092,38.64L60.092,38.001L63.189,38.001L63.189,36.615C62.198,36.723 61.181,36.786 60.253,36.831C60.227,36.651 60.146,36.39 60.083,36.237C62.207,36.138 64.818,35.904 66.168,35.481L66.672,36.012C65.907,36.246 64.926,36.416 63.864,36.542L63.864,38.001L67.051,38.001L67.051,38.64L63.864,38.64L63.864,40.099L67.555,40.099L67.555,40.756Z" style="fill:white;fill-rule:nonzero;"/>
        </g>
        <g transform="matrix(1.13861,0,0,1.13861,-10.8451,-10.9154)">
            <path d="M67.555,40.756L67.555,40.656L63.764,40.656L63.764,42.754C63.764,42.984 63.728,43.133 63.666,43.231C63.603,43.329 63.51,43.392 63.356,43.442C63.094,43.529 62.633,43.557 61.913,43.557C61.794,43.557 61.667,43.556 61.533,43.555L61.532,43.655L61.628,43.627C61.57,43.427 61.444,43.129 61.33,42.937L61.244,42.989L61.241,43.089C61.615,43.102 61.976,43.107 62.271,43.107C62.574,43.107 62.806,43.102 62.913,43.097L62.909,42.998L62.909,43.098C63.017,43.097 63.112,43.083 63.189,43.018C63.265,42.951 63.289,42.852 63.289,42.746L63.289,40.656L59.588,40.656L59.588,40.199L63.289,40.199L63.289,38.54L60.192,38.54L60.192,38.101L63.289,38.101L63.289,36.503L63.178,36.515C62.191,36.623 61.175,36.686 60.249,36.731L60.253,36.831L60.352,36.816C60.323,36.622 60.241,36.361 60.175,36.199L60.083,36.237L60.087,36.337C62.217,36.237 64.826,36.005 66.198,35.576L66.168,35.481L66.096,35.55L66.6,36.081L66.672,36.012L66.643,35.917C65.888,36.147 64.911,36.318 63.852,36.443L63.764,36.454L63.764,38.101L66.951,38.101L66.951,38.54L63.764,38.54L63.764,40.199L67.455,40.199L67.455,40.756L67.555,40.756L67.555,40.656L67.555,40.756L67.655,40.756L67.655,39.999L63.964,39.999L63.964,38.74L67.151,38.74L67.151,37.901L63.964,37.901L63.964,36.542L63.864,36.542L63.876,36.642C64.941,36.515 65.927,36.344 66.702,36.108L66.856,36.061L66.241,35.412L66.198,35.367L66.139,35.385C64.809,35.803 62.197,36.039 60.078,36.137L59.936,36.143L59.99,36.275C60.05,36.419 60.13,36.68 60.155,36.845L60.168,36.935L60.258,36.93C61.187,36.885 62.206,36.823 63.199,36.714L63.189,36.615L63.089,36.615L63.089,37.901L59.992,37.901L59.992,38.74L63.089,38.74L63.089,39.999L59.388,39.999L59.388,40.856L63.089,40.856L63.089,42.746L63.057,42.867C63.044,42.881 62.999,42.898 62.909,42.898L62.905,42.898C62.803,42.902 62.571,42.907 62.271,42.907C61.978,42.907 61.619,42.902 61.248,42.889L61.064,42.882L61.158,43.04C61.26,43.208 61.386,43.506 61.436,43.682L61.457,43.754L61.531,43.755C61.666,43.756 61.793,43.757 61.913,43.757C62.639,43.756 63.107,43.732 63.418,43.633L63.417,43.633C63.596,43.576 63.742,43.486 63.835,43.338C63.927,43.191 63.964,43.002 63.964,42.754L63.964,40.856L67.655,40.856L67.655,40.756L67.555,40.756Z" style="fill:white;fill-rule:nonzero;"/>
        </g>
        <g transform="matrix(1.13861,0,0,1.13861,-10.8451,-10.9154)">
            <path d="M71.983,36.93C72.956,37.092 74.756,37.056 75.648,36.93L75.648,37.668C74.693,37.767 72.965,37.767 71.993,37.668L71.983,36.93ZM72.335,40.567C72.254,40.891 72.218,41.143 72.218,41.386C72.218,41.791 72.488,42.188 73.712,42.188C74.513,42.188 75.198,42.116 75.918,41.954L75.927,42.709C75.377,42.818 74.63,42.89 73.703,42.89C72.209,42.89 71.543,42.395 71.543,41.557C71.543,41.233 71.606,40.882 71.687,40.504L72.335,40.567ZM70.3,36.246C70.246,36.399 70.165,36.687 70.129,36.849C69.958,37.668 69.697,39.261 69.697,40.261C69.697,40.693 69.715,41.053 69.769,41.486C69.922,41.081 70.12,40.558 70.264,40.207L70.651,40.495C70.426,41.125 70.102,42.071 70.021,42.494C69.994,42.62 69.976,42.79 69.976,42.89L70.003,43.205L69.355,43.249C69.175,42.62 69.031,41.593 69.031,40.387C69.031,39.073 69.319,37.542 69.427,36.813C69.454,36.606 69.49,36.372 69.49,36.183L70.3,36.246Z" style="fill:white;fill-rule:nonzero;"/>
        </g>
        <g transform="matrix(1.13861,0,0,1.13861,-10.8451,-10.9154)">
            <path d="M71.983,36.93L71.967,37.029C72.433,37.106 73.074,37.138 73.719,37.139C74.449,37.139 75.181,37.097 75.662,37.029L75.648,36.93L75.548,36.93L75.548,37.668L75.648,37.668L75.638,37.569C75.166,37.618 74.497,37.642 73.827,37.642C73.157,37.642 72.483,37.618 72.003,37.569L71.993,37.668L72.093,37.667L72.083,36.929L71.983,36.93L71.967,37.029L71.983,36.93L71.883,36.931L71.893,37.67L71.894,37.759L71.983,37.768C72.474,37.818 73.151,37.842 73.827,37.842C74.503,37.842 75.175,37.818 75.658,37.768L75.748,37.759L75.748,36.815L75.634,36.831C75.168,36.897 74.441,36.939 73.719,36.939C73.081,36.939 72.446,36.906 72,36.831L71.882,36.812L71.883,36.931L71.983,36.93ZM72.335,40.567L72.238,40.543C72.156,40.872 72.118,41.133 72.118,41.386C72.115,41.61 72.2,41.855 72.45,42.022C72.698,42.189 73.09,42.287 73.712,42.288C74.519,42.288 75.213,42.215 75.94,42.051L75.918,41.954L75.818,41.955L75.827,42.711L75.927,42.709L75.907,42.611C75.367,42.718 74.625,42.79 73.703,42.79C72.967,42.791 72.444,42.666 72.117,42.454C71.791,42.24 71.645,41.95 71.643,41.557C71.642,41.246 71.704,40.901 71.784,40.525L71.687,40.504L71.677,40.604L72.325,40.666L72.335,40.567L72.238,40.543L72.335,40.567L72.345,40.467L71.696,40.405L71.607,40.396L71.589,40.483C71.507,40.863 71.443,41.22 71.443,41.557C71.44,42.002 71.627,42.378 72.008,42.622C72.387,42.866 72.945,42.99 73.703,42.99C74.636,42.99 75.388,42.918 75.946,42.808L76.028,42.791L76.018,41.952L76.017,41.829L75.896,41.856C75.183,42.016 74.507,42.088 73.712,42.088C73.11,42.089 72.755,41.989 72.562,41.856C72.371,41.724 72.32,41.568 72.318,41.386C72.318,41.153 72.352,40.911 72.432,40.591L72.46,40.478L72.345,40.467L72.335,40.567ZM70.3,36.246L70.206,36.212C70.15,36.372 70.069,36.659 70.031,36.827L70.031,36.829C69.859,37.654 69.597,39.246 69.597,40.261C69.597,40.696 69.615,41.062 69.67,41.498L69.72,41.899L69.863,41.521C70.015,41.116 70.214,40.594 70.357,40.244L70.264,40.207L70.205,40.287L70.592,40.575L70.651,40.495L70.557,40.461C70.331,41.095 70.008,42.036 69.923,42.475L70.021,42.494L69.923,42.473C69.895,42.608 69.876,42.78 69.876,42.89L69.876,42.894L69.895,43.112L69.348,43.15L69.355,43.249L69.451,43.222C69.275,42.605 69.131,41.585 69.131,40.387C69.131,39.086 69.417,37.56 69.526,36.828L69.526,36.826C69.553,36.62 69.59,36.384 69.59,36.183L69.49,36.183L69.482,36.283L70.293,36.345L70.3,36.246L70.206,36.212L70.3,36.246L70.308,36.146L69.497,36.083L69.39,36.075L69.39,36.183C69.39,36.36 69.355,36.592 69.328,36.8L69.427,36.813L69.328,36.798C69.221,37.525 68.931,39.059 68.931,40.387C68.931,41.602 69.075,42.634 69.259,43.277L69.281,43.355L70.01,43.304L70.111,43.297L70.076,42.882L69.976,42.89L70.076,42.89C70.076,42.801 70.094,42.631 70.119,42.514L70.119,42.512C70.197,42.106 70.521,41.156 70.746,40.528L70.77,40.459L70.324,40.126L70.221,40.049L70.172,40.169C70.027,40.522 69.828,41.045 69.676,41.451L69.769,41.486L69.868,41.473C69.815,41.045 69.797,40.69 69.797,40.261C69.796,39.277 70.057,37.683 70.227,36.87L70.129,36.849L70.227,36.871C70.261,36.715 70.343,36.425 70.395,36.279L70.438,36.156L70.308,36.146L70.3,36.246Z" style="fill:white;fill-rule:nonzero;"/>
        </g>
        <g transform="matrix(1.13861,0,0,1.13861,-10.8451,-10.9154)">
            <path d="M81.667,36.012C81.667,37.605 81.874,40.999 85.402,43.097C85.25,43.205 84.979,43.493 84.862,43.655C82.647,42.314 81.693,40.342 81.288,38.64C80.622,40.972 79.488,42.611 77.696,43.664C77.57,43.529 77.272,43.249 77.093,43.133C79.083,42.097 80.19,40.288 80.739,37.767L81.135,37.831C81.072,37.416 81.036,37.02 81.018,36.678L78.803,36.678L78.803,36.012L81.667,36.012Z" style="fill:white;fill-rule:nonzero;"/>
        </g>
        <g transform="matrix(1.13861,0,0,1.13861,-10.8451,-10.9154)">
            <path d="M81.667,36.012L81.567,36.012C81.565,37.611 81.778,41.06 85.351,43.183L85.402,43.097L85.344,43.015C85.174,43.137 84.908,43.422 84.781,43.596L84.862,43.655L84.914,43.569C82.727,42.245 81.787,40.302 81.385,38.617L81.296,38.245L81.191,38.613C80.529,40.928 79.412,42.538 77.645,43.577L77.696,43.664L77.769,43.595C77.636,43.454 77.342,43.177 77.147,43.049L77.093,43.133L77.139,43.222C79.16,42.171 80.286,40.325 80.837,37.788L80.739,37.767L80.723,37.866L81.119,37.929L81.255,37.951L81.234,37.815C81.171,37.405 81.135,37.012 81.118,36.673L81.113,36.578L78.903,36.578L78.903,36.112L81.667,36.112L81.667,36.012L81.567,36.012L81.667,36.012L81.667,35.912L78.703,35.912L78.703,36.778L81.018,36.778L81.018,36.678L80.918,36.683C80.936,37.028 80.972,37.428 81.036,37.846L81.135,37.831L81.151,37.732L80.755,37.668L80.661,37.653L80.641,37.746C80.094,40.25 79.005,42.024 77.047,43.045L76.894,43.124L77.039,43.217C77.203,43.322 77.504,43.603 77.623,43.732L77.677,43.79L77.746,43.75C79.563,42.684 80.714,41.016 81.384,38.668L81.288,38.64L81.19,38.663C81.599,40.382 82.567,42.383 84.81,43.74L84.889,43.788L84.943,43.713C85.05,43.563 85.325,43.272 85.46,43.179L85.586,43.09L85.453,43.011C81.97,40.939 81.768,37.598 81.767,36.012L81.767,35.912L81.667,35.912L81.667,36.012Z" style="fill:white;fill-rule:nonzero;"/>
        </g>
        <g transform="matrix(1.13861,0,0,1.13861,-10.8451,-10.9154)">
            <path d="M94.169,42.278C93.702,42.754 93.143,43.025 92.531,43.025C91.946,43.025 91.541,42.628 91.541,41.89C91.541,40.9 91.874,39.433 91.874,38.569C91.874,38.055 91.613,37.839 91.163,37.839C90.442,37.839 89.362,38.676 88.543,39.559C88.525,39.937 88.516,40.288 88.516,40.603C88.516,41.414 88.516,41.954 88.551,42.754C88.561,42.908 88.579,43.133 88.597,43.294L87.814,43.294C87.823,43.168 87.84,42.908 87.84,42.764C87.849,41.909 87.849,41.467 87.868,40.477C87.868,40.387 87.877,40.27 87.877,40.135C87.444,40.792 86.859,41.647 86.427,42.242L85.977,41.621C86.472,40.999 87.499,39.613 87.949,38.911C87.966,38.623 87.985,38.334 88.002,38.055C87.597,38.1 86.823,38.208 86.265,38.281L86.193,37.533C86.391,37.542 86.562,37.542 86.778,37.524C87.066,37.506 87.588,37.453 88.047,37.38C88.075,36.957 88.092,36.642 88.092,36.542C88.092,36.335 88.102,36.102 88.056,35.876L88.912,35.904C88.867,36.12 88.794,36.623 88.732,37.245L88.777,37.227L89.038,37.542C88.93,37.705 88.777,37.948 88.642,38.164C88.624,38.326 88.615,38.497 88.597,38.667C89.29,38.029 90.433,37.173 91.325,37.173C92.162,37.173 92.585,37.641 92.585,38.371C92.585,39.261 92.252,40.801 92.252,41.702C92.252,42.007 92.396,42.242 92.711,42.242C93.161,42.242 93.638,41.954 94.052,41.503L94.169,42.278Z" style="fill:white;fill-rule:nonzero;"/>
        </g>
        <g transform="matrix(1.13861,0,0,1.13861,-10.8451,-10.9154)">
            <path d="M94.169,42.278L94.098,42.208C93.644,42.669 93.113,42.924 92.531,42.925C91.997,42.917 91.65,42.592 91.641,41.89C91.64,40.918 91.972,39.453 91.974,38.569C91.974,38.296 91.904,38.083 91.757,37.94C91.61,37.797 91.402,37.739 91.163,37.739C90.372,37.749 89.302,38.602 88.469,39.491L88.444,39.518L88.443,39.554C88.425,39.934 88.416,40.286 88.416,40.603C88.416,41.413 88.416,41.956 88.451,42.759L88.451,42.76L88.452,42.761C88.461,42.915 88.479,43.142 88.498,43.306L88.597,43.294L88.597,43.194L87.814,43.194L87.814,43.294L87.914,43.301C87.923,43.174 87.94,42.914 87.94,42.764L87.84,42.764L87.94,42.765C87.949,41.909 87.949,41.468 87.968,40.479L87.968,40.477C87.968,40.393 87.976,40.274 87.977,40.135L87.977,39.801L87.793,40.08C87.361,40.736 86.777,41.59 86.346,42.183L86.427,42.242L86.508,42.183L86.058,41.562L85.977,41.621L86.055,41.683C86.553,41.058 87.579,39.673 88.033,38.965L88.047,38.943L88.049,38.917C88.066,38.629 88.085,38.341 88.102,38.061L88.11,37.943L87.991,37.956C87.583,38.001 86.809,38.109 86.252,38.182L86.265,38.281L86.365,38.271L86.292,37.523L86.193,37.533L86.188,37.633L86.434,37.639C86.546,37.639 86.659,37.635 86.786,37.624L86.778,37.524L86.784,37.624C87.077,37.606 87.6,37.552 88.063,37.479L88.142,37.467L88.147,37.387C88.175,36.962 88.192,36.65 88.192,36.542L88.193,36.351C88.193,36.195 88.189,36.026 88.154,35.856L88.056,35.876L88.053,35.976L88.908,36.004L88.912,35.904L88.814,35.883C88.767,36.107 88.695,36.611 88.632,37.235L88.616,37.397L88.746,37.347L88.961,37.606L89.038,37.542L88.954,37.487C88.846,37.651 88.692,37.894 88.557,38.111L88.545,38.13L88.543,38.152C88.524,38.319 88.515,38.49 88.498,38.657L88.471,38.92L88.665,38.741C89.347,38.107 90.493,37.266 91.325,37.273C92.122,37.285 92.473,37.683 92.485,38.371C92.486,39.242 92.153,40.782 92.151,41.702C92.152,41.87 92.191,42.027 92.284,42.148C92.378,42.269 92.529,42.343 92.711,42.342C93.205,42.34 93.7,42.032 94.126,41.571L94.052,41.503L93.953,41.518L94.071,42.293L94.169,42.278L94.098,42.208L94.169,42.278L94.268,42.263L94.151,41.488L94.12,41.282L93.979,41.436C93.576,41.875 93.117,42.144 92.711,42.142C92.458,42.136 92.362,41.981 92.352,41.702C92.35,40.82 92.683,39.28 92.685,38.371C92.685,37.987 92.572,37.658 92.339,37.427C92.106,37.196 91.761,37.073 91.325,37.073C90.373,37.08 89.233,37.951 88.529,38.594L88.597,38.667L88.697,38.678C88.715,38.503 88.723,38.333 88.741,38.175L88.642,38.164L88.727,38.216C88.861,38.001 89.015,37.758 89.121,37.598L89.162,37.536L88.854,37.163L88.808,37.108L88.696,37.151L88.732,37.245L88.831,37.255C88.894,36.636 88.966,36.132 89.01,35.924L89.034,35.808L88.059,35.776L87.933,35.772L87.958,35.896C87.988,36.043 87.993,36.199 87.993,36.351L87.992,36.542C87.992,36.634 87.975,36.951 87.948,37.374L88.047,37.38L88.032,37.282C87.577,37.353 87.055,37.407 86.772,37.424L86.769,37.424C86.647,37.435 86.54,37.439 86.434,37.439L86.198,37.433L86.082,37.427L86.166,38.29L86.176,38.393L86.278,38.38C86.836,38.308 87.611,38.199 88.013,38.155L88.002,38.055L87.903,38.049C87.885,38.328 87.867,38.616 87.849,38.905L87.949,38.911L87.865,38.857C87.419,39.552 86.391,40.941 85.899,41.558L85.851,41.618L86.346,42.3L86.427,42.412L86.508,42.3C86.941,41.704 87.527,40.849 87.96,40.19L87.877,40.135L87.776,40.135C87.777,40.266 87.768,40.381 87.768,40.477L87.868,40.477L87.768,40.475C87.749,41.466 87.749,41.908 87.74,42.763L87.74,42.764C87.74,42.901 87.723,43.162 87.714,43.287L87.707,43.394L88.709,43.394L88.697,43.283C88.678,43.125 88.661,42.9 88.651,42.748L88.551,42.754L88.651,42.75C88.616,41.951 88.616,41.414 88.616,40.603C88.616,40.289 88.625,39.94 88.642,39.564L88.543,39.559L88.616,39.627C89.422,38.751 90.512,37.93 91.163,37.939C91.373,37.94 91.521,37.989 91.617,38.083C91.713,38.177 91.773,38.328 91.774,38.569C91.775,39.413 91.442,40.882 91.441,41.89C91.44,42.277 91.547,42.588 91.742,42.802C91.937,43.016 92.216,43.126 92.531,43.125C93.173,43.125 93.759,42.839 94.241,42.348L94.276,42.312L94.268,42.263L94.169,42.278Z" style="fill:white;fill-rule:nonzero;"/>
        </g>
        <g transform="matrix(1.13861,0,0,1.13861,-10.8451,-10.9154)">
            <path d="M98.58,41.215C98.292,41.152 98.003,41.125 97.707,41.125C96.788,41.125 96.266,41.44 96.266,41.926C96.266,42.421 96.761,42.692 97.617,42.692C98.273,42.692 98.588,42.385 98.588,41.774C98.588,41.629 98.58,41.44 98.58,41.215ZM99.192,38.469C99.192,39.054 99.237,39.918 99.282,40.693C100.426,41.008 101.407,41.629 102.055,42.214L101.623,42.88C101.056,42.304 100.236,41.738 99.309,41.414C99.318,41.647 99.327,41.845 99.327,42.007C99.327,42.737 98.877,43.367 97.688,43.367C96.464,43.367 95.554,42.971 95.554,41.954C95.554,41.152 96.257,40.486 97.796,40.486C98.048,40.486 98.3,40.504 98.552,40.54C98.516,39.82 98.481,39 98.481,38.469C98.481,37.957 98.481,37.218 98.471,36.84C98.462,36.516 98.435,36.128 98.4,35.957L99.264,35.957C99.228,36.147 99.201,36.57 99.192,36.84C99.183,37.083 99.192,37.398 99.192,37.749C99.903,37.731 101.028,37.686 101.83,37.579L101.857,38.262C101.064,38.334 99.921,38.388 99.192,38.407L99.192,38.469Z" style="fill:white;fill-rule:nonzero;"/>
        </g>
        <g transform="matrix(1.13861,0,0,1.13861,-10.8451,-10.9154)">
            <path d="M98.58,41.215L98.601,41.118C98.305,41.052 98.009,41.025 97.707,41.025C97.236,41.026 96.86,41.105 96.592,41.257C96.325,41.406 96.164,41.645 96.166,41.926C96.164,42.209 96.317,42.442 96.572,42.582C96.826,42.724 97.179,42.791 97.617,42.792C97.959,42.792 98.231,42.712 98.418,42.535C98.604,42.357 98.689,42.095 98.688,41.774C98.688,41.626 98.68,41.437 98.68,41.215L98.68,41.135L98.601,41.118L98.58,41.215L98.48,41.215C98.48,41.442 98.488,41.633 98.488,41.774C98.488,42.064 98.415,42.261 98.28,42.39C98.145,42.519 97.931,42.592 97.617,42.592C97.199,42.592 96.877,42.524 96.67,42.408C96.463,42.288 96.369,42.139 96.366,41.926C96.368,41.721 96.469,41.56 96.691,41.43C96.914,41.303 97.258,41.225 97.707,41.225C97.998,41.225 98.278,41.251 98.558,41.313L98.58,41.215L98.48,41.215L98.58,41.215ZM99.292,38.469L99.092,38.469C99.092,39.059 99.137,39.924 99.182,40.699L99.186,40.77L99.255,40.789C100.381,41.099 101.351,41.713 101.988,42.289L102.055,42.214L101.971,42.16L101.539,42.826L101.623,42.88L101.694,42.81C101.116,42.223 100.286,41.65 99.342,41.319L99.204,41.271L99.209,41.417C99.218,41.651 99.227,41.849 99.227,42.007C99.216,42.692 98.84,43.255 97.688,43.267C97.087,43.267 96.569,43.168 96.213,42.956C95.859,42.742 95.657,42.432 95.654,41.954C95.656,41.222 96.28,40.594 97.796,40.586C98.043,40.586 98.291,40.604 98.538,40.639L98.658,40.657L98.652,40.535C98.616,39.816 98.581,38.996 98.581,38.469C98.581,37.956 98.581,37.218 98.571,36.838C98.562,36.509 98.536,36.123 98.498,35.937L98.4,35.957L98.4,36.057L99.264,36.057L99.264,35.957L99.166,35.939C99.128,36.142 99.101,36.562 99.092,36.837C99.089,36.92 99.088,37.01 99.088,37.106C99.088,37.299 99.092,37.516 99.092,37.749L99.092,37.852L99.195,37.849C99.907,37.831 101.034,37.786 101.843,37.678L101.83,37.579L101.73,37.583L101.757,38.266L101.857,38.262L101.848,38.163C101.059,38.235 99.917,38.288 99.189,38.307L99.092,38.309L99.092,38.469L99.292,38.469L99.292,38.407L99.192,38.407L99.194,38.507C99.926,38.488 101.07,38.434 101.867,38.362L101.961,38.353L101.93,37.575L101.926,37.465L101.817,37.479C101.023,37.586 99.898,37.631 99.189,37.65L99.192,37.749L99.292,37.749C99.292,37.514 99.288,37.296 99.288,37.106C99.288,37.011 99.289,36.923 99.292,36.844L99.292,36.843L99.292,36.844C99.3,36.577 99.329,36.152 99.362,35.976L99.385,35.857L98.277,35.857L98.302,35.978C98.335,36.133 98.363,36.524 98.371,36.843C98.381,37.218 98.381,37.957 98.381,38.469C98.381,39.004 98.416,39.824 98.452,40.545L98.552,40.54L98.566,40.442C98.31,40.405 98.053,40.386 97.796,40.386C97.013,40.386 96.431,40.555 96.04,40.838C95.647,41.121 95.453,41.523 95.454,41.954C95.452,42.493 95.705,42.89 96.111,43.128C96.517,43.368 97.066,43.466 97.688,43.467C98.299,43.467 98.738,43.304 99.022,43.033C99.307,42.762 99.427,42.392 99.427,42.007C99.427,41.842 99.418,41.643 99.409,41.41L99.309,41.414L99.276,41.508C100.186,41.826 100.995,42.385 101.552,42.95L101.639,43.039L102.139,42.269L102.185,42.197L102.122,42.14C101.463,41.545 100.471,40.917 99.308,40.596L99.282,40.693L99.382,40.687C99.337,39.913 99.292,39.049 99.292,38.469Z" style="fill:white;fill-rule:nonzero;"/>
        </g>
        <g transform="matrix(1.13861,0,0,1.13861,-10.8451,-10.9154)">
            <path d="M108.986,36.38L108.879,37.074C107.888,37.011 106.088,36.831 105.079,36.651L105.196,35.966C106.178,36.192 108.113,36.372 108.986,36.38ZM107.411,38.704C106.385,38.704 105.512,39.009 104.98,39.163C104.71,39.235 104.449,39.342 104.233,39.423L104.008,38.595C104.251,38.569 104.558,38.514 104.818,38.46C105.448,38.317 106.466,38.029 107.483,38.029C108.752,38.029 109.697,38.74 109.697,40.009C109.697,41.945 107.979,43.042 105.664,43.385L105.241,42.701C107.402,42.43 108.933,41.584 108.933,39.982C108.933,39.235 108.329,38.704 107.411,38.704Z" style="fill:white;fill-rule:nonzero;"/>
        </g>
        <g transform="matrix(1.13861,0,0,1.13861,-10.8451,-10.9154)">
            <path d="M108.986,36.38L108.888,36.365L108.78,37.058L108.879,37.074L108.885,36.974C107.898,36.912 106.098,36.731 105.097,36.552L105.079,36.651L105.178,36.668L105.295,35.983L105.196,35.966L105.174,36.064C106.17,36.292 108.102,36.471 108.985,36.48L108.986,36.38L108.888,36.365L108.986,36.38L108.987,36.28C108.125,36.272 106.186,36.092 105.219,35.869L105.116,35.845L104.981,36.634L104.964,36.732L105.062,36.749C106.078,36.93 107.877,37.111 108.873,37.173L108.964,37.179L109.085,36.396L109.103,36.281L108.987,36.28L108.986,36.38ZM107.411,38.804L107.411,38.604C106.366,38.604 105.48,38.915 104.953,39.066L104.98,39.163L104.955,39.066C104.676,39.14 104.412,39.25 104.198,39.33L104.233,39.423L104.33,39.397L104.104,38.569L104.008,38.595L104.019,38.695C104.267,38.668 104.576,38.612 104.839,38.558L104.841,38.558C105.474,38.413 106.484,38.128 107.483,38.129C108.717,38.137 109.592,38.798 109.597,40.009C109.596,40.946 109.186,41.67 108.487,42.216C107.788,42.76 106.795,43.117 105.649,43.286L105.664,43.385L105.749,43.333L105.326,42.648L105.241,42.701L105.254,42.8C106.344,42.663 107.28,42.382 107.954,41.923C108.627,41.466 109.034,40.817 109.033,39.982C109.033,39.581 108.868,39.23 108.581,38.986C108.294,38.742 107.889,38.604 107.411,38.604L107.411,38.804C108.293,38.81 108.83,39.296 108.833,39.982C108.831,40.75 108.473,41.324 107.841,41.758C107.209,42.19 106.3,42.468 105.229,42.601L105.074,42.621L105.579,43.438L105.614,43.494L105.679,43.484C106.847,43.311 107.871,42.947 108.61,42.373C109.349,41.801 109.799,41.008 109.797,40.009C109.798,39.35 109.549,38.822 109.131,38.467C108.714,38.112 108.136,37.929 107.483,37.929C106.448,37.929 105.422,38.221 104.796,38.363L104.818,38.46L104.798,38.362C104.54,38.416 104.235,38.47 103.997,38.496L103.881,38.508L104.137,39.45L104.166,39.556L104.269,39.517C104.486,39.435 104.744,39.329 105.006,39.259L105.008,39.259C105.544,39.104 106.404,38.804 107.411,38.804Z" style="fill:white;fill-rule:nonzero;"/>
        </g>
    </g>
    <defs>
        <linearGradient id="_Linear1" x1="0" y1="0" x2="1" y2="0" gradientUnits="userSpaceOnUse" gradientTransform="matrix(-16.7825,-16.7825,-16.7825,16.7825,31.7998,18.7097)"><stop offset="0" style="stop-color:rgb(0,160,255);stop-opacity:1"/><stop offset="1" style="stop-color:rgb(0,226,255);stop-opacity:1"/></linearGradient>
        <linearGradient id="_Linear2" x1="0" y1="0" x2="1" y2="0" gradientUnits="userSpaceOnUse" gradientTransform="matrix(-24.197,2.17272e-09,2.17272e-09,24.197,43.8344,30.0014)"><stop offset="0" style="stop-color:rgb(255,223,0);stop-opacity:1"/><stop offset="1" style="stop-color:rgb(255,156,0);stop-opacity:1"/></linearGradient>
        <linearGradient id="_Linear3" x1="0" y1="0" x2="1" y2="0" gradientUnits="userSpaceOnUse" gradientTransform="matrix(-22.7583,-22.7583,-22.7583,22.7583,34.827,32.2961)"><stop offset="0" style="stop-color:rgb(255,58,68);stop-opacity:1"/><stop offset="1" style="stop-color:rgb(195,17,98);stop-opacity:1"/></linearGradient>
        <linearGradient id="_Linear4" x1="0" y1="0" x2="1" y2="0" gradientUnits="userSpaceOnUse" gradientTransform="matrix(10.1625,-10.1625,-10.1625,-10.1625,17.2973,10.1762)"><stop offset="0" style="stop-color:rgb(49,160,112);stop-opacity:1"/><stop offset="1" style="stop-color:rgb(0,239,117);stop-opacity:1"/></linearGradient>
        <linearGradient id="_Linear5" x1="0" y1="0" x2="1" y2="0" gradientUnits="userSpaceOnUse" gradientTransform="matrix(-24.197,2.17272e-09,2.17272e-09,24.197,43.8344,30.0014)"><stop offset="0" style="stop-color:rgb(204,179,0);stop-opacity:1"/><stop offset="1" style="stop-color:rgb(204,124,0);stop-opacity:1"/></linearGradient>
        <linearGradient id="_Linear6" x1="0" y1="0" x2="1" y2="0" gradientUnits="userSpaceOnUse" gradientTransform="matrix(-22.7583,-22.7583,-22.7583,22.7583,34.827,32.2961)"><stop offset="0" style="stop-color:rgb(204,45,54);stop-opacity:1"/><stop offset="1" style="stop-color:rgb(156,14,77);stop-opacity:1"/></linearGradient>
        <linearGradient id="_Linear7" x1="0" y1="0" x2="1" y2="0" gradientUnits="userSpaceOnUse" gradientTransform="matrix(-16.7825,-16.7825,-16.7825,16.7825,31.7998,18.7097)"><stop offset="0" style="stop-color:rgb(0,140,223);stop-opacity:1"/><stop offset="1" style="stop-color:rgb(0,198,223);stop-opacity:1"/></linearGradient>
        <linearGradient id="_Linear8" x1="0" y1="0" x2="1" y2="0" gradientUnits="userSpaceOnUse" gradientTransform="matrix(-22.7583,-22.7583,-22.7583,22.7583,34.827,32.2961)"><stop offset="0" style="stop-color:rgb(223,51,59);stop-opacity:1"/><stop offset="1" style="stop-color:rgb(170,14,86);stop-opacity:1"/></linearGradient>
        <linearGradient id="_Linear9" x1="0" y1="0" x2="1" y2="0" gradientUnits="userSpaceOnUse" gradientTransform="matrix(-24.197,2.17272e-09,2.17272e-09,24.197,43.8344,30.0014)"><stop offset="0" style="stop-color:rgb(223,196,0);stop-opacity:1"/><stop offset="1" style="stop-color:rgb(223,137,0);stop-opacity:1"/></linearGradient>
        <linearGradient id="_Linear10" x1="0" y1="0" x2="1" y2="0" gradientUnits="userSpaceOnUse" gradientTransform="matrix(-24.197,2.17272e-09,2.17272e-09,24.197,43.8344,30.0014)"><stop offset="0" style="stop-color:rgb(255,232,63);stop-opacity:1"/><stop offset="1" style="stop-color:rgb(255,181,63);stop-opacity:1"/></linearGradient>
        <linearGradient id="_Linear11" x1="0" y1="0" x2="1" y2="0" gradientUnits="userSpaceOnUse" gradientTransform="matrix(-16.7825,-16.7825,-16.7825,16.7825,31.7998,18.7097)"><stop offset="0" style="stop-color:rgb(63,184,255);stop-opacity:1"/><stop offset="1" style="stop-color:rgb(63,233,255);stop-opacity:1"/></linearGradient>
        <linearGradient id="_Linear12" x1="0" y1="0" x2="1" y2="0" gradientUnits="userSpaceOnUse" gradientTransform="matrix(10.1625,-10.1625,-10.1625,-10.1625,17.2973,10.1762)"><stop offset="0" style="stop-color:rgb(100,184,149);stop-opacity:1"/><stop offset="1" style="stop-color:rgb(63,244,151);stop-opacity:1"/></linearGradient>
    </defs>
</svg>
