module gitlab.com/kuftachev.a/paack-challenge

go 1.17

require (
	github.com/go-ozzo/ozzo-dbx v1.5.0
	github.com/go-ozzo/ozzo-routing v2.1.4+incompatible
	github.com/jackc/pgx v3.6.2+incompatible
	github.com/spf13/viper v1.8.1
	go.uber.org/zap v1.19.0
)

require (
	github.com/fsnotify/fsnotify v1.4.9 // indirect
	github.com/golang/gddo v0.0.0-20210115222349-20d68f94ee1f // indirect
	github.com/hashicorp/hcl v1.0.0 // indirect
	github.com/magiconair/properties v1.8.5 // indirect
	github.com/mitchellh/mapstructure v1.4.1 // indirect
	github.com/pelletier/go-toml v1.9.3 // indirect
	github.com/pkg/errors v0.8.1 // indirect
	github.com/spf13/afero v1.6.0 // indirect
	github.com/spf13/cast v1.3.1 // indirect
	github.com/spf13/jwalterweatherman v1.1.0 // indirect
	github.com/spf13/pflag v1.0.5 // indirect
	github.com/subosito/gotenv v1.2.0 // indirect
	go.uber.org/atomic v1.7.0 // indirect
	go.uber.org/multierr v1.6.0 // indirect
	golang.org/x/crypto v0.0.0-20200622213623-75b288015ac9 // indirect
	golang.org/x/sys v0.0.0-20210510120138-977fb7262007 // indirect
	golang.org/x/text v0.3.5 // indirect
	gopkg.in/ini.v1 v1.62.0 // indirect
	gopkg.in/yaml.v2 v2.4.0 // indirect
)
