{
    "9c067be6-b1c2-4846-bd3d-249fc41b1144": [
        20
    ],
    "9c067be6-b2b1-4928-838b-c9dd4e1b5318": [
        20
    ],
    "9c067be6-b35d-4453-87ee-2caae7273803": [
        -100
    ],
    "9c067be6-b421-4d7a-9d0e-4e517623d72f": [
        30
    ],
    "9c067be6-b4ea-4d3d-b539-295e4b1d46c4": [
        0
    ]
}