{
	"kind" : "toolchains",
	"toolchains" : 
	[
		{
			"compiler" : 
			{
				"id" : "GNU",
				"implicit" : 
				{
					"includeDirectories" : [],
					"linkDirectories" : [],
					"linkFrameworkDirectories" : [],
					"linkLibraries" : []
				},
				"path" : "D:/Games/CLion/bin/mingw/bin/gcc.exe",
				"version" : "11.2.0"
			},
			"language" : "C",
			"sourceFileExtensions" : 
			[
				"c",
				"m"
			]
		},
		{
			"compiler" : 
			{
				"implicit" : {},
				"path" : "D:/Games/CLion/bin/mingw/bin/windres.exe"
			},
			"language" : "RC",
			"sourceFileExtensions" : 
			[
				"rc",
				"RC"
			]
		}
	],
	"version" : 
	{
		"major" : 1,
		"minor" : 0
	}
}
