{
	"cmake" : 
	{
		"generator" : 
		{
			"multiConfig" : false,
			"name" : "Ninja"
		},
		"paths" : 
		{
			"cmake" : "D:/Games/CLion/bin/cmake/win/bin/cmake.exe",
			"cpack" : "D:/Games/CLion/bin/cmake/win/bin/cpack.exe",
			"ctest" : "D:/Games/CLion/bin/cmake/win/bin/ctest.exe",
			"root" : "D:/Games/CLion/bin/cmake/win/share/cmake-3.21"
		},
		"version" : 
		{
			"isDirty" : false,
			"major" : 3,
			"minor" : 21,
			"patch" : 1,
			"string" : "3.21.1",
			"suffix" : ""
		}
	},
	"objects" : 
	[
		{
			"jsonFile" : "codemodel-v2-67bab2019ab8c179ee70.json",
			"kind" : "codemodel",
			"version" : 
			{
				"major" : 2,
				"minor" : 3
			}
		},
		{
			"jsonFile" : "cache-v2-7e76c7288c588589ed84.json",
			"kind" : "cache",
			"version" : 
			{
				"major" : 2,
				"minor" : 0
			}
		},
		{
			"jsonFile" : "cmakeFiles-v1-77dfe3793790213d730e.json",
			"kind" : "cmakeFiles",
			"version" : 
			{
				"major" : 1,
				"minor" : 0
			}
		},
		{
			"jsonFile" : "toolchains-v1-bdac6de4a59e04c40368.json",
			"kind" : "toolchains",
			"version" : 
			{
				"major" : 1,
				"minor" : 0
			}
		}
	],
	"reply" : 
	{
		"cache-v2" : 
		{
			"jsonFile" : "cache-v2-7e76c7288c588589ed84.json",
			"kind" : "cache",
			"version" : 
			{
				"major" : 2,
				"minor" : 0
			}
		},
		"cmakeFiles-v1" : 
		{
			"jsonFile" : "cmakeFiles-v1-77dfe3793790213d730e.json",
			"kind" : "cmakeFiles",
			"version" : 
			{
				"major" : 1,
				"minor" : 0
			}
		},
		"codemodel-v2" : 
		{
			"jsonFile" : "codemodel-v2-67bab2019ab8c179ee70.json",
			"kind" : "codemodel",
			"version" : 
			{
				"major" : 2,
				"minor" : 3
			}
		},
		"toolchains-v1" : 
		{
			"jsonFile" : "toolchains-v1-bdac6de4a59e04c40368.json",
			"kind" : "toolchains",
			"version" : 
			{
				"major" : 1,
				"minor" : 0
			}
		}
	}
}
