{
	"artifacts" : 
	[
		{
			"path" : "CProject.exe"
		},
		{
			"path" : "CProject.pdb"
		}
	],
	"backtrace" : 1,
	"backtraceGraph" : 
	{
		"commands" : 
		[
			"add_executable"
		],
		"files" : 
		[
			"CMakeLists.txt"
		],
		"nodes" : 
		[
			{
				"file" : 0
			},
			{
				"command" : 0,
				"file" : 0,
				"line" : 6,
				"parent" : 0
			}
		]
	},
	"compileGroups" : 
	[
		{
			"compileCommandFragments" : 
			[
				{
					"fragment" : "-g"
				},
				{
					"fragment" : "-std=gnu99"
				}
			],
			"language" : "C",
			"languageStandard" : 
			{
				"backtraces" : 
				[
					1
				],
				"standard" : "99"
			},
			"sourceIndexes" : 
			[
				0,
				2,
				4,
				5
			]
		}
	],
	"id" : "CProject::@6890427a1f51a3e7e1df",
	"link" : 
	{
		"commandFragments" : 
		[
			{
				"fragment" : "-g",
				"role" : "flags"
			},
			{
				"fragment" : "",
				"role" : "flags"
			},
			{
				"fragment" : "-lkernel32 -luser32 -lgdi32 -lwinspool -lshell32 -lole32 -loleaut32 -luuid -lcomdlg32 -ladvapi32",
				"role" : "libraries"
			}
		],
		"language" : "C"
	},
	"name" : "CProject",
	"nameOnDisk" : "CProject.exe",
	"paths" : 
	{
		"build" : ".",
		"source" : "."
	},
	"sourceGroups" : 
	[
		{
			"name" : "Source Files",
			"sourceIndexes" : 
			[
				0,
				2,
				4,
				5
			]
		},
		{
			"name" : "Header Files",
			"sourceIndexes" : 
			[
				1,
				3,
				6
			]
		}
	],
	"sources" : 
	[
		{
			"backtrace" : 1,
			"compileGroupIndex" : 0,
			"path" : "main.c",
			"sourceGroupIndex" : 0
		},
		{
			"backtrace" : 1,
			"path" : "Arithmetics.h",
			"sourceGroupIndex" : 1
		},
		{
			"backtrace" : 1,
			"compileGroupIndex" : 0,
			"path" : "Arithmetics.c",
			"sourceGroupIndex" : 0
		},
		{
			"backtrace" : 1,
			"path" : "vector.h",
			"sourceGroupIndex" : 1
		},
		{
			"backtrace" : 1,
			"compileGroupIndex" : 0,
			"path" : "vector.c",
			"sourceGroupIndex" : 0
		},
		{
			"backtrace" : 1,
			"compileGroupIndex" : 0,
			"path" : "Console_Menu_Functions.c",
			"sourceGroupIndex" : 0
		},
		{
			"backtrace" : 1,
			"path" : "Console_Menu_Functions.h",
			"sourceGroupIndex" : 1
		}
	],
	"type" : "EXECUTABLE"
}
