<svg width="10" height="16" viewBox="0 0 10 16" fill="none" xmlns="http://www.w3.org/2000/svg">
<path d="M3.00371 15.7296V8.71844H0.514648V5.93233H3.00371V3.73713C3.00371 1.3521 4.54842 0.0539551 6.80383 0.0539551C7.88448 0.0539551 8.81261 0.130496 9.08196 0.164175V2.65636H7.51777C6.29109 2.65636 6.05419 3.20746 6.05419 4.01268V5.93233H8.82234L8.44265 8.71844H6.05419V15.7296" fill="white"/>
<mask id="mask0" mask-type="alpha" maskUnits="userSpaceOnUse" x="0" y="0" width="10" height="16">
<path d="M3.00371 15.7296V8.71844H0.514648V5.93233H3.00371V3.73713C3.00371 1.3521 4.54842 0.0539551 6.80383 0.0539551C7.88448 0.0539551 8.81261 0.130496 9.08196 0.164175V2.65636H7.51777C6.29109 2.65636 6.05419 3.20746 6.05419 4.01268V5.93233H8.82234L8.44265 8.71844H6.05419V15.7296" fill="white"/>
</mask>
<g mask="url(#mask0)">
</g>
</svg>
