<?xml version="1.0" encoding="utf-8"?>
<!-- Generator: Adobe Illustrator 25.0.0, SVG Export Plug-In . SVG Version: 6.00 Build 0)  -->
<svg version="1.1" id="Capa_1" xmlns="http://www.w3.org/2000/svg" xmlns:xlink="http://www.w3.org/1999/xlink" x="0px" y="0px"
	 viewBox="0 0 151.6 134.4" style="enable-background:new 0 0 151.6 134.4;" xml:space="preserve">
<style type="text/css">
	.st0{fill:#F6ECE4;}
	.st1{fill-rule:evenodd;clip-rule:evenodd;fill:#F6ECE4;}
</style>
<path id="path1262" class="st0" d="M31.2,134.4c-1.4-0.2-2.7-0.6-3.9-1.2c-0.1-0.1-0.2-0.2-0.4-0.2c-0.8-0.6-1.5-1.3-2-2.1
	c0-0.1-0.1-0.1-0.1-0.1c-0.2-0.3-0.4-0.6-0.4-0.9c0-0.2-0.1-0.6-0.2-0.9C24,127.9,24,127,24,126c0-1.3,0-2.5-0.1-3.8
	c0-0.1,0-0.6-0.1-1.1c0-1.2-0.1-2.5-0.4-3.7c-0.1-0.3-0.3-0.6-0.4-0.9c-0.1-0.2-0.2-0.4-0.4-0.7c0-0.1-0.1-0.2-0.3-0.3
	c-0.2-0.1-0.3-0.1-0.4-0.2c-0.1-0.1-0.2-0.1-0.3-0.2c-0.1-0.1-0.2-0.2-0.3-0.3c-0.1-0.2-0.1-0.2-0.1-0.4c0-0.1,0.1-0.1,0.1-0.2
	l1-0.1c0.5,0,1-0.1,1-0.1s4.8-0.1,5.9,0h0.6l0.1,0.2c0.1,0.1,0.1,0.2,0.1,0.4c0,0.1,0,0.1,0,0.2c-0.3,0.1-0.7,0.2-1,0.2
	c-1.2,0.2-1.3,0.2-1.5,0.5c-0.6,0.5-0.7,0.9-0.9,2.2c-0.2,1.5-0.3,3-0.3,4.6c-0.1,2,0.1,3.9,0.4,5.9c0,0.6,0.3,1.2,0.7,1.7
	c0.4,0.5,0.9,0.9,1.4,1.3l0.4,0.3c0.1,0.1,0.3,0.2,0.5,0.2c0.2,0,0.5,0.1,0.7,0.1c0.4,0.1,0.9,0.1,1.3,0c0.3,0,0.6-0.1,0.9-0.1
	c0.5,0,1-0.1,1.4-0.2c0.4-0.1,0.7-0.2,1.1-0.3c0.6-0.4,1.1-0.9,1.4-1.5c0.4-0.6,0.7-1.3,0.9-2c0-0.2,0.1-0.5,0.2-0.7
	c0.1-0.5,0.2-1,0.2-1.5c0-2.3-0.1-7.3-0.1-7.6s0-0.4,0-0.6c0-0.4-0.2-0.8-0.4-1.1c-0.1-0.1-0.2-0.3-0.3-0.3
	c-0.3-0.2-0.6-0.4-0.8-0.6c-0.1-0.1-0.2-0.1-0.3-0.2c-0.5-0.1-1.5-0.4-1.6-0.4s-0.1-0.1,0-0.3c0-0.1,0.1-0.2,0.2-0.3
	c0.1-0.1,0.2-0.1,1.2-0.1h4.2H43l0.2,0.2c0.2,0.2,0.2,0.4,0.1,0.6c-0.1,0.2-0.4,0.3-0.8,0.4c-0.2,0-0.5,0.1-0.7,0.2
	c-0.6,0.3-1,0.9-1.2,1.5c-0.1,1.1-0.2,2.2-0.1,3.3c0.1,1.3,0.1,4.3,0,5.4c0,1.2-0.2,3.1-0.3,3.6c0,0.3-0.2,0.6-0.4,0.8
	c-0.1,0.1-0.1,0.1-0.1,0.2c0,0.1-0.1,0.2-0.1,0.2c-0.1,0-0.1,0.1-0.1,0.2c-0.2,0.3-0.4,0.6-0.7,0.8c-1,0.9-2.1,1.6-3.3,2.1
	c-0.7,0.3-1.4,0.5-2.2,0.6c-0.7,0.1-1.3,0.1-2,0.1L31.2,134.4z M65.8,134.3c-0.3-0.1-0.5-0.1-0.6-0.3c-0.3-0.5,0-0.7,1.1-0.9
	c0.3,0,0.6-0.1,0.8-0.2c0.1-0.1,0.3-0.2,0.4-0.3c0.2-0.1,0.3-0.2,0.4-0.6s0.2-3.5,0.2-6.2c0-1.2,0-2.5,0-2.9s0-1.8,0-3
	c0.1-1.1,0-2.3-0.3-3.4c0-0.3-0.2-0.6-0.5-0.8c-0.3-0.3-0.8-0.5-1.2-0.4c-0.5,0-0.7-0.1-0.8-0.2c-0.1-0.2-0.1-0.4,0.1-0.6
	c0.3-0.3,0.2-0.3,3.6-0.3c3.8,0,4.2,0,5.9,0.6c0.1,0,0.2,0.1,0.3,0.1c0.4,0.1,0.8,0.2,1.2,0.4l0.6,0.2c0.2,0.1,0.3,0.2,0.5,0.3
	l0.3,0.2c0.4,0.2,0.7,0.5,1,0.8c0.6,0.6,1,1.3,1.1,2.1c0.2,1,0.2,2.1-0.1,3.1c-0.2,0.4-0.4,0.8-0.7,1.2c-0.4,0.3-0.8,0.6-1.3,0.9
	c-0.2,0.1-0.4,0.2-0.6,0.3c-0.1,0.1-0.2,0.1-0.3,0.2c-0.1,0-0.1,0-0.2,0.1c-0.1,0.1-0.1,0.1-0.2,0.1c-0.1,0-0.1,0-0.2,0.1
	c-0.1,0.1-0.1,0.1,0.1,0.2c0.4,0.1,1,0.7,1.8,1.8c0.2,0.2,0.4,0.5,0.5,0.6c0.2,0.2,0.3,0.3,0.4,0.5c0.1,0.2,0.2,0.3,0.4,0.4
	c0.5,0.6,0.9,1.3,1.3,1.9c0.2,0.3,0.4,0.6,0.4,0.7l0.2,0.3c0.4,0.4,0.7,0.8,1.2,1.1c0.2,0.2,0.5,0.3,0.8,0.4
	c0.4,0.1,0.9,0.2,1.2,0.5c0.1,0.2,0.1,0.5,0,0.7c-0.5,0.2-1.1,0.2-1.6,0.2h-0.6c-0.1,0-0.2,0-0.3-0.1c-0.2,0-0.3-0.1-0.5-0.1
	c-0.7-0.2-1.4-0.6-1.9-1.2c-0.6-0.5-1.1-1.1-1.5-1.8c-0.2-0.3-0.3-0.5-0.5-0.7c-0.2-0.3-0.4-0.5-0.6-0.8c-0.1-0.3-0.3-0.5-0.5-0.7
	c-0.1-0.1-0.2-0.3-0.2-0.3c-0.4-0.7-0.9-1.4-1.6-1.9c-0.3-0.3-0.5-0.4-0.6-0.4c-0.1,0-0.2,0-0.3-0.1c-0.1-0.1-0.2-0.1-1-0.1
	c-0.4,0-0.7,0-1.1,0l-0.5,0.1c-0.2,0-0.3,0.1-0.5,0.2l-0.2,0.1v0.7c0,0.4,0,1,0,1.3c0,1.1,0,2.3,0.2,3.4c0.1,0.7,0.2,0.9,0.7,1
	c0.6,0.1,1.3,0.1,1.9,0.1c0.2,0,0.5,0.1,0.7,0.2c0.3,0.1,0.5,0.4,0.4,0.7c-0.1,0.2-0.2,0.3-0.4,0.4c-0.5,0.1-1,0.1-1.5,0
	c-2.3-0.1-4.4-0.1-4.7,0c-0.4,0-0.7,0.1-1.1,0.1h-0.9C66,134.3,65.9,134.3,65.8,134.3L65.8,134.3z M74,123.3
	c0.6-0.1,1.2-0.3,1.8-0.6c0.4-0.2,0.8-0.4,1-0.8c0.3-0.5,0.4-1.2,0.2-1.8c-0.3-1.4-0.5-1.9-0.8-2.2c-0.1-0.1-0.1-0.1-0.2-0.2
	c0-0.2-0.2-0.3-0.4-0.4c-0.1,0-0.3-0.1-0.4-0.2c-0.2-0.2-0.5-0.3-0.8-0.3c-0.1,0-0.3-0.1-0.4-0.1c-0.2-0.1-0.4-0.1-0.7-0.2l-0.9-0.2
	c-0.3-0.1-0.5-0.1-0.8-0.1c-0.2,0-0.3,0-0.5-0.1c-0.2-0.1-0.2,0-0.2,0.9c0,0.4,0,2,0,3.6v2.8h0.2c0.2,0,0.3,0,0.5,0
	c0.2,0,0.4,0,0.6,0c0.6,0,1.2,0,1.8-0.1L74,123.3z M114.5,134.2c-0.2,0-1.9,0-4,0c-1.3,0.1-2.6,0.1-3.8-0.1
	c-0.2-0.1-0.4-0.3-0.4-0.4s0-0.1-0.2,0.1s-0.2,0.1-0.7,0.2l-1,0.1c-0.7,0.1-3.5,0.1-4.7,0c-0.5-0.1-1-0.1-1.5,0
	c-0.6,0.1-0.8,0.1-0.9-0.1s0-0.3,0.3-0.5l0.4-0.2c0.1-0.1,0.2-0.1,0.3-0.1c0.3-0.1,0.5-0.2,0.7-0.3c0.6-0.3,1.2-0.7,1.2-1
	c-0.1-0.3-0.2-0.6-0.4-0.9c-0.2-0.4-0.4-1-0.6-1.4c-0.1-0.5-0.3-0.9-0.5-1.4c-0.8-0.1-1.6-0.1-2.4,0c-1,0.1-1.9,0.1-2.9,0
	c-0.3,0-0.6-0.1-0.9-0.1H92l-0.3,0.2c-0.5,0.4-0.6,0.4-1,1.4c-0.2,0.5-0.6,1.3-0.7,1.7l-0.3,0.8l0.1,0.1c0.4,0.2,0.8,0.4,1.2,0.6
	c0.3,0,0.6,0,0.9,0c0.7,0,0.7,0,0.8,0.1s0.1,0.3,0,0.6c0,0.2-0.2,0.3-0.3,0.4c-0.2,0.1-0.5,0.1-0.8,0.1h-1.9l-2.7,0.1
	c-1.2,0-1.3,0-1.4-0.1c-0.1,0-0.2-0.1-0.3-0.1c-0.2,0-0.4-0.1-0.5-0.3c0-0.2,0-0.5,0.1-0.7c0.1-0.1,0.3-0.1,0.4-0.1
	c0.2,0,0.4-0.1,0.6-0.2c0.1-0.1,0.2-0.2,0.4-0.2c0.2-0.1,0.3-0.2,0.4-0.4c0.1-0.1,0.1-0.3,0.2-0.4c0.5-0.7,0.9-1.4,1.2-2.2
	c0.2-0.5,0.4-1,0.4-1s0.1-0.2,0.1-0.3s0.2-0.3,0.2-0.5c0.7-1.4,0.9-1.8,1.1-2.3s0.5-1.2,0.6-1.7c0-0.2,0.1-0.3,0.2-0.4
	s0.1-0.2,0.1-0.2c0.1-0.3,0.2-0.6,0.3-0.7s0.1-0.3,0.3-0.7c0-0.1,0.1-0.3,0.2-0.5c0.1-0.2,0.2-0.4,0.2-0.7c0.1-0.2,0.3-0.6,0.4-1
	s0.3-0.8,0.4-1s0.2-0.5,0.3-0.8c0.2-0.5,0.3-0.7,0.3-0.8c0,0,0.1-0.1,0.1-0.2l0.2-0.4c0.1-0.2,0.3-0.6,0.4-1
	c0.1-0.3,0.3-0.7,0.5-0.9c0.2-0.3,0.6-0.4,0.9-0.4c0.3,0.1,0.6,0.2,0.9,0.5c0.2,0.3,0.3,0.6,0.4,0.9c0,0.1,0.1,0.2,0.1,0.3
	c0,0.1,0.1,0.4,0.2,0.7c0.3,0.9,0.4,1.4,0.5,1.6s0.2,0.5,1,2.5c0.4,1,0.8,2,1.3,3c0.3,0.5,0.5,1,0.5,1c0,0.1,0.1,0.1,0.1,0.2
	c0.1,0.1,0.1,0.2,0.1,0.3c0.1,0.2,0.6,1.2,0.8,1.6c0.5,0.9,1,1.9,1.4,2.9c0.3,0.9,0.7,1.7,1.2,2.4c0.1,0.1,0.2,0.2,0.2,0.3
	c0.1,0.1,0.2,0.2,0.3,0.2c0.2,0.1,0.3,0.1,0.5,0.2c0.1,0.1,0.2,0.1,0.3,0.1c0.3,0.1,0.5,0.2,0.7,0.4c0.1,0.1,0.1,0.1,0.2,0
	c0.2-0.1,0.4-0.1,0.6-0.1c0.1,0,0.2,0,0.4-0.1l0.4-0.1c0.2-0.1,0.5-0.3,0.6-0.5l0.4-0.4l0.1-0.4c0.1-0.6,0.3-1.9,0.3-2.1
	c0-0.1,0-0.1,0-0.2c0-0.2,0.1-0.4,0.1-0.5c0-0.3,0-0.6,0-0.8c0.1-1.5,0.1-2.1,0.1-3.5c0-0.9,0-1.9,0-2.2s0-1.4,0-2.5s0-2,0-2.1
	c-0.1-0.2-0.2-0.4-0.3-0.6c-0.1-0.2-0.2-0.4-0.3-0.6c0-0.1-0.1-0.3-0.2-0.4c-0.2-0.2-0.5-0.3-0.7-0.3c-0.1,0-0.1,0-0.2,0
	c-0.2-0.1-0.4-0.1-0.5-0.1c-0.2,0-0.4-0.1-0.6-0.1c-0.2-0.1-0.3-0.3-0.3-0.6c0-0.2,0.1-0.3,0.3-0.4c0.1,0,2.1,0,4.6,0
	c1.6-0.1,3.2,0,4.7,0.1c0.4,0.1,0.6,0.5,0.4,0.8s-0.3,0.4-1,0.4h-0.7l-0.3,0.2c-0.4,0.3-0.7,0.6-0.9,1c-0.3,0.5-0.4,0.6-0.5,0.8
	c-0.1,0.2-0.1,0.4-0.1,0.5c-0.2,1.8-0.3,2.2-0.3,2.8c0,0.7,0,1.4,0,2.2c0.8,0.2,1.7,0.3,2.5,0.2c0.9,0,1.8,0,2.1,0s1.8,0,3.3,0
	c3,0,2.8,0,3.5-0.3c0.3-0.1,0.3-0.2,0.3-0.9c0-0.4,0-1.2,0-1.7c0.1-0.8-0.1-1.6-0.4-2.4c-0.2-0.6-0.5-1.1-0.9-1.6
	c-0.1-0.1-0.2-0.3-0.3-0.5c-0.1-0.2-0.2-0.2-0.8-0.2c-0.2,0-0.5,0-0.7-0.1l-0.3-0.1c-0.2-0.1-0.4-0.3-0.4-0.6c0-0.1,0-0.2,0.1-0.3
	c0.2-0.3,0.3-0.3,3.4-0.3c1.9-0.1,3.7,0,5.6,0.2c0.5,0.2,0.6,0.4,0.5,0.7s-0.3,0.3-0.8,0.3h-0.5l-0.4,0.4c-0.4,0.4-0.7,1-0.8,1.6
	c-0.1,0.2-0.1,0.4-0.1,0.4c-0.1,0.4-0.3,0.8-0.3,1.2c-0.1,0.3,0,6.2,0.1,7.5c0.1,1.7,0.2,2.4,0.2,3c0,0.3,0.1,0.8,0.1,1
	c0,0.5,0.1,1.1,0.2,1.6c0.3,0.2,0.7,0.4,1.1,0.4c0.3,0,0.5,0.1,0.8,0.2l0.4,0.1c0.4,0.1,0.5,0.3,0.5,0.5c0,0.1,0,0.3-0.1,0.4
	c-0.2,0.2-0.5,0.3-0.8,0.2c-0.9-0.2-1.8-0.2-2.8-0.3h-1.1c-0.1,0-4.7,0.1-4.8,0.1c-0.1,0-0.2-0.1-0.3-0.2c-0.1-0.1-0.2-0.2-0.2-0.4
	c0-0.2,0.1-0.4,0.2-0.4c0.1,0,0.2-0.1,0.3-0.1c0.1-0.1,0.3-0.1,0.4-0.1c0.2,0,0.3,0,0.5-0.1l0.8-0.1c0.3,0,0.5-0.1,0.8-0.2
	c0.5-0.2,0.6-0.4,0.6-0.6c0-0.2,0.1-0.5,0.2-0.7c0.1-0.4,0.2-0.8,0.2-1.3c0-0.4,0-0.9,0-1.2s0-1.1-0.1-1.8s0-1.3-0.1-1.4
	s0-0.2-0.3-0.3c-0.6-0.2-2.6-0.2-6.5,0l-2.9,0.1h-2.2v1c0,0.6,0,1.4,0,1.8s0,1.3,0,2c0,1.5,0,1.5,0.4,1.9c0.2,0.2,0.4,0.3,0.6,0.4
	c0.2,0,0.4,0.1,0.6,0.2c0.4,0.2,0.8,0.3,1.2,0.3c0.6,0.1,0.7,0.2,0.8,0.5c0,0.2,0,0.4-0.2,0.5c-0.3,0.1-0.6,0.2-0.9,0.2L114.5,134.2
	L114.5,134.2z M97.8,126.1c0.1-0.2,0-0.7-0.7-2.2c-0.2-0.6-0.6-1.4-0.7-1.9c-0.3-0.8-0.8-1.8-1.2-2.6c-0.1-0.2-0.2-0.3-0.3-0.3
	s-0.2,0.1-0.3,0.4s-0.2,0.5-0.2,0.5c-0.1,0.4-0.3,0.9-0.5,1.3c0,0.1-0.2,0.4-0.3,0.8s-0.3,0.7-0.4,0.9s-0.1,0.4-0.2,0.5
	c-0.4,0.7-0.6,1.4-0.6,2.1v0.3l0.9,0.1c0.5,0,1.2,0.1,1.5,0.1s1,0,1.4,0.1C97.5,126.2,97.8,126.2,97.8,126.1L97.8,126.1z
	 M44.1,134.1c-0.1,0-0.2-0.1-0.3-0.1c-0.2,0-0.4-0.1-0.5-0.3c0-0.2,0-0.5,0.2-0.6c0.1-0.1,0.3-0.1,0.4-0.1c0.2,0,0.4,0,0.6-0.2
	c0.2-0.1,0.3-0.2,0.5-0.3c0.2-0.1,0.4-0.3,0.6-0.5c0.3-0.3,0.5-0.6,0.6-1l0.3-0.7c0,0,0-0.1,0-0.1c0-0.1,0.1-0.3,0.2-0.4
	c0.1-0.2,0.2-0.6,0.3-0.8s0.2-0.5,0.2-0.6l0.1-0.2c0-0.1,0.1-0.2,0.2-0.4s0.3-0.6,0.5-1c0.5-1,0.9-2,1.2-3c0-0.2,0.1-0.3,0.2-0.4
	l0.1-0.2c0.2-0.4,0.3-0.7,0.4-1c0.1-0.3,0.2-0.6,0.3-0.8c0.1-0.2,0.2-0.4,0.2-0.7c0.1-0.2,0.3-0.6,0.4-1s0.3-0.8,0.4-1
	s0.2-0.5,0.3-0.8c0.2-0.5,0.3-0.7,0.3-0.8c0,0,0.1-0.1,0.1-0.2c0,0,0.1-0.2,0.2-0.4s0.3-0.6,0.4-1c0.1-0.3,0.3-0.7,0.5-0.9
	c0.2-0.3,0.6-0.4,0.9-0.4c0.3,0.1,0.6,0.2,0.9,0.5c0.2,0.3,0.3,0.6,0.4,0.9c0,0.1,0.1,0.2,0.1,0.3s0.1,0.4,0.2,0.7
	c0.3,0.9,0.5,1.4,0.5,1.6s0.2,0.5,1,2.5c0.4,1,0.8,2,1.3,3c0.3,0.6,0.5,1,0.5,1c0,0.1,0.1,0.1,0.1,0.2c0.1,0.1,0.1,0.2,0.1,0.3
	c0,0.2,0.6,1.2,0.8,1.6c0.5,0.9,1,1.9,1.4,2.9c0.3,0.9,0.7,1.7,1.2,2.4l0.2,0.3c0.1,0.1,0.2,0.2,0.3,0.2c0.2,0.1,0.3,0.1,0.5,0.2
	c0.1,0.1,0.2,0.1,0.3,0.1l0.4,0.1c0.4,0.1,0.4,0.3,0.3,0.5s-0.2,0.4-1,0.4c-1.1,0.1-3.9,0.1-5.3,0.1c-0.6-0.1-1.1-0.1-1.7,0
	c-0.6,0.1-0.8,0.1-0.9-0.1s0-0.3,0.3-0.5c0.1-0.1,0.3-0.2,0.4-0.2c0.1-0.1,0.2-0.1,0.3-0.1c0.3-0.1,0.5-0.2,0.7-0.3
	c0.6-0.2,1.2-0.7,1.2-1c-0.1-0.3-0.2-0.6-0.3-0.9c-0.2-0.4-0.4-0.9-0.5-1.4c-0.1-0.5-0.3-0.9-0.5-1.4c-0.8-0.1-1.6-0.1-2.4,0
	c-1,0.1-1.9,0.1-2.9,0c-0.3,0-0.6-0.1-0.9-0.1h-0.7l-0.3,0.2c-0.5,0.4-0.6,0.4-1,1.4c-0.2,0.5-0.6,1.3-0.7,1.7l-0.3,0.8l0.1,0.1
	c0.4,0.2,0.8,0.4,1.2,0.6c0.3,0,0.6,0,0.9,0c0.7,0,0.7,0,0.8,0.1s0.1,0.3,0,0.6c0,0.2-0.2,0.3-0.3,0.4c-0.2,0.1-0.5,0.1-0.8,0.1
	l-4.6,0.1C44.3,134,44.2,134,44.1,134.1L44.1,134.1z M56.2,126.1c0.1-0.2,0-0.7-0.7-2.2c-0.2-0.6-0.6-1.4-0.7-1.9
	c-0.3-0.8-0.8-1.8-1.2-2.6c-0.1-0.2-0.2-0.3-0.3-0.3s-0.2,0.1-0.3,0.4s-0.2,0.5-0.2,0.5s-0.1,0.4-0.5,1.3c0,0.1-0.2,0.4-0.3,0.8
	l-0.3,0.9c-0.1,0.2-0.1,0.4-0.2,0.5c-0.4,0.7-0.6,1.4-0.6,2.1v0.3l0.9,0.1c0.5,0,1.2,0.1,1.5,0.1s1,0,1.4,0.1
	C55.9,126.2,56.1,126.2,56.2,126.1L56.2,126.1z M15,134.1h-2.8v-0.3c-0.1-0.3,0-0.6,0.2-0.8c0.1-0.1,0.2-0.2,0.3-0.2
	c0.2-0.1,0.2-0.1,0.3-0.3c0.1-0.4,0.1-0.5-0.2-0.9c-0.2-0.2-0.8-0.9-1.4-1.4s-1.2-1.3-1.4-1.5s-0.5-0.6-0.7-0.8L8.6,127
	c-0.2-0.2-0.4-0.4-0.6-0.6c-0.5-0.4-0.9-0.8-1.2-1.3l-0.2-0.2l-0.2,0.2c-0.3,0.3-0.5,0.7-0.5,1.1c0,0.3,0,1,0,2.8
	c0,3.1,0,3.1,0.4,3.5c0.3,0.3,0.8,0.5,1.2,0.6c0.2,0,0.4,0.1,0.6,0.2c0.2,0.1,0.2,0.2,0.2,0.4v0.3H8.1c-0.1,0-1,0-1.9,0
	c-1.6,0-4.3,0-5.6,0.1H0.2v-0.2c0-0.1,0-0.3,0.1-0.4c0.1-0.2,0.3-0.4,0.9-0.6c0.5-0.1,0.9-0.4,1.1-0.8c0.3-0.5,0.3-0.6,0.4-2.1
	c0-0.7,0.1-1.4,0.1-1.4s0-2,0-4.4c0-3.6,0-4.5,0-4.8s-0.1-0.7-0.1-1.1s-0.1-0.8-0.2-1c-0.1-0.2-0.1-0.4-0.1-0.7c0-0.4-0.2-0.7-0.4-1
	c-0.4-0.3-1-0.5-1.5-0.6c-0.1,0-0.2-0.1-0.3-0.1c-0.2-0.2-0.2-0.4,0-0.6c0,0,0,0,0,0c0.1-0.1,0.2-0.1,0.9-0.1c1.2,0,2.6,0,3.3-0.1
	S5.8,114,7,114c0.3,0,0.6,0,0.8,0.1c0.2,0.1,0.4,0.3,0.3,0.5C8,114.8,7.9,115,7.7,115c-0.4,0.1-0.8,0.3-1.1,0.5
	c-0.2,0.2-0.2,0.2-0.4,0.8c-0.2,0.6-0.3,1.1-0.4,1.7c0,0.8-0.1,3.6,0,3.6c0.4-0.1,0.7-0.3,1-0.5c0.2-0.2,0.6-0.4,0.7-0.5
	c0.6-0.4,1.2-0.8,1.7-1.2l0.9-0.8c0.2-0.1,0.3-0.3,0.5-0.4c0.1-0.2,0.3-0.4,0.5-0.5c0.3-0.3,0.5-0.6,0.7-0.9
	c0.2-0.3,0.3-0.6,0.3-0.9c0.1-0.2,0.1-0.5,0-0.7c0-0.2-0.1-0.3-0.2-0.3c-0.2-0.1-0.2-0.2-0.2-0.3c0-0.2,0.1-0.4,0.3-0.5
	c0.7-0.1,1.4-0.1,2.2,0c1,0,2,0,3-0.1c0.5-0.1,0.9-0.1,1.4,0c0.7,0.2,1,0.6,0.6,0.9c-0.1,0.1-0.2,0.1-0.2,0.1
	c-0.1,0-0.2,0.1-0.3,0.1c-0.2,0.1-0.3,0.1-0.5,0.2c-0.5,0.2-0.9,0.5-1.2,0.8c-0.3,0.2-0.5,0.5-0.8,0.7c-0.3,0.2-0.5,0.4-0.8,0.6
	c-0.2,0.2-0.4,0.4-0.6,0.6c-0.2,0.2-0.6,0.5-0.9,0.7l-1,0.8c-1.1,0.9-2.1,1.9-2.9,2.9c-0.1,0.2-0.2,0.4-0.2,0.6
	c0.1,0.2,0.2,0.4,0.4,0.5c0.4,0.5,0.8,1,1.2,1.5c0.5,0.6,1,1.2,1.6,1.7c0.6,0.6,1.5,1.6,2.4,2.7c0.8,1.1,1.8,2,3,2.8l0.7,0.4
	c0.2,0.1,0.5,0.2,0.8,0.3c0.3,0.1,0.6,0.2,0.7,0.2l0.4,0.2c0.1,0.1,0.3,0.1,0.3,0.2c0.1,0.2,0.1,0.4,0,0.6c-0.1,0-1.9,0-5.6,0
	L15,134.1z M138.2,134c-0.7,0-1.5,0-2.2-0.1c-0.1,0-0.2-0.1-0.2-0.1c-0.2,0-0.4-0.2-0.4-0.4c0-0.3,0.2-0.4,0.6-0.5
	c0.2,0,0.3-0.1,0.5-0.1c0.3-0.1,0.5-0.1,0.8-0.1c0.7,0,1.4-0.2,2-0.5c0.1-0.4,0.1-0.8,0.1-1.2c0.1-0.8,0.1-1.7,0-2.5
	c-0.1-0.5-0.1-0.8-0.1-1.4c0-0.5-0.1-0.9-0.2-1.3c-0.1-0.3-0.2-0.7-0.2-1c0-0.1,0-0.2-0.1-0.3c0,0-0.1-0.1-0.1-0.1
	c0-0.1-0.1-0.2-0.1-0.3c-0.3-0.5-0.5-0.8-0.5-0.8c-0.1-0.1-0.3-0.3-0.3-0.5c0-0.1,0-0.1-0.1-0.1c-0.1-0.1-0.1-0.1-0.2-0.2
	c0-0.1-0.1-0.2-0.1-0.2s-0.1-0.1-0.1-0.1c-0.1-0.2-0.2-0.4-0.4-0.6c-0.1-0.1-0.1-0.2-0.2-0.2c-0.4-0.4-0.7-0.9-1-1.3l-0.2-0.3
	c-0.2-0.2-0.3-0.3-0.4-0.5c0-0.1-0.1-0.1-0.1-0.1c-0.1-0.1-0.2-0.2-0.2-0.3l-0.4-0.6c-0.1-0.1-0.1-0.2-0.2-0.3c0,0,0-0.1-0.1-0.1
	c-0.1,0-0.1-0.1-0.1-0.2c-0.1-0.1-0.1-0.2-0.2-0.3c-0.1-0.1-0.2-0.3-0.2-0.3c-0.1-0.2-0.3-0.4-0.5-0.6c-0.1-0.1-0.1-0.2-0.2-0.2
	c-0.1-0.1-0.2-0.3-0.3-0.4c-0.2-0.2-0.2-0.2-0.6-0.2c-0.6,0-0.9-0.2-1.2-0.4c-0.1-0.1-0.1-0.2-0.1-0.4c0-0.4,0.3-0.6,0.9-0.5
	c0.3,0,0.7,0,1,0c1.4,0,2.2,0,4.6,0h2.4l0.1,0.2c0.2,0.2,0.2,0.5,0,0.7c0,0-0.1,0.1-0.1,0.1c-0.4,0.1-0.7,0.1-1.1,0.1
	c-0.9,0-1.1,0-1.1,0.1c0,0.1-0.1,0.2-0.2,0.3c-0.2,0.3-0.2,0.4-0.1,0.7c0.3,0.8,0.8,1.6,1.2,2.3c0.1,0.1,0.2,0.2,0.2,0.4
	c0,0.1,0.1,0.2,0.2,0.3c0.1,0.1,0.2,0.2,0.2,0.4c0,0.1,0.1,0.2,0.1,0.2c0,0,0.1,0.1,0.1,0.1c0,0.1,0,0.1,0.1,0.2l0.7,1.1
	c0.9,1.4,1,1.5,1.1,1.5c0.6-0.6,1.1-1.3,1.6-1.9c0.8-1.1,0.9-1.1,1.2-1.7l0.6-0.9c0.4-0.7,0.7-1.3,1-2.1c0.1-0.2,0.1-0.4,0.1-0.7
	v-0.3h-1.9c0,0-0.1-0.1-0.2-0.1c-0.2-0.2-0.2-0.5,0-0.7c0.3-0.3,0.4-0.3,3.8-0.2c1.7,0,3.2,0.1,3.3,0.1c0.7,0.1,1,0.6,0.7,0.9
	c-0.1,0.1-0.2,0.1-0.8,0.2c-0.3,0-0.5,0-0.8,0.1c-0.5,0.4-0.9,0.9-1.3,1.3c-0.2,0.2-0.6,0.7-0.9,1c-0.5,0.5-1,1-1.4,1.6
	c-0.5,0.7-0.6,0.9-0.8,1.1l-0.7,0.9l-0.2,0.3c-0.1,0.1-0.1,0.1-0.1,0.2c0,0,0,0.1-0.1,0.1c0,0-0.1,0.1-0.1,0.1c0,0-0.1,0.2-0.4,0.5
	c-0.1,0.1-0.2,0.3-0.3,0.5l-0.4,0.5c-0.4,0.6-0.5,0.8-0.5,0.9c0,0.3,0,0.6-0.1,0.9c-0.2,1.2-0.2,2.5-0.2,3.7c0,0.9,0,1.8,0,2
	c0,0.1,0,0.3,0,0.4c0.1,0.1,0.2,0.2,0.3,0.3c0.4,0.3,0.9,0.4,1.4,0.4c0.4,0.1,0.8,0.1,1.2,0.3c0.2,0.1,0.3,0.1,0.4,0.3
	c0.1,0.2,0.1,0.5-0.1,0.7l-0.1,0.1h-2.6h-4.7L138.2,134z"/>
<g id="g1179">
	<path id="path11111-3" class="st1" d="M52,0L32.3,9.1l21,36.3l1.7-1.1L35.1,10l15.8-7.3l12.2,32.9l-5.2,3.2L45,16.3l4.8-2.6
		l4.7,12.4l1.9-0.6l-5.6-14.6l-8.5,4.7l15.3,26.9l7.9-5.7L52,0z M99.5,0L85.7,36.8l8,5.7l15.5-27l-8.5-4.7l-5.6,14.6l1.9,0.6
		l4.8-12.4l4.8,2.6L93.2,39.5L88,36.3l12.7-33.6l15.8,7.3L96.3,44.4l1.5,1l21.4-36.2L99.5,0z M65.3,7l2.4,29.8h2L67.5,9l18.1,0.3
		l-4.3,25.6l-6.3-0.6l-1.3-18.5l5.4-0.1l-1,9.7l2,0.2l1.2-11.9L71.7,14l1.5,22.8l9.9-0.1L88,7.4L65.3,7z M24.4,30.8l-9,19.6
		l32.4,10.2l0.6-2.2l-30.3-9.2l7.2-15.7l24.9,13.4L48,53.3l-20.8-7l2-4.8l9.2,4.5l1-1.7l-11.3-5.5l-3.5,8.7l24.8,7.7l2.5-8.5
		L24.4,30.8z M127.2,30.8L99.5,46.6L102,55l25-7.5l-3.5-8.7l-11.2,5.5l0.9,1.7l9.2-4.5l1.9,4.8l-21,6.6l-1.7-5.3l24.6-14l7.2,15.7
		L103,58.7l0.6,1.6l32.7-9.9L127.2,30.8z M3.5,56.8L0,81.2l46.4-0.8l-0.4-1.9L2.3,79.2L5.3,59l39.7,6.1l-0.7,7.7l-30.4-0.6l0.4-6
		L30,68l0.2-1.9l-18-2.1l-0.6,10.1l34.6,0.5l0.6-10.9L3.5,56.8z M148,56.8l-43.6,6.8l0.6,10.8l34.9-0.4L139.3,64l-18,2.1l0.2,1.9
		l15.9-1.8l0.4,6l-31.4,0.5l-0.5-7.4l40.5-6.2l2.9,20.2l-44-0.7l-0.4,1.9l46.7,0.7L148,56.8z M17.1,85.9l1.9,20.7l31.6-5.8l-0.4-1.9
		l-29.4,5.4l-1.5-16.4L46,89.1l0.7,5.8l-20.5,3l-0.7-5.5h11.7v-1.9h-14l1.2,9.5l25.2-3.6l-1.8-9.2L17.1,85.9z M134.5,85.9l-31,1.4
		l-1.8,9l25.5,3.7l1.3-9.6h-14v1.9h11.7l-0.7,5.5l-21.7-3l0.7-5.8l27.9-1.1l-1.5,16.4l-29.6-5.4l-0.4,1.9l31.8,5.8L134.5,85.9z"/>
	<path id="path29327-2" class="st1" d="M55.5,49.6v0.6l17.8,6.4v22h-2.4v-3.3H68V77l4.9,6h5.8l4.8-6v-1.8h-2.9v3.3h-2.4v-22L96.1,50
		v-0.6l-20.3-8.7L55.5,49.6z M52.2,51.4V78l6.1,7.2L65.6,73h5.3V62.4L55.5,75.2V73l7.8-6.7l-7.8-3.5v-1.6l6.5,1.6l3.7-0.5l2.6-2.3
		H55.5v-2.6h13L52.2,51.4z M99.3,51.4l-16.2,6h13V60H83.3l2.6,2.3l3.7,0.5l6.5-1.6v1.5l-7.9,3.5l7.9,6.7v2.2L80.7,62.4V73h5.3
		l7.3,12.3l6.1-7.3V51.4z M65.8,78.9l-5.6,9h2.4l-2.3,3.7l-7.4-8.1h-0.6v11.9l12.7,15.1h21.8l12.6-15.1V83.4h-0.6l-7.4,8.1L89,87.8
		h2.4l-5.6-9l-5.7,6.4h-8.7L65.8,78.9z M68.4,87.9h14.8l4.7,4.9L84.6,95l-3.3-3.4H70.3L67,94.9l-3.3-2.2L68.4,87.9z"/>
</g>
</svg>
