2020-10-13T07:11:21+00:00 DEBUG Mail Check Status:: 1
2020-10-13T07:18:51+00:00 DEBUG Mail Check Status:: 1
2020-10-13T09:31:06+00:00 DEBUG SMS:: 5445336456 : eShilpMart: You have received an Order #3030 for New Arrival Shirt
2020-10-13T09:32:17+00:00 DEBUG SMS:: 5445336456 : eShilpMart: You have received an Order #3030 for Saree
2020-10-13T10:31:33+00:00 DEBUG SMS:: 897521354 : eShilpMart: Chanderi Saree is low in stock. There are 0 left.
2020-10-13T10:32:36+00:00 DEBUG SMS:: 897521354 : eShilpMart: You have received an Order #3031 for Chanderi Saree
2020-10-13T10:32:37+00:00 DEBUG SMS:: 9990731086 : eShilpMart: You have received an Order #3031 for Kanchipuram Sari
2020-10-13T10:44:22+00:00 DEBUG SMS:: 5445336456 : eShilpMart: Refund Request #4 received for Order #3030 item New Arrival Shirt
2020-10-13T11:12:39+00:00 DEBUG Mail Check Status:: 1
2020-10-13T11:13:17+00:00 DEBUG Mail Check Status:: 1
2020-10-13T11:13:48+00:00 DEBUG Mail Check Status:: 1
2020-10-13T11:18:51+00:00 DEBUG Mail Check Status:: 1
2020-10-13T14:24:02+00:00 DEBUG OPT:: 7060460903: Your verification code is 4801
2020-10-13T14:24:18+00:00 DEBUG OPT:: 7060460903: SMS Sent Successfully.
