<?xml version="1.0" encoding="UTF-8"?>
<!DOCTYPE svg PUBLIC "-//W3C//DTD SVG 1.1//EN" "http://www.w3.org/Graphics/SVG/1.1/DTD/svg11.dtd">
<!-- Creator: CorelDRAW 2017 -->
<svg xmlns="http://www.w3.org/2000/svg" xml:space="preserve" width="1518px" height="1518px" version="1.1" style="shape-rendering:geometricPrecision; text-rendering:geometricPrecision; image-rendering:optimizeQuality; fill-rule:evenodd; clip-rule:evenodd"
viewBox="0 0 3388.36 3388.36"
 xmlns:xlink="http://www.w3.org/1999/xlink">
 <defs>
  <style type="text/css">
   <![CDATA[
    .fil1 {fill:#88BD30}
    .fil0 {fill:#FEFEFE}
    .fil2 {fill:white}
   ]]>
  </style>
 </defs>
 <g id="Layer_x0020_1">
  <metadata id="CorelCorpID_0Corel-Layer"/>
  <path class="fil0" d="M1694.17 0c935.46,0 1694.19,758.28 1694.19,1694.18 0,935.45 -758.73,1694.18 -1694.19,1694.18 -935.89,0 -1694.17,-758.73 -1694.17,-1694.18 0,-935.9 758.28,-1694.18 1694.17,-1694.18zm0 50.05c907.96,0 1644.15,736.18 1644.15,1644.13 0,907.95 -736.19,1644.14 -1644.15,1644.14 -907.94,0 -1644.13,-736.19 -1644.13,-1644.14 0,-907.95 736.19,-1644.13 1644.13,-1644.13z"/>
  <path class="fil1" d="M1694.17 204.9c822.3,0 1489.06,666.76 1489.06,1489.51 0,822.29 -666.76,1489.05 -1489.06,1489.05 -822.74,0 -1489.06,-666.76 -1489.06,-1489.05 0,-822.75 666.32,-1489.51 1489.06,-1489.51z"/>
  <g id="_2150585468592">
   <path class="fil2" d="M1756.39 2217.58c-219.54,-41.92 -179.42,133 -280.41,175.82 -13.07,5.86 -35.17,13.07 -52.3,11.27 13.53,31.56 61.77,67.17 121.28,81.6l24.8 4.96c72.12,9.92 154.62,-13.07 210.98,-107.74 12.17,-19.84 29.75,-59.52 35.16,-89.27 85.66,-26.15 119.02,-37.41 195.66,-68.08 112.25,-44.62 229.47,-120.36 315.12,-208.27 63.11,-64.01 103.24,-114.06 153.73,-187.09 13.98,-20.28 60.41,-89.71 64.91,-114.06 3.16,-16.23 -6.76,-29.3 -24.34,-32.9 -31.11,-5.87 -268.69,81.59 -339.47,119.91 -8.57,4.96 -15.33,8.57 -24.8,13.07 -87,44.63 -187.08,129.39 -252,202.42 -27.95,31.11 -50.5,59.51 -76.64,93.77 -32.91,42.83 -50.04,75.29 -71.68,104.59l0 0z"/>
   <g>
    <path class="fil2" d="M1496.72 998.12c9.01,32.9 16.68,25.24 34.71,51.84 149.67,-79.34 215.49,46.89 215.49,94.67 0,114.06 -176.27,200.17 -250.2,310.17l36.07 41.47c38.31,-24.79 112.25,-107.74 151.47,-146.97 64.47,-64.46 122.63,-100.98 122.63,-204.67 0,-72.58 -57.26,-134.34 -104.6,-162.3 -75.28,-44.62 -140.2,-18.48 -205.57,15.78l0 0.01z"/>
    <path class="fil2" d="M1722.58 1361.47c58.15,88.37 247.95,209.18 247.95,291.23 0,96.93 -66.72,146.52 -120.37,146.52 -47.79,0 -57.71,-17.13 -94.67,-25.69l-36.07 41.47c203.77,139.31 378.24,-83.4 291.23,-236.23 -24.35,-42.83 -206.92,-226.76 -246.6,-253.36l-41.47 36.06 0 0z"/>
    <path class="fil2" d="M1177.99 1721.68l41.93 -36.07c-23.9,-36.06 -93.32,-97.37 -129.84,-133.89 -81.59,-81.59 -118.56,-89.26 -118.56,-191.59 0,-49.14 71.22,-112.26 120.36,-112.26 47.79,0 57.71,17.58 95.13,26.15l36.06 -41.48c-207.37,-141.56 -381.84,87.91 -288.07,241.64 23.45,38.77 206.93,223.15 242.99,247.5l0 0z"/>
    <path class="fil2" d="M1135.16 1885.33c0,134.34 120.82,216.39 209.18,201.06 57.71,-9.91 64.47,-27.5 100.98,-37.41 -8.56,-32.47 -16.68,-24.8 -34.71,-51.4 -149.22,78.9 -215.04,-47.33 -215.04,-94.67 0,-119.92 192.04,-232.62 249.75,-318.73l-41.48 -36.06c-44.63,30.2 -179.42,174.01 -223.6,227.2 -24.8,29.31 -45.08,59.52 -45.08,110.01l0 0z"/>
    <path class="fil2" d="M1270.86 1358.32l361.55 365.62 38.77 -34.72c-11.72,-38.77 -59.06,-72.13 -86.1,-98.73 -42.83,-43.28 -239.39,-254.71 -277.7,-265.08l-36.52 32.91 0 0z"/>
    <path class="fil2" d="M1298.81 929.14c0,27.95 319.18,333.61 335.86,344.88l36.06 -41.48c-28.4,-41.93 -233.97,-236.23 -300.69,-305.65 -21.64,-23 -19.39,-29.31 -54.1,-32.01 -10.37,15.78 -17.13,15.33 -17.13,34.26l0 0z"/>
    <path class="fil2" d="M1271.31 1815c30.65,44.63 128.03,132.54 171.76,175.82 30.65,31.11 55.45,55.45 86.11,86.56 46.43,45.98 57.25,71.68 96.92,75.28 32.91,-49.59 24.34,-40.57 -58.16,-123.07 -30.65,-30.65 -55.44,-55 -86.1,-86.11 -43.73,-43.27 -131.19,-141.1 -174.47,-169.95l-36.06 41.47 0 0z"/>
    <polygon class="fil2" points="1038.24,1461.11 1081.97,1499.43 1447.58,1138.32 1409.26,1094.59 "/>
    <polygon class="fil2" points="1494.91,1909.22 1532.79,1952.95 1903.81,1585.99 1860.08,1548.12 "/>
    <path class="fil2" d="M1953.4 1463.36l32.46 36.52c32.45,-22.54 110.9,-92.42 114.05,-131.19 -45.08,-30.21 -38.76,-25.7 -96.92,32.46 -20.74,20.74 -41.47,31.55 -49.59,62.21l0 0z"/>
    <path class="fil2" d="M842.13 1678.85c45.08,30.21 38.77,25.7 96.92,-32.45 20.74,-20.74 41.48,-31.56 49.59,-62.22l-32.45 -36.52c-32.46,22.54 -110.91,92.42 -114.06,131.19l0 0z"/>
   </g>
  </g>
 </g>
</svg>
