2020-11-13T06:56:06+00:00 DEBUG OPT:: 8413886393: Your verification code is 7010
2020-11-13T06:56:06+00:00 DEBUG OPT:: 8413886393: SMS Sent Successfully.
2020-11-13T06:56:40+00:00 DEBUG OPT:: 8413886393: Your verification code is 7010
2020-11-13T06:56:40+00:00 DEBUG OPT:: 8413886393: SMS Sent Successfully.
2020-11-13T06:57:51+00:00 DEBUG OPT:: 8413886393: Your verification code is 7010
2020-11-13T06:57:51+00:00 DEBUG OPT:: 8413886393: SMS Sent Successfully.
2020-11-13T07:09:53+00:00 DEBUG OPT:: 8413886393: Your verification code is 7010
2020-11-13T07:09:53+00:00 DEBUG OPT:: 8413886393: SMS Sent Successfully.
2020-11-13T07:13:08+00:00 DEBUG OPT:: 7829477275: Your verification code is 9921
2020-11-13T07:13:08+00:00 DEBUG OPT:: 7829477275: SMS Sent Successfully.
2020-11-13T07:13:09+00:00 DEBUG OPT:: 7829477275: Your verification code is 9921
2020-11-13T07:13:09+00:00 DEBUG OPT:: 7829477275: SMS Sent Successfully.
2020-11-13T07:13:10+00:00 DEBUG OPT:: 7829477275: Your verification code is 9921
2020-11-13T07:13:10+00:00 DEBUG OPT:: 7829477275: SMS Sent Successfully.
2020-11-13T07:13:12+00:00 DEBUG OPT:: 7829477275: Your verification code is 9921
2020-11-13T07:13:13+00:00 DEBUG OPT:: 7829477275: SMS Sent Successfully.
2020-11-13T07:13:19+00:00 DEBUG OPT:: 7829477275: Your verification code is 9921
2020-11-13T07:13:20+00:00 DEBUG OPT:: 7829477275: SMS Sent Successfully.
2020-11-13T07:13:24+00:00 DEBUG OPT:: 7829477275: Your verification code is 9921
2020-11-13T07:13:24+00:00 DEBUG OPT:: 7829477275: SMS Sent Successfully.
2020-11-13T07:13:43+00:00 DEBUG OPT:: 7829477275: Your verification code is 9921
2020-11-13T07:13:44+00:00 DEBUG OPT:: 7829477275: SMS Sent Successfully.
2020-11-13T07:21:56+00:00 DEBUG OPT:: 8413886393: Your verification code is 7010
2020-11-13T07:21:56+00:00 DEBUG OPT:: 8413886393: SMS Sent Successfully.
2020-11-13T07:24:13+00:00 DEBUG OPT:: 7829477275: Your verification code is 9921
2020-11-13T07:24:13+00:00 DEBUG OPT:: 7829477275: SMS Sent Successfully.
2020-11-13T08:38:17+00:00 DEBUG OPT:: 8413886393: Your verification code is 7010
2020-11-13T08:38:20+00:00 DEBUG OPT:: 8413886393: SMS Sent Successfully.
2020-11-13T08:44:08+00:00 DEBUG OPT:: 8413886393: Your verification code is 7010
2020-11-13T08:44:08+00:00 DEBUG OPT:: 8413886393: SMS Sent Successfully.
2020-11-13T09:07:31+00:00 DEBUG OPT:: 8413886393: Your verification code is 7010
2020-11-13T09:07:32+00:00 DEBUG OPT:: 8413886393: SMS Sent Successfully.
2020-11-13T09:15:13+00:00 DEBUG OPT:: 8413886393: Your verification code is 7010
2020-11-13T09:15:13+00:00 DEBUG OPT:: 8413886393: SMS Sent Successfully.
2020-11-13T09:15:22+00:00 DEBUG OPT:: 8413886393: Your verification code is 7010
2020-11-13T09:15:22+00:00 DEBUG OPT:: 8413886393: SMS Sent Successfully.
2020-11-13T09:18:14+00:00 DEBUG OPT:: 8413886393: Your verification code is 7010
2020-11-13T09:18:14+00:00 DEBUG OPT:: 8413886393: SMS Sent Successfully.
2020-11-13T09:18:47+00:00 DEBUG OPT:: 8413886393: Your verification code is 7010
2020-11-13T09:18:47+00:00 DEBUG OPT:: 8413886393: SMS Sent Successfully.
2020-11-13T09:18:51+00:00 DEBUG OPT:: 8413886393: Your verification code is 7010
2020-11-13T09:18:51+00:00 DEBUG OPT:: 8413886393: SMS Sent Successfully.
2020-11-13T09:19:39+00:00 DEBUG OPT:: 8413886393: Your verification code is 7010
2020-11-13T09:19:40+00:00 DEBUG OPT:: 8413886393: SMS Sent Successfully.
2020-11-13T09:19:47+00:00 DEBUG OPT:: 8413886393: Your verification code is 7010
2020-11-13T09:19:47+00:00 DEBUG OPT:: 8413886393: SMS Sent Successfully.
2020-11-13T09:45:11+00:00 DEBUG OPT:: 8413886393: Your verification code is 7010
2020-11-13T09:45:11+00:00 DEBUG OPT:: 8413886393: SMS Sent Successfully.
2020-11-13T10:37:46+00:00 DEBUG OPT:: 8178152307: Your verification code is 1491
2020-11-13T10:37:46+00:00 DEBUG OPT:: 8178152307: Your verification code is 8469
2020-11-13T10:37:46+00:00 DEBUG OPT:: 8178152307: Your verification code is 9190
2020-11-13T10:37:50+00:00 DEBUG OPT:: 8178152307: SMS Sent Successfully.
2020-11-13T10:37:50+00:00 DEBUG OPT:: 8178152307: SMS Sent Successfully.
2020-11-13T10:37:50+00:00 DEBUG OPT:: 8178152307: SMS Sent Successfully.
2020-11-13T10:46:22+00:00 DEBUG SMS:: 8178152307 : eShilpMart: You have successfully registered to our site.
2020-11-13T11:06:56+00:00 DEBUG OPT:: 8413886393: Your verification code is 5008
2020-11-13T11:06:56+00:00 DEBUG OPT:: 8413886393: SMS Sent Successfully.
