<?xml version="1.0" encoding="UTF-8" standalone="no"?>
<!-- Creator: CorelDRAW 2017 -->

<svg
   xmlns:dc="http://purl.org/dc/elements/1.1/"
   xmlns:cc="http://creativecommons.org/ns#"
   xmlns:rdf="http://www.w3.org/1999/02/22-rdf-syntax-ns#"
   xmlns:svg="http://www.w3.org/2000/svg"
   xmlns="http://www.w3.org/2000/svg"
   xmlns:sodipodi="http://sodipodi.sourceforge.net/DTD/sodipodi-0.dtd"
   xmlns:inkscape="http://www.inkscape.org/namespaces/inkscape"
   xml:space="preserve"
   width="100"
   height="75"
   version="1.1"
   style="clip-rule:evenodd;fill-rule:evenodd;image-rendering:optimizeQuality;shape-rendering:geometricPrecision;text-rendering:geometricPrecision"
   viewBox="0 0 60.29661 44.921053"
   id="svg23"
   sodipodi:docname="in transit.svg"
   inkscape:version="0.92.3 (2405546, 2018-03-11)"><metadata
   id="metadata27"><rdf:RDF><cc:Work
       rdf:about=""><dc:format>image/svg+xml</dc:format><dc:type
         rdf:resource="http://purl.org/dc/dcmitype/StillImage" /><dc:title></dc:title></cc:Work></rdf:RDF></metadata><sodipodi:namedview
   pagecolor="#ffffff"
   bordercolor="#666666"
   borderopacity="1"
   objecttolerance="10"
   gridtolerance="10"
   guidetolerance="10"
   inkscape:pageopacity="0"
   inkscape:pageshadow="2"
   inkscape:window-width="640"
   inkscape:window-height="480"
   id="namedview25"
   showgrid="false"
   inkscape:zoom="6.9736842"
   inkscape:cx="61.748305"
   inkscape:cy="31.338593"
   inkscape:current-layer="_1874665563296" />
 <defs
   id="defs4">
  <style
   type="text/css"
   id="style2">
   <![CDATA[
    .str1 {stroke:black;stroke-width:0.53}
    .str0 {stroke:black;stroke-width:1.19;stroke-linecap:round}
    .fil2 {fill:none}
    .fil0 {fill:#1C1B17}
    .fil1 {fill:black}
   ]]>
  </style>
 </defs>
 <g
   id="Layer_x0020_1"
   transform="translate(0,-0.6029661)">
  <metadata
   id="CorelCorpID_0Corel-Layer" />
  <g
   id="_1874665563296">
   <g
   id="g11"
   transform="translate(-3.6177966)">
    <path
   class="fil0 str0"
   d="m 18.92,16.66 c -0.07,-1 0.56,-2.97 0.94,-3.75 0.37,-0.74 0.67,-1.2 1.12,-1.81 1.65,-2.2 4.51,-3.7 7.32,-3.82 0,0.49 -0.17,1.42 0.56,1.41 0.69,-0.01 0.55,-0.83 0.55,-1.41 2.02,0.11 3.69,0.77 5.24,1.82 0.23,0.16 0.46,0.34 0.66,0.52 0.5,0.44 0.63,0.57 1.05,1.02 0.05,0.05 0.07,0.1 0.12,0.15 0.49,0.54 1.07,1.48 1.38,2.14 0.43,0.9 1,2.77 0.93,3.73 -0.56,0.01 -1.24,-0.09 -1.23,0.57 0.01,0.69 0.81,0.54 1.23,0.55 0.07,0.99 -0.55,2.98 -0.94,3.74 -0.29,0.56 -0.53,1.01 -0.87,1.47 l -0.52,0.67 c -0.38,0.48 -0.69,0.77 -1.17,1.16 -0.72,0.6 -1.24,0.95 -2.14,1.38 -1.04,0.51 -2.42,0.9 -3.74,0.95 0,-0.2 0.03,-0.75 -0.02,-0.91 -0.07,-0.22 -0.26,-0.39 -0.53,-0.39 -0.7,0 -0.56,0.84 -0.56,1.3 -1.35,-0.05 -2.69,-0.44 -3.76,-0.96 -2.14,-1.03 -3.62,-2.57 -4.69,-4.69 -0.38,-0.75 -1,-2.75 -0.93,-3.72 0.22,-0.01 0.7,0.02 0.87,-0.04 0.18,-0.07 0.36,-0.29 0.35,-0.54 -0.01,-0.67 -0.83,-0.54 -1.22,-0.54 z m -1.21,1.29 c 0.09,1.55 0.58,3.16 1.21,4.36 0.34,0.66 0.95,1.61 1.41,2.11 0.06,0.07 0.09,0.12 0.15,0.19 0.3,0.32 0.89,0.92 1.24,1.19 2.28,1.82 4.79,2.72 7.87,2.55 C 35.47,28.02 40.41,22.85 40,16.51 39.77,12.82 37.61,9.46 34.78,7.76 31.36,5.69 27.35,5.47 23.75,7.29 23.13,7.61 22.51,8 22.03,8.38 c -0.82,0.66 -1.46,1.29 -2.08,2.1 -1.61,2.1 -2.39,4.73 -2.24,7.47 z"
   id="path7"
   inkscape:connector-curvature="0"
   style="fill:#1c1b17;stroke:#000000;stroke-width:1.19000006;stroke-linecap:round" />
    <path
   class="fil0 str0"
   d="m 27.83,17.11 c -0.07,0.89 0.83,1.41 1.53,1 0.66,-0.38 -0.22,-0.33 1.4,-0.33 0.77,0 1.54,0 2.31,0 0.74,0 1.57,0.03 2.3,0 0.23,-0.02 0.28,-0.05 0.41,-0.17 0.23,-0.24 0.22,-0.59 -0.03,-0.82 -0.13,-0.11 -0.26,-0.13 -0.47,-0.13 H 30.1 c -0.25,0 -0.34,0.06 -0.47,-0.11 -0.14,-0.17 -0.42,-0.37 -0.77,-0.37 -0.41,0.01 -0.16,0.21 -0.69,-0.32 L 24.71,12.4 c -0.66,-0.66 -1.32,0.13 -0.92,0.67 0.13,0.17 0.41,0.42 0.57,0.58 0.4,0.39 0.77,0.76 1.16,1.15 0.78,0.78 1.54,1.52 2.31,2.31 z"
   id="path9"
   inkscape:connector-curvature="0"
   style="fill:#1c1b17;stroke:#000000;stroke-width:1.19000006;stroke-linecap:round" />
   </g>
   
   
   <g
   id="g840"
   transform="matrix(0.85357729,0,0,1.0070296,-0.00431263,0.44364996)"><path
     id="path13"
     d="m 54.08,38.2 c 0,-1.57 0.15,-2.62 1.26,-3.81 2.94,-3.12 8.05,-0.59 8.05,2.71 0,1.92 -0.09,2.62 -1.47,4.01 -1.64,1.66 -4.71,1.65 -6.3,0.07 -0.66,-0.66 -1.54,-1.73 -1.54,-2.98 z M 0.27,32.02 V 31.65 C 0.35,31.13 0.8,30.67 1.5,30.67 h 10.27 c 0.96,0 1.23,0.64 1.23,1.37 0,1.4 -4.09,0.95 -5.75,0.95 v 2.33 h 6.3 c 0.3,-1.29 1.44,-2.49 2.37,-3.24 2.3,-1.88 6.1,-1.83 8.47,0.07 2.03,1.62 1.91,3.17 2.58,3.17 h 22.46 v -8.35 c 0,-1.1 2.19,-1.48 2.19,0.14 v 8.21 c 0.74,-0.01 0.62,-0.1 0.84,-0.66 1.64,-4.15 8.64,-5.84 11.95,-1.04 1.46,2.11 -0.2,1.7 3.78,1.7 v -4.65 c -3.06,0 -4.8,-1.01 -4.8,-4.39 0,-1.29 -0.16,-2.54 1.37,-2.6 1,-0.05 2.14,0 3.15,0 -0.34,-1.48 -1.83,-2.46 -3.69,-2.46 h -12.6 v 1.5 c 0,1.03 -2.19,1.28 -2.19,-0.27 V 2.46 H 7.25 v 19.31 c 0,2.58 -2.33,2 -2.33,0.68 V 2.32 c 0,-0.96 1.09,-2.05 2.06,-2.05 h 42.45 c 2.69,0 2.19,2.93 2.19,4.65 h 8.35 c 1.41,0 2.8,0.82 3.45,1.62 1.2,1.5 1.91,5.09 0.25,5.23 0.25,0.52 0.78,2.93 0.92,3.59 0.15,0.73 0.28,1.24 0.45,1.89 0.13,0.52 0.36,1.24 0.41,1.78 1.5,0.35 2.48,0.82 3.39,1.81 0.69,0.75 1.54,2.14 1.54,3.53 v 12.18 c 0,1.55 -2.49,1.1 -4.66,1.1 0,3.73 -3.08,6.98 -6.71,6.98 -4.31,0 -7.25,-3.15 -7.25,-6.98 H 27.11 c 0,5.02 -5.33,8.62 -10.09,6.26 -0.46,-0.23 -0.66,-0.3 -1.04,-0.61 -1.13,-0.93 -1.47,-1.24 -2.16,-2.63 -0.54,-1.11 -0.68,-1.74 -0.68,-3.02 -8,0 -8.22,0.7 -8.22,-4.66 H 1.77 c -0.95,0 -1.41,-0.46 -1.5,-0.97 z m 19.58,0.97 c 5.81,0 6.49,7.32 2.04,9.03 -3.94,1.51 -7.64,-2.19 -6.13,-6.13 0.28,-0.74 0.85,-1.5 1.46,-1.96 0.76,-0.56 1.66,-0.94 2.63,-0.94 z m 45.87,-6.16 v -0.96 h 2.47 v 2.47 h -0.96 c -1.03,0 -1.51,-0.48 -1.51,-1.51 z m -14.1,-8.21 v -6.71 h 9.45 c 0.51,0 0.45,0.59 0.68,1.5 l 1.37,5.62 -10.41,0.01 c -0.59,0.01 -1.09,0.13 -1.09,-0.42 z m 0,-11.37 h 8.62 c 0.49,0 1.19,0.45 1.45,0.74 0.35,0.38 0.59,0.93 0.61,1.59 H 51.62 Z"
     class="fil1 str1"
     inkscape:connector-curvature="0"
     style="fill:#000000;stroke:#000000;stroke-width:0.52999997" /><path
     id="path15"
     d="m 56.41,37.51 c 0,3.41 4.66,2.98 4.66,0.28 0,-2.13 -2.42,-3.16 -3.88,-1.82 -0.29,0.26 -0.78,1.09 -0.78,1.54 z"
     class="fil1 str1"
     inkscape:connector-curvature="0"
     style="fill:#000000;stroke:#000000;stroke-width:0.52999997" /><path
     id="path17"
     d="m 17.8,37.65 c 0,1.3 1.02,2.33 2.32,2.33 2.06,0 3,-2.57 1.62,-3.95 -1.38,-1.38 -3.94,-0.44 -3.94,1.62 z"
     class="fil1 str1"
     inkscape:connector-curvature="0"
     style="fill:#000000;stroke:#000000;stroke-width:0.52999997" /></g>
  </g>
  <rect
   class="fil2"
   x="0.050000001"
   y="0.27000001"
   width="71.099998"
   height="45.259998"
   id="rect20"
   style="fill:none" />
 </g>
</svg>