2020-11-09T05:27:35+00:00 DEBUG Order List Error ::3443 => Invalid order item.
2020-11-09T05:34:46+00:00 DEBUG Order List Error ::3443 => Invalid order item.
2020-11-09T05:39:43+00:00 DEBUG Order List Error ::3443 => Invalid order item.
2020-11-09T05:40:04+00:00 DEBUG Order List Error ::3443 => Invalid order item.
2020-11-09T05:40:33+00:00 DEBUG Order List Error ::3443 => Invalid order item.
2020-11-09T05:41:44+00:00 DEBUG Order List Error ::3443 => Invalid order item.
2020-11-09T05:45:55+00:00 DEBUG Order List Error ::3443 => Invalid order item.
2020-11-09T05:46:54+00:00 DEBUG Order List Error ::3443 => Invalid order item.
2020-11-09T05:48:16+00:00 DEBUG Order List Error ::3443 => Invalid order item.
2020-11-09T05:57:44+00:00 DEBUG Order List Error ::3443 => Invalid order item.
2020-11-09T05:58:45+00:00 DEBUG Order List Error ::3443 => Invalid order item.
2020-11-09T06:07:11+00:00 DEBUG Order List Error ::3443 => Invalid order item.
2020-11-09T06:08:06+00:00 DEBUG Order List Error ::3443 => Invalid order item.
2020-11-09T06:08:34+00:00 DEBUG Order List Error ::3443 => Invalid order item.
2020-11-09T06:09:50+00:00 DEBUG Order List Error ::3443 => Invalid order item.
2020-11-09T06:11:06+00:00 DEBUG Order List Error ::3443 => Invalid order item.
2020-11-09T06:36:53+00:00 DEBUG Order List Error ::3443 => Invalid order item.
2020-11-09T06:39:16+00:00 DEBUG Order List Error ::3443 => Invalid order item.
2020-11-09T08:29:23+00:00 DEBUG Order List Error ::3443 => Invalid order item.
2020-11-09T08:45:49+00:00 DEBUG Order List Error ::3443 => Invalid order item.
2020-11-09T08:46:25+00:00 DEBUG Order List Error ::3443 => Invalid order item.
2020-11-09T08:51:24+00:00 DEBUG Order List Error ::3443 => Invalid order item.
2020-11-09T08:51:53+00:00 DEBUG Order List Error ::3443 => Invalid order item.
2020-11-09T09:02:24+00:00 DEBUG Order List Error ::3443 => Invalid order item.
2020-11-09T09:03:30+00:00 DEBUG Order List Error ::3443 => Invalid order item.
2020-11-09T09:21:16+00:00 DEBUG Order List Error ::3443 => Invalid order item.
2020-11-09T09:33:13+00:00 DEBUG Order List Error ::3443 => Invalid order item.
2020-11-09T09:47:24+00:00 DEBUG Order List Error ::3443 => Invalid order item.
2020-11-09T09:47:28+00:00 DEBUG Order List Error ::3443 => Invalid order item.
2020-11-09T10:46:20+00:00 DEBUG Order List Error ::3443 => Invalid order item.
2020-11-09T10:48:59+00:00 DEBUG Order List Error ::3443 => Invalid order item.
2020-11-09T10:54:53+00:00 DEBUG Order List Error ::3443 => Invalid order item.
2020-11-09T10:55:21+00:00 DEBUG Order List Error ::3443 => Invalid order item.
