<?xml version="1.0" encoding="UTF-8"?>
<!DOCTYPE svg PUBLIC "-//W3C//DTD SVG 1.1//EN" "http://www.w3.org/Graphics/SVG/1.1/DTD/svg11.dtd">
<!-- Creator: CorelDRAW 2017 -->
<svg xmlns="http://www.w3.org/2000/svg" xml:space="preserve" width="1518px" height="1518px" version="1.1" style="shape-rendering:geometricPrecision; text-rendering:geometricPrecision; image-rendering:optimizeQuality; fill-rule:evenodd; clip-rule:evenodd"
viewBox="0 0 620.1 620.1"
 xmlns:xlink="http://www.w3.org/1999/xlink">
 <defs>
  <style type="text/css">
   <![CDATA[
    .fil1 {fill:#88BD30}
    .fil0 {fill:#FEFEFE}
    .fil2 {fill:white}
   ]]>
  </style>
 </defs>
 <g id="Layer_x0020_1">
  <metadata id="CorelCorpID_0Corel-Layer"/>
  <path class="fil0" d="M310.05 0c171.24,0 310.05,138.81 310.05,310.05 0,171.24 -138.81,310.05 -310.05,310.05 -171.24,0 -310.05,-138.81 -310.05,-310.05 0,-171.24 138.81,-310.05 310.05,-310.05zm0 9.13c166.19,0 300.92,134.73 300.92,300.92 0,166.19 -134.73,300.92 -300.92,300.92 -166.19,0 -300.92,-134.73 -300.92,-300.92 0,-166.19 134.73,-300.92 300.92,-300.92z"/>
  <path class="fil1" d="M310.05 37.5c150.49,0 272.51,122.02 272.51,272.59 0,150.49 -122.02,272.51 -272.51,272.51 -150.57,0 -272.51,-122.02 -272.51,-272.51 0,-150.57 121.94,-272.59 272.51,-272.59z"/>
  <g id="_2150457730512">
   <g>
    <path class="fil2" d="M269.49 206.27l0 28c0,5.33 2.09,4.28 11,5.63 4.51,0.68 10.39,1.87 14.75,1.96 0.55,-5.52 0.13,-13.25 0.12,-19 -0.01,-3.05 -0.75,-7.41 1.85,-8.19 3.84,-1.15 3.53,3.22 3.5,6.1l0 96.96c-0.03,6.91 1.01,11.22 8.24,11.22l67.99 0c6.93,0 8.27,-4 8.24,-10.7l-0.01 -97.48c-0.02,-2.88 -0.43,-6.71 3.1,-6.19 3.03,0.45 2.26,4.8 2.26,7.76 -0.02,5.89 -0.44,13.88 0.12,19.52l21.6 -2.93c3.43,-0.49 4.15,-0.94 4.15,-4.66l0 -28.52c0,-11.28 -8.32,-13.51 -16.54,-17.19 -3.88,-1.74 -7.82,-3.51 -11.79,-5.31 -3.6,-1.62 -8.43,-4.28 -12.16,-5.12 -2.73,3.85 -7.89,28 -32.7,28.18 -17.19,0.13 -29.59,-13.9 -32.73,-28.13 -3.36,0.24 -19.87,8.32 -24.09,10.21 -8.74,3.91 -16.9,6.04 -16.9,17.88l0 0z"/>
    <path class="fil2" d="M322.32 190.2c2.09,5.3 11.91,10.92 20.88,10.84 9.61,-0.1 17.64,-5.68 20.55,-10.84 -5.38,-3.14 -35.43,-2.53 -41.43,0z"/>
    <path class="fil2" d="M330.55 149.39c7.62,1.93 2.22,-6.32 8.62,-9.87 5.9,-3.27 11.92,1.81 13.57,4.87 4.51,8.43 -1.93,14.45 -7.62,18.7 -1.95,1.45 -3.23,2.88 -3.75,5.62 5.77,0.55 5.57,-0.05 9.23,-2.74 2,-1.47 4.57,-4.16 5.99,-6.48 3.93,-6.44 4.08,-13.43 -0.32,-19.68 -10.01,-14.23 -31.2,-3.24 -25.72,9.58l0 0z"/>
    <path class="fil2" d="M315.71 176.2c-0.02,3.08 2.04,6.64 2.9,8.96 3.54,-0.4 6.9,-1.27 10.59,-1.67 12.78,-1.4 12.18,2.2 11.73,-9.2 -5.65,-0.75 -20.34,-0.13 -25.22,1.91z"/>
    <path class="fil2" d="M367.08 185c1.29,-1.99 3.12,-6.16 3.1,-8.8 -5.04,-2.09 -17.91,-2.5 -23.78,-1.96 -0.43,9.77 -1.63,8.16 6.69,8.76 4.46,0.34 10.43,1.98 13.99,2z"/>
   </g>
   <g>
    <path class="fil2" d="M380.2 338.44c22.49,1.55 32.12,3.68 52.39,10.08 7.89,2.48 11.33,2.88 9.67,12.65 4.98,-2.52 3.18,-2.36 5,-1.33 -16.1,8.93 -3.02,12.41 -34.52,5.02 -6.53,-1.53 -11.46,-3.3 -18.19,-4.97 -7.47,-1.84 -13.84,-2.54 -12.21,-11.71 11.55,-3.65 40.02,11.91 53.02,8.4 0.78,3.12 -0.26,3.61 -0.86,4.41 -1.56,2.07 -1.06,1.01 -1.44,1.49 -2.07,-1.9 -41.79,-12.68 -46.87,-13.29 0.45,5.71 -0.59,6.23 12.21,9.31l33.46 8.16c5.99,-0.41 10.82,-5.89 8.34,-11.52 -2.59,-4.74 -25.14,-9.06 -30.41,-10.37 -8.75,-2.18 -27.75,-8.46 -33.64,-1.34 -2.54,5.16 -1.31,12.52 2.64,16.1 5.36,4.86 49.65,13.32 51.97,13.24 8.8,-0.26 16.17,-10.27 25.56,-17.62 5.65,-4.42 20.06,-14.87 20.4,-21.91l-9.04 8.79c1.2,-3.63 -0.04,-1.87 4.08,-6.21 1.63,-1.73 3.08,-3.12 3.57,-5.53 1.19,-5.87 -2.69,-10.06 -7.25,-11.45 -7.39,-2.23 -26.52,-4.78 -35.09,-4.51 -11.8,0.37 -17.87,5.8 -27.97,10.29 -8.77,3.91 -17.65,8.56 -24.82,13.82l0 0z"/>
    <path class="fil2" d="M361.29 372.52c12.97,-0.28 31.52,2.81 42.97,6.62 6.59,2.19 13.44,3.54 19.84,5.64 8.94,2.94 10.71,4.28 8.73,14.18l3.9 -0.9c-4.09,3.67 -7.97,7.84 -12.6,9.31 -6.07,1.92 -55.19,-12.02 -57.59,-13.62 -2.78,-1.84 -5.43,-6.17 -2.41,-9.43 6.02,-5.6 46.21,11.84 60.83,9.19 0.27,0.65 2.51,-1.28 -0.15,3.49 -1.32,2.36 -1.51,0.55 -2.16,3.07 -7.68,-2.6 -48.06,-15.61 -55.11,-14.56 1.55,9.95 17.56,11.01 33.96,14.96 5.92,1.43 33.54,13.42 29.48,-10.16 -10.18,-4.81 -49.98,-15.2 -63.85,-15.78 -17.2,-0.72 -14.52,16.42 -8.05,22.09 5.55,4.86 58.36,16.24 62.93,15.46 8.02,-1.36 13.52,-9.43 23.42,-16.93 9.1,-6.9 39.96,-29.46 41.1,-39.48l-1.32 1.42c-1.3,1.39 -0.67,0.86 -1.82,1.96 -1.88,1.8 -2.31,2.02 -4.65,3.41 4.08,-6.53 12.16,-16.57 -0.59,-22.65l-34.77 30.13c-13.02,11.36 -27.93,3.51 -52.08,-2.13 -12.86,-3.01 -14.29,-10.23 -30.01,4.71z"/>
    <path class="fil2" d="M343.38 411.22c16.36,-4.15 34.39,4.14 49.05,8.67 23.27,7.19 39.86,6.69 35.14,23.95 4.98,-3.16 37.07,-34.5 43.9,-40l22.92 -19.88c7.95,-7.5 11.65,-21.34 -3.51,-25.81l-14.52 14.71c-5.26,5.43 -10,8.67 -15.49,13.44l-31.81 26.01c-8.16,4.94 -15.96,2.64 -23.49,0.18 -6.66,-2.16 -16.79,-3.6 -23.71,-4.84 -6.79,-1.19 -17.7,-6.1 -22.2,-6.65 -3.56,-0.44 -12.6,8.17 -16.28,10.22l0 0z"/>
    <path class="fil2" d="M349.61 425.59c8.7,-1.68 27.01,3.82 35.37,6.37 16.46,5.04 20,6.36 34.2,5.45 0.52,2.98 -0.58,-2.33 -1.1,1.68 -0.16,1.16 -2.84,-1.29 2.01,2.63 -3.17,0.24 -3.57,0.34 -4.32,2.78 -0.02,0.07 0.02,0.4 -0.06,0.57 -5.16,-3.02 -54.84,-16.93 -62.24,-17.05 0.92,9.6 6.81,9.56 15.77,11.7 6.83,1.65 41.62,11.3 45.16,11.04 9.33,-0.67 17.3,-13.72 7.49,-18.77l-24.36 -7.76c-12.92,-3.86 -55.1,-20.75 -58.71,-5.18 -1.38,5.99 2.38,16.31 6.25,20.47 9.3,10.03 39.39,12.56 56.49,17.54 12.6,3.66 21,0.48 27.5,-6.62 4.21,-4.6 5.93,-5.04 9.79,-8.71l47.9 -44.55c3.73,-3.77 18.5,-13.38 15.66,-19.89 -10.17,11.62 -52.21,49.25 -67.03,62.16 -20.26,17.63 -11.91,16.82 -44.14,9.37 -8.99,-2.08 -16.4,-4.58 -25.11,-7.23 -8.82,-2.68 -17.91,-3.82 -16.52,-16l0 0z"/>
   </g>
   <g>
    <path class="fil2" d="M142.75 268.57l20.9 -0.09c10.92,-0.01 11.6,-1.37 12.12,3.44 -11.58,1.41 -16.72,0.83 -28.59,0.93l-0.24 20.22 24.78 0.1c4.21,-0.06 5.58,-1 6.66,2.63 -1.68,2.15 -0.79,1.61 -4.29,1.61l-28.1 0.06c-7.33,11.06 -14.67,13.78 -23.02,37.97 -11.42,33.09 -5.09,67.96 15.11,95.24 5.91,7.99 7.27,10 20.75,9.95 10.25,-0.05 20.5,0.05 30.76,-0.02 -1.45,-2.7 -4.23,-5.01 -6.26,-7.79 -1.97,-2.68 -3.81,-5.04 -5.64,-8 -25.03,-40.31 -20.67,-89.4 10.24,-126.44 3.4,-4.09 3.22,-3.53 3.14,-10.6 -0.05,-4.82 0.2,-9.69 -0.15,-14.48 -2.03,-1.01 -19.26,-2.66 -10.88,-19.62 -10.56,-0.88 -24,-0.09 -34.9,-0.16 -5.76,-0.04 -10.44,0.52 -11.31,6.22 -0.94,6.2 3.16,8.83 8.92,8.84l0 -0.01z"/>
    <path class="fil2" d="M167.25 351.66l64.72 0.13c3.78,-0.04 6.49,-0.95 8.3,1.87 -0.69,2.14 1.75,2.56 -8.3,2.43l-32 0.1 25.25 46.11c2.26,-2.27 3.47,-5.57 4.95,-8.64 1.72,-3.6 2.44,-7.64 6.06,-6.59l0.32 2.51c-0.33,2.41 -5.99,10.98 -6.71,15.15 3.38,0.07 6.77,0.05 10.15,0.02l7.9 0.31c0.24,0.06 0.45,0.17 0.66,0.25l1.19 0.64c1.66,4.71 -9.94,2.98 -14.57,2.98l-60.67 -0.02c1.22,4.97 3.99,8.86 6.12,12.95l28.88 0.25c4.84,-0.09 6.31,-1.04 6.42,3.08 -4.04,2.66 -25.22,0.75 -31.77,1.17 4.29,8.98 9.74,13.64 20.47,13.64 11.71,0 24,0.34 35.62,-0.19 -0.33,-6.75 1.53,-10.64 7.22,-12 -7.18,-15.09 2.51,-17.87 15.17,-18.11 -0.22,-2.03 -2.5,-7.44 -3.48,-9.29 -1.77,-3.35 -5.38,-2.98 -8.57,-5.1 -13.73,-9.11 -8.33,-39.02 -4.3,-41.02 5.55,-2.76 13.4,6.49 17.9,8.18 1.87,-24.15 -5.47,-23.99 13.89,-26.19 -1.43,-6.16 -5.97,-15.57 -9.07,-20.19 -22.9,-0.43 -46.23,-0.03 -69.18,-0.03 -23.13,0 -18.79,-2.75 -24.74,9.63 -3.04,6.32 -7.27,18.13 -7.83,25.97l0 0z"/>
    <path class="fil2" d="M319.41 451.7c-2.41,5.61 -12.45,-2.15 -14.32,-4 -6.81,-6.73 -5.33,-13.66 -8.84,-14.96 -1.55,2.05 7.43,17.29 8.46,19.37 5.53,11.01 3.16,13.61 -5.33,18.89 5.23,8 1.97,5.07 4.1,8.92 7.82,0.18 14.36,-2.17 19.2,-5.8 2.96,-2.23 3.08,-4.84 7.33,-5.42 3.94,-0.54 8.45,0.17 12.04,-0.58l0.56 -1.32c0.92,-3.96 -0.3,-32.26 -0.74,-34.17l-15.08 0.16c-4.23,-7.57 -2.52,-12.43 -9.08,-17 -6.4,-4.48 -15.2,-2.81 -23.87,-2.66 -8.32,0.14 -16.77,0.35 -24.98,0.61 -7.48,0.23 -20.5,-1.96 -19.59,7.41 0.99,10.13 19.47,3.04 30.95,2.94 9.2,-0.08 1.03,4.25 16.09,4.41 8.06,0.09 3.58,2.94 8.35,11.57 4.87,8.8 13.18,8.72 14.75,11.64l0 -0.01z"/>
    <path class="fil2" d="M231.79 271.73c-4.83,2.87 -28.52,0.37 -36.5,1.11l-0.09 20.12 58.68 0.1 0.11 -20.01 -7.63 -0.83c0.61,-8.65 12.81,0.09 18.7,-6 5.06,-5.24 1.41,-12.5 -6.54,-12.71 -5.22,-0.15 -68.7,-0.54 -71.64,0.54 -6.53,2.4 -5.9,12.33 0.38,14.06 2.9,0.79 29.42,0.42 35.87,0.36 5.03,-0.05 8.26,-1.4 8.66,3.26l0 0z"/>
    <path class="fil2" d="M268.46 348.84c-0.01,22.2 -1.93,12.44 6.27,24.58l42.14 -0.01c0.78,-10.76 0.4,-21.34 0.05,-32.12l-6.78 -0.59 -0.37 10.81c-3.79,-0.25 -3.67,0.28 -4.06,-3.37 -0.17,-1.6 0.09,-5.3 0.04,-7.26l-5.29 -0.09c-0.03,3.87 0.43,7.72 -0.82,10.44 -4.63,-0.4 -3.24,-1.23 -3.43,-10.39l-6.06 0.03c-0.01,3.45 0.75,7.66 -1.13,10.18 -2.77,-0.06 -2.72,0.65 -3.11,-2.96 -0.2,-1.82 0.03,-5.22 -0.05,-7.33l-5.95 -0.07c-0.07,2.16 0.08,4.53 0,6.6 -0.13,3.33 0.09,2.98 -2.15,4.3 -2.21,-1.34 -2.01,-1.02 -2.15,-4.31 -0.09,-2.11 0.07,-4.3 -0.05,-6.56 -7.74,-0.07 -7.1,0.82 -7.1,8.12l0 0z"/>
    <path class="fil2" d="M283.39 409.02c5.33,0.25 10.72,-0.17 16.08,-0.21 6.59,-0.05 9.15,0.5 12.54,-3.22 6.24,-6.89 5.53,-16.53 5.13,-27.82l-41.15 -0.09c0.91,15.7 -4.68,9 -0.19,17.29 2.42,4.46 4.69,10.28 7.59,14.05z"/>
    <path class="fil2" d="M173.27 404.58l47.93 0.18c-0.36,-2.16 -22.86,-43.39 -25.1,-45.94l-22.83 45.76 0 0z"/>
    <path class="fil2" d="M183.33 311.95l82.62 -0.08c-1.15,-3.29 -9.06,-13.97 -13.08,-14.6l-55.54 -0.08c-5.77,0.38 -13.33,12.5 -14,14.76z"/>
    <path class="fil2" d="M248.14 357.89c-1.7,5.46 -2.94,22.21 -0.51,27.53 3.01,6.61 12.54,12.98 20.39,5.92 6.35,-5.7 4.6,-15.93 -1.09,-21.22 -2.84,-2.63 -14.99,-11.98 -18.79,-12.23z"/>
    <path class="fil2" d="M170.88 399.23l21.47 -42.97 -25.95 -0.15c-0.77,11 -0.75,35.25 4.48,43.12l0 0z"/>
    <path class="fil2" d="M289.25 454.3c4.86,-12.31 -3.56,-10.87 -13.63,-9.68 -5.09,0.6 -22.74,1.68 -25.06,4.01 -2.32,2.32 -1.72,7.58 0.87,9.31 2.87,1.92 34.55,-2.84 37.82,-3.64l0 0z"/>
    <path class="fil2" d="M275.29 428.86c-8.39,0.97 -17.39,1.42 -25.64,2.74 -4.07,0.64 -6.19,3.16 -5.11,7.51 1.23,5.03 5.28,4.04 10.62,3.4 17.37,-2.12 33.52,-0.22 30.37,-10.55 -1.31,-4.28 -5.49,-3.64 -10.24,-3.1z"/>
    <path class="fil2" d="M287.73 459.18c-7.52,0.44 -15.59,1.86 -23,2.65 -4.44,0.48 -8.17,0.16 -8.92,4.42 -0.82,4.7 2.41,6.75 6.65,6.57 6.73,-0.29 16.14,-1.98 23.27,-2.81 4.01,-0.46 7.24,-0.62 7.76,-4.87 0.53,-4.18 -2.11,-6.18 -5.76,-5.96l0 0z"/>
    <path class="fil2" d="M288.43 473.99c-9.85,1.23 -30.7,0.22 -24.97,10.48 1.78,3.19 5.69,2.61 9.6,2.13 4.16,-0.5 19.66,-1.84 22.24,-2.95 3.71,-1.59 7.52,-11.47 -6.87,-9.66l0 0z"/>
    <path class="fil2" d="M288.97 439.65c6.3,4.86 7.16,7.43 4.26,16.07 0.74,0.8 2.77,2.96 3.46,4.34 1.26,2.56 0.77,4.44 1.97,6.41 8.21,-2.96 3.12,-10.76 0.46,-16.01 -2.83,-5.6 -5.74,-12.03 -8.69,-17.04l-1.46 6.23 0 0z"/>
    <path class="fil2" d="M263.07 398.67l1.82 5.1 8.7 -3.54 -2.35 -5.52c-2.42,0.86 -5.87,2.53 -8.17,3.96z"/>
   </g>
  </g>
 </g>
</svg>
