2020-11-04T10:55:53+00:00 CRITICAL Uncaught Error: Call to a member function get_cart_contents_count() on null in /var/www/html/new/digi/wp-content/themes/woodmart/inc/integrations/woocommerce/template-tags.php:986
Stack trace:
#0 /var/www/html/new/digi/wp-content/themes/woodmart/header-elements/cart.php(33): woodmart_cart_count()
#1 /var/www/html/new/digi/wp-content/themes/woodmart/inc/builder/elements/abstract/Element.php(57): require('/var/www/html/n...')
#2 /var/www/html/new/digi/wp-content/themes/woodmart/inc/builder/Frontend.php(127): WOODMART_HB_Element->render(Array, '')
#3 /var/www/html/new/digi/wp-content/themes/woodmart/inc/builder/Frontend.php(116): WOODMART_HB_Frontend->_render_element(Array)
#4 /var/www/html/new/digi/wp-content/themes/woodmart/inc/builder/Frontend.php(116): WOODMART_HB_Frontend->_render_element(Array)
#5 /var/www/html/new/digi/wp-content/themes/woodmart/inc/builder/Frontend.php(116): WOODMART_HB_Frontend->_render_element(Array)
#6 /var/www/html/new/digi/wp-content/themes/woodmart/inc/builder/Frontend.php(103): WO in /var/www/html/new/digi/wp-content/themes/woodmart/inc/integrations/woocommerce/template-tags.php on line 986

2020-11-04T10:56:21+00:00 CRITICAL Uncaught Error: Call to a member function get_cart_contents_count() on null in /var/www/html/new/digi/wp-content/themes/woodmart/inc/integrations/woocommerce/template-tags.php:986
Stack trace:
#0 /var/www/html/new/digi/wp-content/themes/woodmart/header-elements/cart.php(33): woodmart_cart_count()
#1 /var/www/html/new/digi/wp-content/themes/woodmart/inc/builder/elements/abstract/Element.php(57): require('/var/www/html/n...')
#2 /var/www/html/new/digi/wp-content/themes/woodmart/inc/builder/Frontend.php(127): WOODMART_HB_Element->render(Array, '')
#3 /var/www/html/new/digi/wp-content/themes/woodmart/inc/builder/Frontend.php(116): WOODMART_HB_Frontend->_render_element(Array)
#4 /var/www/html/new/digi/wp-content/themes/woodmart/inc/builder/Frontend.php(116): WOODMART_HB_Frontend->_render_element(Array)
#5 /var/www/html/new/digi/wp-content/themes/woodmart/inc/builder/Frontend.php(116): WOODMART_HB_Frontend->_render_element(Array)
#6 /var/www/html/new/digi/wp-content/themes/woodmart/inc/builder/Frontend.php(103): WO in /var/www/html/new/digi/wp-content/themes/woodmart/inc/integrations/woocommerce/template-tags.php on line 986

2020-11-04T10:56:34+00:00 CRITICAL Uncaught Error: Call to a member function get_cart_contents_count() on null in /var/www/html/new/digi/wp-content/themes/woodmart/inc/integrations/woocommerce/template-tags.php:986
Stack trace:
#0 /var/www/html/new/digi/wp-content/themes/woodmart/header-elements/cart.php(33): woodmart_cart_count()
#1 /var/www/html/new/digi/wp-content/themes/woodmart/inc/builder/elements/abstract/Element.php(57): require('/var/www/html/n...')
#2 /var/www/html/new/digi/wp-content/themes/woodmart/inc/builder/Frontend.php(127): WOODMART_HB_Element->render(Array, '')
#3 /var/www/html/new/digi/wp-content/themes/woodmart/inc/builder/Frontend.php(116): WOODMART_HB_Frontend->_render_element(Array)
#4 /var/www/html/new/digi/wp-content/themes/woodmart/inc/builder/Frontend.php(116): WOODMART_HB_Frontend->_render_element(Array)
#5 /var/www/html/new/digi/wp-content/themes/woodmart/inc/builder/Frontend.php(116): WOODMART_HB_Frontend->_render_element(Array)
#6 /var/www/html/new/digi/wp-content/themes/woodmart/inc/builder/Frontend.php(103): WO in /var/www/html/new/digi/wp-content/themes/woodmart/inc/integrations/woocommerce/template-tags.php on line 986

2020-11-04T10:56:57+00:00 CRITICAL Uncaught Error: Call to a member function get_cart_contents_count() on null in /var/www/html/new/digi/wp-content/themes/woodmart/inc/integrations/woocommerce/template-tags.php:986
Stack trace:
#0 /var/www/html/new/digi/wp-content/themes/woodmart/header-elements/cart.php(33): woodmart_cart_count()
#1 /var/www/html/new/digi/wp-content/themes/woodmart/inc/builder/elements/abstract/Element.php(57): require('/var/www/html/n...')
#2 /var/www/html/new/digi/wp-content/themes/woodmart/inc/builder/Frontend.php(127): WOODMART_HB_Element->render(Array, '')
#3 /var/www/html/new/digi/wp-content/themes/woodmart/inc/builder/Frontend.php(116): WOODMART_HB_Frontend->_render_element(Array)
#4 /var/www/html/new/digi/wp-content/themes/woodmart/inc/builder/Frontend.php(116): WOODMART_HB_Frontend->_render_element(Array)
#5 /var/www/html/new/digi/wp-content/themes/woodmart/inc/builder/Frontend.php(116): WOODMART_HB_Frontend->_render_element(Array)
#6 /var/www/html/new/digi/wp-content/themes/woodmart/inc/builder/Frontend.php(103): WO in /var/www/html/new/digi/wp-content/themes/woodmart/inc/integrations/woocommerce/template-tags.php on line 986

2020-11-04T10:57:03+00:00 CRITICAL Uncaught Error: Call to a member function get_cart_contents_count() on null in /var/www/html/new/digi/wp-content/themes/woodmart/inc/integrations/woocommerce/template-tags.php:986
Stack trace:
#0 /var/www/html/new/digi/wp-content/themes/woodmart/header-elements/cart.php(33): woodmart_cart_count()
#1 /var/www/html/new/digi/wp-content/themes/woodmart/inc/builder/elements/abstract/Element.php(57): require('/var/www/html/n...')
#2 /var/www/html/new/digi/wp-content/themes/woodmart/inc/builder/Frontend.php(127): WOODMART_HB_Element->render(Array, '')
#3 /var/www/html/new/digi/wp-content/themes/woodmart/inc/builder/Frontend.php(116): WOODMART_HB_Frontend->_render_element(Array)
#4 /var/www/html/new/digi/wp-content/themes/woodmart/inc/builder/Frontend.php(116): WOODMART_HB_Frontend->_render_element(Array)
#5 /var/www/html/new/digi/wp-content/themes/woodmart/inc/builder/Frontend.php(116): WOODMART_HB_Frontend->_render_element(Array)
#6 /var/www/html/new/digi/wp-content/themes/woodmart/inc/builder/Frontend.php(103): WO in /var/www/html/new/digi/wp-content/themes/woodmart/inc/integrations/woocommerce/template-tags.php on line 986

2020-11-04T10:57:09+00:00 CRITICAL Uncaught Error: Call to a member function get_cart_contents_count() on null in /var/www/html/new/digi/wp-content/themes/woodmart/inc/integrations/woocommerce/template-tags.php:986
Stack trace:
#0 /var/www/html/new/digi/wp-content/themes/woodmart/header-elements/cart.php(33): woodmart_cart_count()
#1 /var/www/html/new/digi/wp-content/themes/woodmart/inc/builder/elements/abstract/Element.php(57): require('/var/www/html/n...')
#2 /var/www/html/new/digi/wp-content/themes/woodmart/inc/builder/Frontend.php(127): WOODMART_HB_Element->render(Array, '')
#3 /var/www/html/new/digi/wp-content/themes/woodmart/inc/builder/Frontend.php(116): WOODMART_HB_Frontend->_render_element(Array)
#4 /var/www/html/new/digi/wp-content/themes/woodmart/inc/builder/Frontend.php(116): WOODMART_HB_Frontend->_render_element(Array)
#5 /var/www/html/new/digi/wp-content/themes/woodmart/inc/builder/Frontend.php(116): WOODMART_HB_Frontend->_render_element(Array)
#6 /var/www/html/new/digi/wp-content/themes/woodmart/inc/builder/Frontend.php(103): WO in /var/www/html/new/digi/wp-content/themes/woodmart/inc/integrations/woocommerce/template-tags.php on line 986

2020-11-04T10:57:24+00:00 CRITICAL Uncaught Error: Call to a member function get_cart_contents_count() on null in /var/www/html/new/digi/wp-content/themes/woodmart/inc/integrations/woocommerce/template-tags.php:986
Stack trace:
#0 /var/www/html/new/digi/wp-content/themes/woodmart/header-elements/cart.php(33): woodmart_cart_count()
#1 /var/www/html/new/digi/wp-content/themes/woodmart/inc/builder/elements/abstract/Element.php(57): require('/var/www/html/n...')
#2 /var/www/html/new/digi/wp-content/themes/woodmart/inc/builder/Frontend.php(127): WOODMART_HB_Element->render(Array, '')
#3 /var/www/html/new/digi/wp-content/themes/woodmart/inc/builder/Frontend.php(116): WOODMART_HB_Frontend->_render_element(Array)
#4 /var/www/html/new/digi/wp-content/themes/woodmart/inc/builder/Frontend.php(116): WOODMART_HB_Frontend->_render_element(Array)
#5 /var/www/html/new/digi/wp-content/themes/woodmart/inc/builder/Frontend.php(116): WOODMART_HB_Frontend->_render_element(Array)
#6 /var/www/html/new/digi/wp-content/themes/woodmart/inc/builder/Frontend.php(103): WO in /var/www/html/new/digi/wp-content/themes/woodmart/inc/integrations/woocommerce/template-tags.php on line 986

2020-11-04T10:57:27+00:00 CRITICAL Uncaught Error: Call to a member function get_cart_contents_count() on null in /var/www/html/new/digi/wp-content/themes/woodmart/inc/integrations/woocommerce/template-tags.php:986
Stack trace:
#0 /var/www/html/new/digi/wp-content/themes/woodmart/header-elements/cart.php(33): woodmart_cart_count()
#1 /var/www/html/new/digi/wp-content/themes/woodmart/inc/builder/elements/abstract/Element.php(57): require('/var/www/html/n...')
#2 /var/www/html/new/digi/wp-content/themes/woodmart/inc/builder/Frontend.php(127): WOODMART_HB_Element->render(Array, '')
#3 /var/www/html/new/digi/wp-content/themes/woodmart/inc/builder/Frontend.php(116): WOODMART_HB_Frontend->_render_element(Array)
#4 /var/www/html/new/digi/wp-content/themes/woodmart/inc/builder/Frontend.php(116): WOODMART_HB_Frontend->_render_element(Array)
#5 /var/www/html/new/digi/wp-content/themes/woodmart/inc/builder/Frontend.php(116): WOODMART_HB_Frontend->_render_element(Array)
#6 /var/www/html/new/digi/wp-content/themes/woodmart/inc/builder/Frontend.php(103): WO in /var/www/html/new/digi/wp-content/themes/woodmart/inc/integrations/woocommerce/template-tags.php on line 986

2020-11-04T10:57:28+00:00 CRITICAL Uncaught Error: Call to a member function get_cart_contents_count() on null in /var/www/html/new/digi/wp-content/themes/woodmart/inc/integrations/woocommerce/template-tags.php:986
Stack trace:
#0 /var/www/html/new/digi/wp-content/themes/woodmart/header-elements/cart.php(33): woodmart_cart_count()
#1 /var/www/html/new/digi/wp-content/themes/woodmart/inc/builder/elements/abstract/Element.php(57): require('/var/www/html/n...')
#2 /var/www/html/new/digi/wp-content/themes/woodmart/inc/builder/Frontend.php(127): WOODMART_HB_Element->render(Array, '')
#3 /var/www/html/new/digi/wp-content/themes/woodmart/inc/builder/Frontend.php(116): WOODMART_HB_Frontend->_render_element(Array)
#4 /var/www/html/new/digi/wp-content/themes/woodmart/inc/builder/Frontend.php(116): WOODMART_HB_Frontend->_render_element(Array)
#5 /var/www/html/new/digi/wp-content/themes/woodmart/inc/builder/Frontend.php(116): WOODMART_HB_Frontend->_render_element(Array)
#6 /var/www/html/new/digi/wp-content/themes/woodmart/inc/builder/Frontend.php(103): WO in /var/www/html/new/digi/wp-content/themes/woodmart/inc/integrations/woocommerce/template-tags.php on line 986

2020-11-04T10:57:29+00:00 CRITICAL Uncaught Error: Call to a member function get_cart_contents_count() on null in /var/www/html/new/digi/wp-content/themes/woodmart/inc/integrations/woocommerce/template-tags.php:986
Stack trace:
#0 /var/www/html/new/digi/wp-content/themes/woodmart/header-elements/cart.php(33): woodmart_cart_count()
#1 /var/www/html/new/digi/wp-content/themes/woodmart/inc/builder/elements/abstract/Element.php(57): require('/var/www/html/n...')
#2 /var/www/html/new/digi/wp-content/themes/woodmart/inc/builder/Frontend.php(127): WOODMART_HB_Element->render(Array, '')
#3 /var/www/html/new/digi/wp-content/themes/woodmart/inc/builder/Frontend.php(116): WOODMART_HB_Frontend->_render_element(Array)
#4 /var/www/html/new/digi/wp-content/themes/woodmart/inc/builder/Frontend.php(116): WOODMART_HB_Frontend->_render_element(Array)
#5 /var/www/html/new/digi/wp-content/themes/woodmart/inc/builder/Frontend.php(116): WOODMART_HB_Frontend->_render_element(Array)
#6 /var/www/html/new/digi/wp-content/themes/woodmart/inc/builder/Frontend.php(103): WO in /var/www/html/new/digi/wp-content/themes/woodmart/inc/integrations/woocommerce/template-tags.php on line 986

