[
    {
      "name": "Ада",
      "postal_code": 24430
    },
    {
      "name": "Адашевци",
      "postal_code": 22244
    },
    {
      "name": "Адорјан",
      "postal_code": 24425
    },
    {
      "name": "Адрани",
      "postal_code": 36203
    },
    {
      "name": "Азања",
      "postal_code": 11423
    },
    {
      "name": "Алекса Шантић",
      "postal_code": 25212
    },
    {
      "name": "Александровац",
      "postal_code": 12370
    },
    {
      "name": "Александровац",
      "postal_code": 37230
    },
    {
      "name": "Александрово",
      "postal_code": 23217
    },
    {
      "name": "Алексинац",
      "postal_code": 18220
    },
    {
      "name": "Алексиначки Рудник",
      "postal_code": 18226
    },
    {
      "name": "Алибунар",
      "postal_code": 26310
    },
    {
      "name": "Аљиновићи",
      "postal_code": 31307
    },
    {
      "name": "Апатин",
      "postal_code": 25260
    },
    {
      "name": "Арадац",
      "postal_code": 23207
    },
    {
      "name": "Аранђеловац",
      "postal_code": 34300
    },
    {
      "name": "Ариље",
      "postal_code": 31230
    },
    {
      "name": "Ашања",
      "postal_code": 22418
    },
    {
      "name": "Бабушница",
      "postal_code": 18330
    },
    {
      "name": "Баваниште",
      "postal_code": 26222
    },
    {
      "name": "Багрдан",
      "postal_code": 35204
    },
    {
      "name": "Бадњевац",
      "postal_code": 34226
    },
    {
      "name": "Бадовинци",
      "postal_code": 15358
    },
    {
      "name": "Бајина Башта",
      "postal_code": 31250
    },
    {
      "name": "Бајмок",
      "postal_code": 24210
    },
    {
      "name": "Бајша",
      "postal_code": 24331
    },
    {
      "name": "Балајнац",
      "postal_code": 18257
    },
    {
      "name": "Баљевац",
      "postal_code": 36344
    },
    {
      "name": "Банатска Дубица",
      "postal_code": 23251
    },
    {
      "name": "Банатска Паланка",
      "postal_code": 26324
    },
    {
      "name": "Банатска Суботица",
      "postal_code": 26327
    },
    {
      "name": "Банатска Топола",
      "postal_code": 23315
    },
    {
      "name": "Банатски Брестовац",
      "postal_code": 26234
    },
    {
      "name": "Банатски Двор",
      "postal_code": 23213
    },
    {
      "name": "Банатски Деспотовац",
      "postal_code": 23242
    },
    {
      "name": "Банатски Карловац",
      "postal_code": 26320
    },
    {
      "name": "Банатско Аранђелово",
      "postal_code": 23332
    },
    {
      "name": "Банатско Велико Село",
      "postal_code": 23312
    },
    {
      "name": "Банатско Карађорђево",
      "postal_code": 23216
    },
    {
      "name": "Банатско Ново Село",
      "postal_code": 26314
    },
    {
      "name": "Баново Поље",
      "postal_code": 15362
    },
    {
      "name": "Бановци-Дунав",
      "postal_code": 22303
    },
    {
      "name": "Баноштор",
      "postal_code": 21312
    },
    {
      "name": "Бања",
      "postal_code": 34304
    },
    {
      "name": "Бања (код Прибоја)",
      "postal_code": 31337
    },
    {
      "name": "Бања Ковиљача",
      "postal_code": 15316
    },
    {
      "name": "Бањани",
      "postal_code": 14214
    },
    {
      "name": "Бањска",
      "postal_code": 38216
    },
    {
      "name": "Барајево",
      "postal_code": 11460
    },
    {
      "name": "Баранда",
      "postal_code": 26205
    },
    {
      "name": "Барбатовац",
      "postal_code": 18426
    },
    {
      "name": "Баре",
      "postal_code": 12227
    },
    {
      "name": "Баре",
      "postal_code": 34205
    },
    {
      "name": "Баре",
      "postal_code": 36315
    },
    {
      "name": "Барице",
      "postal_code": 26367
    },
    {
      "name": "Барич",
      "postal_code": 11504
    },
    {
      "name": "Барлово",
      "postal_code": 18432
    },
    {
      "name": "Барошевац",
      "postal_code": 11565
    },
    {
      "name": "Баточина",
      "postal_code": 34227
    },
    {
      "name": "Батровци",
      "postal_code": 22251
    },
    {
      "name": "Батусе",
      "postal_code": 38210
    },
    {
      "name": "Бач",
      "postal_code": 21420
    },
    {
      "name": "Бачевци",
      "postal_code": 31258
    },
    {
      "name": "Бачина",
      "postal_code": 37265
    },
    {
      "name": "Бачинци",
      "postal_code": 22225
    },
    {
      "name": "Бачка Паланка",
      "postal_code": 21400
    },
    {
      "name": "Бачка Топола",
      "postal_code": 24300
    },
    {
      "name": "Бачки Брег",
      "postal_code": 25275
    },
    {
      "name": "Бачки Брестовац",
      "postal_code": 25242
    },
    {
      "name": "Бачки Виногради",
      "postal_code": 24415
    },
    {
      "name": "Бачки Грачац",
      "postal_code": 25252
    },
    {
      "name": "Бачки Јарак",
      "postal_code": 21234
    },
    {
      "name": "Бачки Моноштор",
      "postal_code": 25272
    },
    {
      "name": "Бачки Петровац",
      "postal_code": 21470
    },
    {
      "name": "Бачки Соколац",
      "postal_code": 24343
    },
    {
      "name": "Бачко Градиште",
      "postal_code": 21217
    },
    {
      "name": "Бачко Добро Поље",
      "postal_code": 21465
    },
    {
      "name": "Бачко Ново Село",
      "postal_code": 21429
    },
    {
      "name": "Бачко Петрово Село",
      "postal_code": 21226
    },
    {
      "name": "Башаид",
      "postal_code": 23316
    },
    {
      "name": "Бегеч",
      "postal_code": 21411
    },
    {
      "name": "Бездан",
      "postal_code": 25270
    },
    {
      "name": "Бела Вода",
      "postal_code": 37253
    },
    {
      "name": "Бела Земља",
      "postal_code": 31311
    },
    {
      "name": "Бела Паланка",
      "postal_code": 18310
    },
    {
      "name": "Бела Црква",
      "postal_code": 15313
    },
    {
      "name": "Бела Црква",
      "postal_code": 26340
    },
    {
      "name": "Белановица",
      "postal_code": 14246
    },
    {
      "name": "Беле Воде",
      "postal_code": 32259
    },
    {
      "name": "Белегиш",
      "postal_code": 22306
    },
    {
      "name": "Бели Поток",
      "postal_code": 11223
    },
    {
      "name": "Бели Поток",
      "postal_code": 19366
    },
    {
      "name": "Бело Блато",
      "postal_code": 23205
    },
    {
      "name": "Белољин",
      "postal_code": 18424
    },
    {
      "name": "Белосавци",
      "postal_code": 34312
    },
    {
      "name": "Белотинац",
      "postal_code": 18411
    },
    {
      "name": "Белошевац",
      "postal_code": 34208
    },
    {
      "name": "Белушић",
      "postal_code": 35263
    },
    {
      "name": "Бељина",
      "postal_code": 11461
    },
    {
      "name": "Београд",
      "postal_code": 11000
    },
    {
      "name": "Беочин",
      "postal_code": 21300
    },
    {
      "name": "Беркасово",
      "postal_code": 22242
    },
    {
      "name": "Бечеј",
      "postal_code": 21220
    },
    {
      "name": "Бешеново",
      "postal_code": 22212
    },
    {
      "name": "Бешка",
      "postal_code": 22324
    },
    {
      "name": "Бигреница",
      "postal_code": 35238
    },
    {
      "name": "Бикић До",
      "postal_code": 22254
    },
    {
      "name": "Биково",
      "postal_code": 24206
    },
    {
      "name": "Биљача",
      "postal_code": 17522
    },
    {
      "name": "Бингула",
      "postal_code": 22253
    },
    {
      "name": "Биоска",
      "postal_code": 31241
    },
    {
      "name": "Бистар",
      "postal_code": 17546
    },
    {
      "name": "Бистрица",
      "postal_code": 31325
    },
    {
      "name": "Блажево",
      "postal_code": 37226
    },
    {
      "name": "Блаце",
      "postal_code": 18420
    },
    {
      "name": "Бобово",
      "postal_code": 35217
    },
    {
      "name": "Богараш",
      "postal_code": 24408
    },
    {
      "name": "Богатић",
      "postal_code": 15350
    },
    {
      "name": "Боговађа",
      "postal_code": 14225
    },
    {
      "name": "Боговина",
      "postal_code": 19372
    },
    {
      "name": "Богојево",
      "postal_code": 25245
    },
    {
      "name": "Богојевце",
      "postal_code": 16254
    },
    {
      "name": "Богутовац",
      "postal_code": 36341
    },
    {
      "name": "Бођани",
      "postal_code": 21427
    },
    {
      "name": "Божевац",
      "postal_code": 12313
    },
    {
      "name": "Божетићи",
      "postal_code": 31322
    },
    {
      "name": "Божица",
      "postal_code": 17537
    },
    {
      "name": "Бојник",
      "postal_code": 16205
    },
    {
      "name": "Бока",
      "postal_code": 23252
    },
    {
      "name": "Бољевац",
      "postal_code": 19370
    },
    {
      "name": "Бољковци",
      "postal_code": 32312
    },
    {
      "name": "Бор",
      "postal_code": 19210
    },
    {
      "name": "Борски Брестовац",
      "postal_code": 19229
    },
    {
      "name": "Босилеград",
      "postal_code": 17540
    },
    {
      "name": "Босут",
      "postal_code": 22217
    },
    {
      "name": "Ботош",
      "postal_code": 23243
    },
    {
      "name": "Бочар",
      "postal_code": 23274
    },
    {
      "name": "Бошњане",
      "postal_code": 37262
    },
    {
      "name": "Бошњаце",
      "postal_code": 16232
    },
    {
      "name": "Брадарац",
      "postal_code": 12206
    },
    {
      "name": "Браничево",
      "postal_code": 12222
    },
    {
      "name": "Бранковина",
      "postal_code": 14201
    },
    {
      "name": "Братљево",
      "postal_code": 32256
    },
    {
      "name": "Браћевац",
      "postal_code": 19315
    },
    {
      "name": "Брвеник",
      "postal_code": 36346
    },
    {
      "name": "Бргуле",
      "postal_code": 14212
    },
    {
      "name": "Брђани",
      "postal_code": 32303
    },
    {
      "name": "Брежђе",
      "postal_code": 14244
    },
    {
      "name": "Брезјак",
      "postal_code": 15309
    },
    {
      "name": "Брезна",
      "postal_code": 32307
    },
    {
      "name": "Брезова",
      "postal_code": 32253
    },
    {
      "name": "Брезовица",
      "postal_code": 38157
    },
    {
      "name": "Бреково",
      "postal_code": 31234
    },
    {
      "name": "Бресница",
      "postal_code": 32213
    },
    {
      "name": "Брестовац",
      "postal_code": 16253
    },
    {
      "name": "Брестовачка Бања",
      "postal_code": 19216
    },
    {
      "name": "Брза Паланка",
      "postal_code": 19323
    },
    {
      "name": "Брзи Брод",
      "postal_code": 18116
    },
    {
      "name": "Брзан",
      "postal_code": 34228
    },
    {
      "name": "Брзеће",
      "postal_code": 37225
    },
    {
      "name": "Бродарево",
      "postal_code": 31305
    },
    {
      "name": "Брус",
      "postal_code": 37220
    },
    {
      "name": "Брусник",
      "postal_code": 19313
    },
    {
      "name": "Будисава",
      "postal_code": 21242
    },
    {
      "name": "Буђановци",
      "postal_code": 22421
    },
    {
      "name": "Бујановац",
      "postal_code": 17520
    },
    {
      "name": "Буковац",
      "postal_code": 21209
    },
    {
      "name": "Буковик",
      "postal_code": 34301
    },
    {
      "name": "Буковица",
      "postal_code": 32251
    },
    {
      "name": "Букоровац",
      "postal_code": 34217
    },
    {
      "name": "Бунар",
      "postal_code": 35273
    },
    {
      "name": "Бурдимо",
      "postal_code": 18368
    },
    {
      "name": "Буровац",
      "postal_code": 12307
    },
    {
      "name": "Бусиловац",
      "postal_code": 35249
    },
    {
      "name": "Бучје",
      "postal_code": 19369
    },
    {
      "name": "Вајска",
      "postal_code": 21426
    },
    {
      "name": "Ваљево",
      "postal_code": 14000
    },
    {
      "name": "Варварин",
      "postal_code": 37260
    },
    {
      "name": "Варда",
      "postal_code": 31263
    },
    {
      "name": "Варна",
      "postal_code": 15232
    },
    {
      "name": "Варош",
      "postal_code": 18363
    },
    {
      "name": "Васиљ",
      "postal_code": 19367
    },
    {
      "name": "Ватин",
      "postal_code": 26337
    },
    {
      "name": "Вашица",
      "postal_code": 22241
    },
    {
      "name": "Велебит",
      "postal_code": 24428
    },
    {
      "name": "Велесница",
      "postal_code": 19328
    },
    {
      "name": "Велика Врбница",
      "postal_code": 37233
    },
    {
      "name": "Велика Грабовница",
      "postal_code": 16221
    },
    {
      "name": "Велика Греда",
      "postal_code": 26366
    },
    {
      "name": "Велика Дренова",
      "postal_code": 37245
    },
    {
      "name": "Велика Иванча",
      "postal_code": 11414
    },
    {
      "name": "Велика Јасикова",
      "postal_code": 19235
    },
    {
      "name": "Велика Крсна",
      "postal_code": 11408
    },
    {
      "name": "Велика Ломница",
      "postal_code": 37209
    },
    {
      "name": "Велика Моштаница",
      "postal_code": 11262
    },
    {
      "name": "Велика Плана",
      "postal_code": 11320
    },
    {
      "name": "Велика Плана",
      "postal_code": 18403
    },
    {
      "name": "Велика Река",
      "postal_code": 15322
    },
    {
      "name": "Велики Борак",
      "postal_code": 11462
    },
    {
      "name": "Велики Гај",
      "postal_code": 26365
    },
    {
      "name": "Велики Извор",
      "postal_code": 19206
    },
    {
      "name": "Велики Поповић",
      "postal_code": 35223
    },
    {
      "name": "Велики Радинци",
      "postal_code": 22211
    },
    {
      "name": "Велики Трновац",
      "postal_code": 17528
    },
    {
      "name": "Велики Црљени",
      "postal_code": 11563
    },
    {
      "name": "Велики Шиљеговац",
      "postal_code": 37204
    },
    {
      "name": "Велико Боњинце",
      "postal_code": 18215
    },
    {
      "name": "Велико Градиште",
      "postal_code": 12220
    },
    {
      "name": "Велико Лаоле",
      "postal_code": 12306
    },
    {
      "name": "Велико Орашје",
      "postal_code": 11323
    },
    {
      "name": "Велико Средиште",
      "postal_code": 26334
    },
    {
      "name": "Венчане",
      "postal_code": 34306
    },
    {
      "name": "Ветерник",
      "postal_code": 21203
    },
    {
      "name": "Вилово",
      "postal_code": 21246
    },
    {
      "name": "Вина",
      "postal_code": 19368
    },
    {
      "name": "Вионица",
      "postal_code": 32254
    },
    {
      "name": "Височка Ржана",
      "postal_code": 18306
    },
    {
      "name": "Витановац",
      "postal_code": 36206
    },
    {
      "name": "Витковац",
      "postal_code": 36207
    },
    {
      "name": "Витошевац",
      "postal_code": 37213
    },
    {
      "name": "Вича",
      "postal_code": 32233
    },
    {
      "name": "Вишњевац",
      "postal_code": 24222
    },
    {
      "name": "Вишњићево",
      "postal_code": 22246
    },
    {
      "name": "Владимировац",
      "postal_code": 26315
    },
    {
      "name": "Владимирци",
      "postal_code": 15225
    },
    {
      "name": "Владичин Хан",
      "postal_code": 17510
    },
    {
      "name": "Влајковац",
      "postal_code": 26332
    },
    {
      "name": "Власе",
      "postal_code": 17507
    },
    {
      "name": "Власотинце",
      "postal_code": 16210
    },
    {
      "name": "Влашка",
      "postal_code": 11406
    },
    {
      "name": "Вогањ",
      "postal_code": 22429
    },
    {
      "name": "Водањ",
      "postal_code": 11328
    },
    {
      "name": "Војвода Степа",
      "postal_code": 23219
    },
    {
      "name": "Војводинци",
      "postal_code": 26338
    },
    {
      "name": "Војка",
      "postal_code": 22313
    },
    {
      "name": "Војска",
      "postal_code": 35208
    },
    {
      "name": "Волуја",
      "postal_code": 12256
    },
    {
      "name": "Вражогрнац",
      "postal_code": 19312
    },
    {
      "name": "Вранић",
      "postal_code": 11427
    },
    {
      "name": "Враново",
      "postal_code": 11329
    },
    {
      "name": "Врање",
      "postal_code": 17501
    },
    {
      "name": "Врањска Бања",
      "postal_code": 17541
    },
    {
      "name": "Вратарница",
      "postal_code": 19344
    },
    {
      "name": "Враћевшница",
      "postal_code": 32315
    },
    {
      "name": "Врачев Гај",
      "postal_code": 26348
    },
    {
      "name": "Врба",
      "postal_code": 36214
    },
    {
      "name": "Врбас",
      "postal_code": 21460
    },
    {
      "name": "Врбица",
      "postal_code": 23329
    },
    {
      "name": "Врбовац",
      "postal_code": 38263
    },
    {
      "name": "Врдник",
      "postal_code": 22408
    },
    {
      "name": "Вреоци",
      "postal_code": 11560
    },
    {
      "name": "Врмџа",
      "postal_code": 18236
    },
    {
      "name": "Врњачка Бања",
      "postal_code": 36210
    },
    {
      "name": "Врњци",
      "postal_code": 36217
    },
    {
      "name": "Врћеновица",
      "postal_code": 18221
    },
    {
      "name": "Врхпоље",
      "postal_code": 15324
    },
    {
      "name": "Вршац",
      "postal_code": 26300
    },
    {
      "name": "Вуковац",
      "postal_code": 12318
    },
    {
      "name": "Вучје",
      "postal_code": 16203
    },
    {
      "name": "Гај",
      "postal_code": 26223
    },
    {
      "name": "Гајдобра",
      "postal_code": 21432
    },
    {
      "name": "Гаково",
      "postal_code": 25282
    },
    {
      "name": "Гамзиградска Бања",
      "postal_code": 19228
    },
    {
      "name": "Гардиновци",
      "postal_code": 21247
    },
    {
      "name": "Гаџин Хан",
      "postal_code": 18240
    },
    {
      "name": "Гибарац",
      "postal_code": 22258
    },
    {
      "name": "Главинци",
      "postal_code": 35261
    },
    {
      "name": "Глободер",
      "postal_code": 37251
    },
    {
      "name": "Глоговац",
      "postal_code": 35222
    },
    {
      "name": "Глогоњ",
      "postal_code": 26202
    },
    {
      "name": "Гложан",
      "postal_code": 21412
    },
    {
      "name": "Глушци",
      "postal_code": 15356
    },
    {
      "name": "Гњилан",
      "postal_code": 18309
    },
    {
      "name": "Голобок",
      "postal_code": 11316
    },
    {
      "name": "Голубац",
      "postal_code": 12223
    },
    {
      "name": "Голубинци",
      "postal_code": 22308
    },
    {
      "name": "Горачићи",
      "postal_code": 32232
    },
    {
      "name": "Горња Добриња",
      "postal_code": 31214
    },
    {
      "name": "Горња Драгуша",
      "postal_code": 18425
    },
    {
      "name": "Горња Лисина",
      "postal_code": 17538
    },
    {
      "name": "Горња Сабанта",
      "postal_code": 34206
    },
    {
      "name": "Горња Топлица",
      "postal_code": 14243
    },
    {
      "name": "Горња Топоница",
      "postal_code": 18202
    },
    {
      "name": "Горња Трепча",
      "postal_code": 32215
    },
    {
      "name": "Горња Трнава",
      "postal_code": 34324
    },
    {
      "name": "Горње Дворане",
      "postal_code": 37206
    },
    {
      "name": "Горњи Барбеш",
      "postal_code": 18241
    },
    {
      "name": "Горњи Брег",
      "postal_code": 24406
    },
    {
      "name": "Горњи Матејевац",
      "postal_code": 18204
    },
    {
      "name": "Горњи Милановац",
      "postal_code": 32300
    },
    {
      "name": "Горњи Степош",
      "postal_code": 37221
    },
    {
      "name": "Горњи Ступањ",
      "postal_code": 37234
    },
    {
      "name": "Госпођинци",
      "postal_code": 21237
    },
    {
      "name": "Гостун",
      "postal_code": 31308
    },
    {
      "name": "Грабовац",
      "postal_code": 11508
    },
    {
      "name": "Грабовица",
      "postal_code": 19327
    },
    {
      "name": "Грабовци",
      "postal_code": 22423
    },
    {
      "name": "Градсково",
      "postal_code": 19205
    },
    {
      "name": "Грачаница",
      "postal_code": 38205
    },
    {
      "name": "Гргуревци",
      "postal_code": 22213
    },
    {
      "name": "Грделица",
      "postal_code": 16220
    },
    {
      "name": "Гребенац",
      "postal_code": 26347
    },
    {
      "name": "Грлиште",
      "postal_code": 19342
    },
    {
      "name": "Грљан",
      "postal_code": 19341
    },
    {
      "name": "Грошница",
      "postal_code": 34202
    },
    {
      "name": "Гружа",
      "postal_code": 34230
    },
    {
      "name": "Губеревац",
      "postal_code": 16211
    },
    {
      "name": "Губеревац",
      "postal_code": 34232
    },
    {
      "name": "Гудурица",
      "postal_code": 26335
    },
    {
      "name": "Гунарош",
      "postal_code": 24312
    },
    {
      "name": "Гуча",
      "postal_code": 32230
    },
    {
      "name": "Гушевац",
      "postal_code": 18208
    },
    {
      "name": "Даросава",
      "postal_code": 34305
    },
    {
      "name": "Дебељача",
      "postal_code": 26214
    },
    {
      "name": "Дебрц",
      "postal_code": 15214
    },
    {
      "name": "Девојачки Бунар",
      "postal_code": 26316
    },
    {
      "name": "Дежева",
      "postal_code": 36305
    },
    {
      "name": "Делиблато",
      "postal_code": 26225
    },
    {
      "name": "Делимеђе",
      "postal_code": 36307
    },
    {
      "name": "Дероње",
      "postal_code": 25254
    },
    {
      "name": "Десимировац",
      "postal_code": 34321
    },
    {
      "name": "Деспотовац",
      "postal_code": 35213
    },
    {
      "name": "Деспотово",
      "postal_code": 21468
    },
    {
      "name": "Деч",
      "postal_code": 22441
    },
    {
      "name": "Дивљака",
      "postal_code": 31236
    },
    {
      "name": "Дивостин",
      "postal_code": 34204
    },
    {
      "name": "Дивош",
      "postal_code": 22232
    },
    {
      "name": "Дивци",
      "postal_code": 14222
    },
    {
      "name": "Дивчибаре",
      "postal_code": 14204
    },
    {
      "name": "Димитровград",
      "postal_code": 18320
    },
    {
      "name": "Добра",
      "postal_code": 12224
    },
    {
      "name": "Добри До",
      "postal_code": 18408
    },
    {
      "name": "Добринци",
      "postal_code": 22412
    },
    {
      "name": "Добрић",
      "postal_code": 15235
    },
    {
      "name": "Добрица",
      "postal_code": 26354
    },
    {
      "name": "Долац",
      "postal_code": 18314
    },
    {
      "name": "Долово",
      "postal_code": 26227
    },
    {
      "name": "Дољевац",
      "postal_code": 18410
    },
    {
      "name": "Доња Бела Река",
      "postal_code": 19213
    },
    {
      "name": "Доња Борина",
      "postal_code": 15317
    },
    {
      "name": "Доња Гуштерица",
      "postal_code": 38207
    },
    {
      "name": "Доња Каменица",
      "postal_code": 19352
    },
    {
      "name": "Доња Љубата",
      "postal_code": 17544
    },
    {
      "name": "Доња Мутница",
      "postal_code": 35255
    },
    {
      "name": "Доња Оровица",
      "postal_code": 15323
    },
    {
      "name": "Доња Речица",
      "postal_code": 18404
    },
    {
      "name": "Доња Трнава",
      "postal_code": 18421
    },
    {
      "name": "Доња Шаторња",
      "postal_code": 34314
    },
    {
      "name": "Доње Видово",
      "postal_code": 35258
    },
    {
      "name": "Доње Зуниче",
      "postal_code": 19345
    },
    {
      "name": "Доње Међурово",
      "postal_code": 18254
    },
    {
      "name": "Доње Црнатово",
      "postal_code": 18414
    },
    {
      "name": "Доње Црниљево",
      "postal_code": 15227
    },
    {
      "name": "Доњи Душник",
      "postal_code": 18242
    },
    {
      "name": "Доњи Крчин",
      "postal_code": 37258
    },
    {
      "name": "Доњи Милановац",
      "postal_code": 19220
    },
    {
      "name": "Доњи Стајевац",
      "postal_code": 17526
    },
    {
      "name": "Дорослово",
      "postal_code": 25243
    },
    {
      "name": "Драгинац",
      "postal_code": 15311
    },
    {
      "name": "Драгиње",
      "postal_code": 15226
    },
    {
      "name": "Драглица",
      "postal_code": 31317
    },
    {
      "name": "Драгобраћа",
      "postal_code": 34231
    },
    {
      "name": "Драгово",
      "postal_code": 35265
    },
    {
      "name": "Драгољ",
      "postal_code": 32316
    },
    {
      "name": "Драгоцвет",
      "postal_code": 35272
    },
    {
      "name": "Драгошевац",
      "postal_code": 35262
    },
    {
      "name": "Дражевац",
      "postal_code": 11506
    },
    {
      "name": "Дражевац",
      "postal_code": 18223
    },
    {
      "name": "Драјковце",
      "postal_code": 38239
    },
    {
      "name": "Драчић",
      "postal_code": 14203
    },
    {
      "name": "Дреновац",
      "postal_code": 15212
    },
    {
      "name": "Дреновац",
      "postal_code": 35257
    },
    {
      "name": "Друговац",
      "postal_code": 11432
    },
    {
      "name": "Дубље",
      "postal_code": 15359
    },
    {
      "name": "Дубовац",
      "postal_code": 26224
    },
    {
      "name": "Дубово",
      "postal_code": 18406
    },
    {
      "name": "Дубока",
      "postal_code": 12255
    },
    {
      "name": "Дубока",
      "postal_code": 35218
    },
    {
      "name": "Дубочане",
      "postal_code": 19232
    },
    {
      "name": "Дубравица",
      "postal_code": 12207
    },
    {
      "name": "Дуга Пољана",
      "postal_code": 36312
    },
    {
      "name": "Дуго Поље",
      "postal_code": 18237
    },
    {
      "name": "Дудовица",
      "postal_code": 11561
    },
    {
      "name": "Дупљаја",
      "postal_code": 26328
    },
    {
      "name": "Ђала",
      "postal_code": 23335
    },
    {
      "name": "Ђунис",
      "postal_code": 37202
    },
    {
      "name": "Ђурђево",
      "postal_code": 21239
    },
    {
      "name": "Ђурђин",
      "postal_code": 24213
    },
    {
      "name": "Елемир",
      "postal_code": 23208
    },
    {
      "name": "Ердевик",
      "postal_code": 22230
    },
    {
      "name": "Ердеч",
      "postal_code": 34207
    },
    {
      "name": "Ечка",
      "postal_code": 23203
    },
    {
      "name": "Жабаљ",
      "postal_code": 21230
    },
    {
      "name": "Жабари",
      "postal_code": 12374
    },
    {
      "name": "Жагубица",
      "postal_code": 12320
    },
    {
      "name": "Жељуше",
      "postal_code": 18325
    },
    {
      "name": "Жировница",
      "postal_code": 34229
    },
    {
      "name": "Житиште",
      "postal_code": 23210
    },
    {
      "name": "Житковац",
      "postal_code": 18210
    },
    {
      "name": "Житни Поток",
      "postal_code": 18407
    },
    {
      "name": "Житорађа",
      "postal_code": 18412
    },
    {
      "name": "Жича",
      "postal_code": 36221
    },
    {
      "name": "Жуч",
      "postal_code": ""
    },
    {
      "name": "Заблаће",
      "postal_code": 32223
    },
    {
      "name": "Забојница",
      "postal_code": 34244
    },
    {
      "name": "Забрежје",
      "postal_code": 11505
    },
    {
      "name": "Завлака",
      "postal_code": 15312
    },
    {
      "name": "Загајица",
      "postal_code": 26344
    },
    {
      "name": "Зајача",
      "postal_code": 15315
    },
    {
      "name": "Зајечар",
      "postal_code": 19000
    },
    {
      "name": "Заплањска Топоница",
      "postal_code": 18244
    },
    {
      "name": "Засавица",
      "postal_code": 22201
    },
    {
      "name": "Звездан",
      "postal_code": 19227
    },
    {
      "name": "Звечан",
      "postal_code": 38227
    },
    {
      "name": "Звонце",
      "postal_code": 18333
    },
    {
      "name": "Здравиње",
      "postal_code": 37203
    },
    {
      "name": "Златибор",
      "postal_code": 31315
    },
    {
      "name": "Златица",
      "postal_code": 23255
    },
    {
      "name": "Злодол",
      "postal_code": 31253
    },
    {
      "name": "Злот",
      "postal_code": 19215
    },
    {
      "name": "Змајево",
      "postal_code": 21213
    },
    {
      "name": "Змињак",
      "postal_code": 15352
    },
    {
      "name": "Зрењанин",
      "postal_code": 23101
    },
    {
      "name": "Зубин Поток",
      "postal_code": 38228
    },
    {
      "name": "Зуце",
      "postal_code": 11225
    },
    {
      "name": "Иваново",
      "postal_code": 26233
    },
    {
      "name": "Ивањица",
      "postal_code": 32250
    },
    {
      "name": "Идвор",
      "postal_code": 26207
    },
    {
      "name": "Иђош",
      "postal_code": 23323
    },
    {
      "name": "Избиште",
      "postal_code": 26343
    },
    {
      "name": "Иланџа",
      "postal_code": 26352
    },
    {
      "name": "Илинци",
      "postal_code": 22250
    },
    {
      "name": "Илићево",
      "postal_code": 34203
    },
    {
      "name": "Инђија",
      "postal_code": 22320
    },
    {
      "name": "Ириг",
      "postal_code": 22406
    },
    {
      "name": "Јабука",
      "postal_code": 26201
    },
    {
      "name": "Јабука",
      "postal_code": 31306
    },
    {
      "name": "Јабуковац",
      "postal_code": 19304
    },
    {
      "name": "Јабучје",
      "postal_code": 14226
    },
    {
      "name": "Јагњило",
      "postal_code": 11412
    },
    {
      "name": "Јагодина",
      "postal_code": 35000
    },
    {
      "name": "Јадранска Лешница",
      "postal_code": 15308
    },
    {
      "name": "Јазак",
      "postal_code": 22409
    },
    {
      "name": "Јазово",
      "postal_code": 23327
    },
    {
      "name": "Јамена",
      "postal_code": 22248
    },
    {
      "name": "Јанков Мост",
      "postal_code": 23201
    },
    {
      "name": "Јаношик",
      "postal_code": 26362
    },
    {
      "name": "Јарак",
      "postal_code": 22426
    },
    {
      "name": "Јарковац",
      "postal_code": 23250
    },
    {
      "name": "Јарменовци",
      "postal_code": 34318
    },
    {
      "name": "Јасеново",
      "postal_code": 26346
    },
    {
      "name": "Јасеново",
      "postal_code": 31319
    },
    {
      "name": "Јасеново",
      "postal_code": 35241
    },
    {
      "name": "Јасика",
      "postal_code": 37252
    },
    {
      "name": "Јасикoвица",
      "postal_code": 37247
    },
    {
      "name": "Јасиково",
      "postal_code": 19256
    },
    {
      "name": "Јаша Томић",
      "postal_code": 23230
    },
    {
      "name": "Јежевица",
      "postal_code": 31213
    },
    {
      "name": "Јежевица",
      "postal_code": 32222
    },
    {
      "name": "Јелашница",
      "postal_code": 17531
    },
    {
      "name": "Јелашница",
      "postal_code": 18206
    },
    {
      "name": "Јелен До",
      "postal_code": 31215
    },
    {
      "name": "Јеловик",
      "postal_code": 34309
    },
    {
      "name": "Јерменовци",
      "postal_code": 26363
    },
    {
      "name": "Јовановац",
      "postal_code": 18258
    },
    {
      "name": "Јовановац",
      "postal_code": 34211
    },
    {
      "name": "Јовац",
      "postal_code": 35205
    },
    {
      "name": "Јошаница",
      "postal_code": 18234
    },
    {
      "name": "Јошаничка Бања",
      "postal_code": 36345
    },
    {
      "name": "Југбогдановац",
      "postal_code": 18253
    },
    {
      "name": "Јунковац",
      "postal_code": 11562
    },
    {
      "name": "Кална",
      "postal_code": 19353
    },
    {
      "name": "Калуђерица",
      "postal_code": 11130
    },
    {
      "name": "Каменица",
      "postal_code": 14252
    },
    {
      "name": "Каменица",
      "postal_code": 15222
    },
    {
      "name": "Каменица",
      "postal_code": 18324
    },
    {
      "name": "Кањижа",
      "postal_code": 24420
    },
    {
      "name": "Каона",
      "postal_code": 32234
    },
    {
      "name": "Каоник",
      "postal_code": 37256
    },
    {
      "name": "Каравуково",
      "postal_code": 25255
    },
    {
      "name": "Карађорђево",
      "postal_code": 21421
    },
    {
      "name": "Карађорђево",
      "postal_code": 24308
    },
    {
      "name": "Каран",
      "postal_code": 31204
    },
    {
      "name": "Карловчић",
      "postal_code": 22443
    },
    {
      "name": "Катун",
      "postal_code": 18225
    },
    {
      "name": "Каћ",
      "postal_code": 21241
    },
    {
      "name": "Качарево",
      "postal_code": 26212
    },
    {
      "name": "Кеви",
      "postal_code": 24407
    },
    {
      "name": "Келебија",
      "postal_code": 24104
    },
    {
      "name": "Келебија гран. прелаз",
      "postal_code": 24205
    },
    {
      "name": "Кикинда",
      "postal_code": 23300
    },
    {
      "name": "Кисач",
      "postal_code": 21211
    },
    {
      "name": "Кладово",
      "postal_code": 19320
    },
    {
      "name": "Клек",
      "postal_code": 23211
    },
    {
      "name": "Кленак",
      "postal_code": 22424
    },
    {
      "name": "Кленике",
      "postal_code": 17524
    },
    {
      "name": "Клење",
      "postal_code": 12258
    },
    {
      "name": "Клење",
      "postal_code": 15357
    },
    {
      "name": "Клисура",
      "postal_code": 17535
    },
    {
      "name": "Кличевац",
      "postal_code": 12209
    },
    {
      "name": "Клокочевац",
      "postal_code": 19222
    },
    {
      "name": "Кљајићево",
      "postal_code": 25221
    },
    {
      "name": "Кнић",
      "postal_code": 34240
    },
    {
      "name": "Книћанин",
      "postal_code": 23265
    },
    {
      "name": "Књажевац",
      "postal_code": 19350
    },
    {
      "name": "Кобишница",
      "postal_code": 19316
    },
    {
      "name": "Ковачевац",
      "postal_code": 11409
    },
    {
      "name": "Ковачица",
      "postal_code": 26210
    },
    {
      "name": "Ковиљ",
      "postal_code": 21243
    },
    {
      "name": "Ковин",
      "postal_code": 26220
    },
    {
      "name": "Кокин Брод",
      "postal_code": 31318
    },
    {
      "name": "Коларе",
      "postal_code": 35242
    },
    {
      "name": "Колари",
      "postal_code": 11431
    },
    {
      "name": "Колут",
      "postal_code": 25274
    },
    {
      "name": "Комирић",
      "postal_code": 14254
    },
    {
      "name": "Конак",
      "postal_code": 23253
    },
    {
      "name": "Конарево",
      "postal_code": 36340
    },
    {
      "name": "Кончарево",
      "postal_code": 35219
    },
    {
      "name": "Коњух",
      "postal_code": 37254
    },
    {
      "name": "Копаоник",
      "postal_code": 36354
    },
    {
      "name": "Копривница",
      "postal_code": 19223
    },
    {
      "name": "Кораћица",
      "postal_code": 11415
    },
    {
      "name": "Корбевац",
      "postal_code": 17545
    },
    {
      "name": "Корбово",
      "postal_code": 19329
    },
    {
      "name": "Коренита",
      "postal_code": 15302
    },
    {
      "name": "Корман",
      "postal_code": 18216
    },
    {
      "name": "Корман",
      "postal_code": 34224
    },
    {
      "name": "Косанчић",
      "postal_code": 16206
    },
    {
      "name": "Косјерић",
      "postal_code": 31260
    },
    {
      "name": "Косово Поље",
      "postal_code": 38210
    },
    {
      "name": "Косовска Каменица",
      "postal_code": 38260
    },
    {
      "name": "Косовска Митровица",
      "postal_code": 38220
    },
    {
      "name": "Костојевићи",
      "postal_code": 31254
    },
    {
      "name": "Костолац",
      "postal_code": 12208
    },
    {
      "name": "Котража",
      "postal_code": 32235
    },
    {
      "name": "Коцељева",
      "postal_code": 15220
    },
    {
      "name": "Крагујевац",
      "postal_code": 34000
    },
    {
      "name": "Крајишник",
      "postal_code": 23231
    },
    {
      "name": "Краљево",
      "postal_code": 36000
    },
    {
      "name": "Краљевци",
      "postal_code": 22411
    },
    {
      "name": "Кремна",
      "postal_code": 31242
    },
    {
      "name": "Крепољин",
      "postal_code": 12316
    },
    {
      "name": "Крива Феја",
      "postal_code": 17543
    },
    {
      "name": "Криваја",
      "postal_code": 24341
    },
    {
      "name": "Кривељ",
      "postal_code": 19219
    },
    {
      "name": "Криви Вир",
      "postal_code": 19375
    },
    {
      "name": "Крњево",
      "postal_code": 11319
    },
    {
      "name": "Крњешевци",
      "postal_code": 22314
    },
    {
      "name": "Крупањ",
      "postal_code": 15314
    },
    {
      "name": "Крупац",
      "postal_code": 18307
    },
    {
      "name": "Крушар",
      "postal_code": 35227
    },
    {
      "name": "Крушевац",
      "postal_code": 37000
    },
    {
      "name": "Крушевица",
      "postal_code": 18409
    },
    {
      "name": "Крушедол",
      "postal_code": 22328
    },
    {
      "name": "Крушчић",
      "postal_code": 25225
    },
    {
      "name": "Крчедин",
      "postal_code": 22325
    },
    {
      "name": "Кузмин",
      "postal_code": 22223
    },
    {
      "name": "Кукљин",
      "postal_code": 37255
    },
    {
      "name": "Кукујевци",
      "postal_code": 22224
    },
    {
      "name": "Кула",
      "postal_code": 25230
    },
    {
      "name": "Кулина",
      "postal_code": 18214
    },
    {
      "name": "Кулпин",
      "postal_code": 21472
    },
    {
      "name": "Кумане",
      "postal_code": 23271
    },
    {
      "name": "Купиник",
      "postal_code": 26368
    },
    {
      "name": "Купиново",
      "postal_code": 22419
    },
    {
      "name": "Купусина",
      "postal_code": 25262
    },
    {
      "name": "Купци",
      "postal_code": 37222
    },
    {
      "name": "Куршумлија",
      "postal_code": 18430
    },
    {
      "name": "Куршумлијска Бања",
      "postal_code": 18435
    },
    {
      "name": "Кусадак",
      "postal_code": 11425
    },
    {
      "name": "Кусић",
      "postal_code": 26349
    },
    {
      "name": "Куцура",
      "postal_code": 21466
    },
    {
      "name": "Кучево",
      "postal_code": 12240
    },
    {
      "name": "Кушиљево",
      "postal_code": 35226
    },
    {
      "name": "Кушићи",
      "postal_code": 32258
    },
    {
      "name": "Куштиљ",
      "postal_code": 26336
    },
    {
      "name": "Лађевци",
      "postal_code": 36204
    },
    {
      "name": "Лазаревац",
      "postal_code": 11550
    },
    {
      "name": "Лазарево",
      "postal_code": 23241
    },
    {
      "name": "Лазница",
      "postal_code": 12321
    },
    {
      "name": "Лајковац",
      "postal_code": 14224
    },
    {
      "name": "Лалинац",
      "postal_code": 18256
    },
    {
      "name": "Лалинац",
      "postal_code": 18201
    },
    {
      "name": "Лалић",
      "postal_code": 25234
    },
    {
      "name": "Лапље Село",
      "postal_code": 38204
    },
    {
      "name": "Лапово",
      "postal_code": 34221
    },
    {
      "name": "Лапово (Варош)",
      "postal_code": 34220
    },
    {
      "name": "Лаћарак",
      "postal_code": 22221
    },
    {
      "name": "Лебане",
      "postal_code": 16230
    },
    {
      "name": "Лединци",
      "postal_code": 21207
    },
    {
      "name": "Лежимир",
      "postal_code": 22207
    },
    {
      "name": "Лелић",
      "postal_code": 14205
    },
    {
      "name": "Леновац",
      "postal_code": 19343
    },
    {
      "name": "Лепенац",
      "postal_code": 37224
    },
    {
      "name": "Лепеница",
      "postal_code": 17513
    },
    {
      "name": "Лепина",
      "postal_code": 38208
    },
    {
      "name": "Лепосавић",
      "postal_code": 38218
    },
    {
      "name": "Лесковац",
      "postal_code": 16000
    },
    {
      "name": "Леце",
      "postal_code": 16248
    },
    {
      "name": "Лешак",
      "postal_code": 38219
    },
    {
      "name": "Лешница",
      "postal_code": 15307
    },
    {
      "name": "Липар",
      "postal_code": 25232
    },
    {
      "name": "Липе",
      "postal_code": 11310
    },
    {
      "name": "Липнички Шор",
      "postal_code": 15341
    },
    {
      "name": "Липолист",
      "postal_code": 15305
    },
    {
      "name": "Лички Ханови",
      "postal_code": 18245
    },
    {
      "name": "Ловћенац",
      "postal_code": 24322
    },
    {
      "name": "Лозница",
      "postal_code": 15300
    },
    {
      "name": "Лозовик",
      "postal_code": 11317
    },
    {
      "name": "Лок",
      "postal_code": 21248
    },
    {
      "name": "Локве",
      "postal_code": 26361
    },
    {
      "name": "Лоћика",
      "postal_code": 35274
    },
    {
      "name": "Лубница",
      "postal_code": 19208
    },
    {
      "name": "Луг",
      "postal_code": 21315
    },
    {
      "name": "Лугавчина",
      "postal_code": 11321
    },
    {
      "name": "Лужнице",
      "postal_code": 34325
    },
    {
      "name": "Лукаре",
      "postal_code": 36306
    },
    {
      "name": "Лукино Село",
      "postal_code": 23224
    },
    {
      "name": "Лукићево",
      "postal_code": 23261
    },
    {
      "name": "Луково",
      "postal_code": 19371
    },
    {
      "name": "Луковска Бања",
      "postal_code": 18437
    },
    {
      "name": "Луново Село",
      "postal_code": 31203
    },
    {
      "name": "Лучани",
      "postal_code": 32240
    },
    {
      "name": "Љиг",
      "postal_code": 14240
    },
    {
      "name": "Љуба",
      "postal_code": 22255
    },
    {
      "name": "Љуберађа",
      "postal_code": 18217
    },
    {
      "name": "Љубиш",
      "postal_code": 31209
    },
    {
      "name": "Љубовија",
      "postal_code": 15320
    },
    {
      "name": "Љуково",
      "postal_code": 22321
    },
    {
      "name": "Љутово",
      "postal_code": 24215
    },
    {
      "name": "Маглић",
      "postal_code": 21473
    },
    {
      "name": "Мајдан",
      "postal_code": 23333
    },
    {
      "name": "Мајданпек",
      "postal_code": 19250
    },
    {
      "name": "Мајиловац",
      "postal_code": 12221
    },
    {
      "name": "Мајур",
      "postal_code": 15353
    },
    {
      "name": "Мајур",
      "postal_code": 35270
    },
    {
      "name": "Мала Босна",
      "postal_code": 24217
    },
    {
      "name": "Мала Крсна",
      "postal_code": 11313
    },
    {
      "name": "Мала Моштаница",
      "postal_code": 11261
    },
    {
      "name": "Мала Плана",
      "postal_code": 18423
    },
    {
      "name": "Мале Пијаце",
      "postal_code": 24416
    },
    {
      "name": "Мале Пчелице",
      "postal_code": 34216
    },
    {
      "name": "Мали Београд",
      "postal_code": 24309
    },
    {
      "name": "Мали Зворник",
      "postal_code": 15318
    },
    {
      "name": "Мали Иђош",
      "postal_code": 24321
    },
    {
      "name": "Мали Извор",
      "postal_code": 19347
    },
    {
      "name": "Мали Јасеновац",
      "postal_code": 19209
    },
    {
      "name": "Мали Пожаревац",
      "postal_code": 11235
    },
    {
      "name": "Мало Крчмаре",
      "postal_code": 34212
    },
    {
      "name": "Мало Црниће",
      "postal_code": 12311
    },
    {
      "name": "Малошиште",
      "postal_code": 18415
    },
    {
      "name": "Малча",
      "postal_code": 18207
    },
    {
      "name": "Манђелос",
      "postal_code": 22208
    },
    {
      "name": "Манојловце",
      "postal_code": 16201
    },
    {
      "name": "Марадик",
      "postal_code": 22327
    },
    {
      "name": "Маргита",
      "postal_code": 26364
    },
    {
      "name": "Марковац",
      "postal_code": 11325
    },
    {
      "name": "Марковица",
      "postal_code": 32243
    },
    {
      "name": "Мартинци",
      "postal_code": 22222
    },
    {
      "name": "Мартонош",
      "postal_code": 24417
    },
    {
      "name": "Маршић",
      "postal_code": 34209
    },
    {
      "name": "Матарушка Бања",
      "postal_code": 36201
    },
    {
      "name": "Мачванска Митровица",
      "postal_code": 22202
    },
    {
      "name": "Мачвански Причиновић",
      "postal_code": 15211
    },
    {
      "name": "Мачкат",
      "postal_code": 31312
    },
    {
      "name": "Медвеђа",
      "postal_code": 16240
    },
    {
      "name": "Медвеђа",
      "postal_code": 35224
    },
    {
      "name": "Медвеђа",
      "postal_code": 37244
    },
    {
      "name": "Медошевац",
      "postal_code": 18209
    },
    {
      "name": "Међа",
      "postal_code": 23234
    },
    {
      "name": "Међулужје",
      "postal_code": 11405
    },
    {
      "name": "Међуречје",
      "postal_code": 32255
    },
    {
      "name": "Меленци",
      "postal_code": 23270
    },
    {
      "name": "Меленци-Русанда",
      "postal_code": 23269
    },
    {
      "name": "Мељак",
      "postal_code": 11426
    },
    {
      "name": "Мердаре",
      "postal_code": 18445
    },
    {
      "name": "Мерошина",
      "postal_code": 18252
    },
    {
      "name": "Мерћез",
      "postal_code": 18436
    },
    {
      "name": "Метлић",
      "postal_code": 15233
    },
    {
      "name": "Метовница",
      "postal_code": 19204
    },
    {
      "name": "Мијатовац",
      "postal_code": 35236
    },
    {
      "name": "Милатовац",
      "postal_code": 34222
    },
    {
      "name": "Милентија",
      "postal_code": 37227
    },
    {
      "name": "Милетићево",
      "postal_code": 26373
    },
    {
      "name": "Милешево",
      "postal_code": 21227
    },
    {
      "name": "Милошевац",
      "postal_code": 11318
    },
    {
      "name": "Милошево",
      "postal_code": 35268
    },
    {
      "name": "Милутовац",
      "postal_code": 37246
    },
    {
      "name": "Минићево",
      "postal_code": 19340
    },
    {
      "name": "Мионица",
      "postal_code": 14242
    },
    {
      "name": "Миросаљци",
      "postal_code": 11567
    },
    {
      "name": "Мирошевце",
      "postal_code": 16204
    },
    {
      "name": "Митровац",
      "postal_code": 31251
    },
    {
      "name": "Михајловац",
      "postal_code": 11312
    },
    {
      "name": "Михајловац",
      "postal_code": 19322
    },
    {
      "name": "Михајлово",
      "postal_code": 23202
    },
    {
      "name": "Мишићево",
      "postal_code": 24211
    },
    {
      "name": "Младеновац",
      "postal_code": 11400
    },
    {
      "name": "Младеново",
      "postal_code": 21422
    },
    {
      "name": "Мозгово",
      "postal_code": 18229
    },
    {
      "name": "Мокра Гора",
      "postal_code": 31243
    },
    {
      "name": "Мокрин",
      "postal_code": 23305
    },
    {
      "name": "Мол",
      "postal_code": 24435
    },
    {
      "name": "Моловин",
      "postal_code": 22256
    },
    {
      "name": "Моровић",
      "postal_code": 22245
    },
    {
      "name": "Мошорин",
      "postal_code": 21245
    },
    {
      "name": "Мрамор",
      "postal_code": 18251
    },
    {
      "name": "Мраморак",
      "postal_code": 26226
    },
    {
      "name": "Мрчајевци",
      "postal_code": 32210
    },
    {
      "name": "Мршинци",
      "postal_code": 32224
    },
    {
      "name": "Мужља",
      "postal_code": 23206
    },
    {
      "name": "Муховац",
      "postal_code": 17529
    },
    {
      "name": "Надаљ",
      "postal_code": 21216
    },
    {
      "name": "Наково",
      "postal_code": 23311
    },
    {
      "name": "Наталинци",
      "postal_code": 34313
    },
    {
      "name": "Неготин",
      "postal_code": 19300
    },
    {
      "name": "Нересница",
      "postal_code": 12242
    },
    {
      "name": "Неузина",
      "postal_code": 23245
    },
    {
      "name": "Нештин",
      "postal_code": 21314
    },
    {
      "name": "Никинци",
      "postal_code": 22422
    },
    {
      "name": "Николинци",
      "postal_code": 26322
    },
    {
      "name": "Николичево",
      "postal_code": 19311
    },
    {
      "name": "Ниш",
      "postal_code": 18101
    },
    {
      "name": "Нишевац",
      "postal_code": 18366
    },
    {
      "name": "Нишка Бања",
      "postal_code": 18205
    },
    {
      "name": "Нова Варош",
      "postal_code": 31320
    },
    {
      "name": "Нова Гајдобра",
      "postal_code": 21431
    },
    {
      "name": "Нова Пазова",
      "postal_code": 22330
    },
    {
      "name": "Нова Црвенка",
      "postal_code": 25224
    },
    {
      "name": "Нова Црња",
      "postal_code": 23218
    },
    {
      "name": "Нови Бановци",
      "postal_code": 22304
    },
    {
      "name": "Нови Бечеј",
      "postal_code": 23272
    },
    {
      "name": "Нови Брачин",
      "postal_code": 37216
    },
    {
      "name": "Нови Жедник",
      "postal_code": 24223
    },
    {
      "name": "Нови Итебеј",
      "postal_code": 23236
    },
    {
      "name": "Нови Карловци",
      "postal_code": 22322
    },
    {
      "name": "Нови Кнежевац",
      "postal_code": 23330
    },
    {
      "name": "Нови Козарци",
      "postal_code": 23313
    },
    {
      "name": "Нови Козјак",
      "postal_code": 26353
    },
    {
      "name": "Нови Пазар",
      "postal_code": 36300
    },
    {
      "name": "Нови Сад",
      "postal_code": 21101
    },
    {
      "name": "Нови Сланкамен",
      "postal_code": 22323
    },
    {
      "name": "Ново Милошево",
      "postal_code": 23273
    },
    {
      "name": "Ново Орахово",
      "postal_code": 24351
    },
    {
      "name": "Ново Село",
      "postal_code": 18250
    },
    {
      "name": "Ново Село",
      "postal_code": 36216
    },
    {
      "name": "Ноћај",
      "postal_code": 22203
    },
    {
      "name": "Обреж",
      "postal_code": 22417
    },
    {
      "name": "Обреж",
      "postal_code": 37266
    },
    {
      "name": "Обреновац",
      "postal_code": 11500
    },
    {
      "name": "Обровац",
      "postal_code": 21423
    },
    {
      "name": "Овчар Бања",
      "postal_code": 32242
    },
    {
      "name": "Огар",
      "postal_code": 22416
    },
    {
      "name": "Омољица",
      "postal_code": 26230
    },
    {
      "name": "Опарић",
      "postal_code": 35267
    },
    {
      "name": "Опово",
      "postal_code": 26204
    },
    {
      "name": "Оране",
      "postal_code": 16233
    },
    {
      "name": "Орашац",
      "postal_code": 34308
    },
    {
      "name": "Орешковица",
      "postal_code": 12308
    },
    {
      "name": "Орид",
      "postal_code": 15213
    },
    {
      "name": "Орловат",
      "postal_code": 23263
    },
    {
      "name": "Ором",
      "postal_code": 24207
    },
    {
      "name": "Осаница",
      "postal_code": 12317
    },
    {
      "name": "Осечина",
      "postal_code": 14253
    },
    {
      "name": "Осипаоница",
      "postal_code": 11314
    },
    {
      "name": "Остојићево",
      "postal_code": 23326
    },
    {
      "name": "Островица",
      "postal_code": 18312
    },
    {
      "name": "Остружница",
      "postal_code": 11251
    },
    {
      "name": "Оџаци",
      "postal_code": 25250
    },
    {
      "name": "Оштрељ",
      "postal_code": 19226
    },
    {
      "name": "Павлиш",
      "postal_code": 26333
    },
    {
      "name": "Падеж",
      "postal_code": 37257
    },
    {
      "name": "Падеј",
      "postal_code": 23325
    },
    {
      "name": "Падина",
      "postal_code": 26215
    },
    {
      "name": "Палић",
      "postal_code": 24413
    },
    {
      "name": "Памбуковица",
      "postal_code": 14213
    },
    {
      "name": "Панонија",
      "postal_code": 24330
    },
    {
      "name": "Панчево",
      "postal_code": 26101
    },
    {
      "name": "Параге",
      "postal_code": 21434
    },
    {
      "name": "Параћин",
      "postal_code": 35250
    },
    {
      "name": "Партеш",
      "postal_code": 38251
    },
    {
      "name": "Паруновац",
      "postal_code": 37201
    },
    {
      "name": "Пасјане",
      "postal_code": 38266
    },
    {
      "name": "Пачир",
      "postal_code": 24342
    },
    {
      "name": "Пејковац",
      "postal_code": 18413
    },
    {
      "name": "Пепељевац",
      "postal_code": 37231
    },
    {
      "name": "Перлез",
      "postal_code": 23260
    },
    {
      "name": "Перућац",
      "postal_code": 31256
    },
    {
      "name": "Петловача",
      "postal_code": 15304
    },
    {
      "name": "Петроварадин",
      "postal_code": 21131
    },
    {
      "name": "Петровац",
      "postal_code": 12300
    },
    {
      "name": "Пећинци",
      "postal_code": 22410
    },
    {
      "name": "Пецка",
      "postal_code": 14207
    },
    {
      "name": "Печењевце",
      "postal_code": 16251
    },
    {
      "name": "Пивнице",
      "postal_code": 21469
    },
    {
      "name": "Пиносава",
      "postal_code": 11226
    },
    {
      "name": "Пирот",
      "postal_code": 18300
    },
    {
      "name": "Плавна",
      "postal_code": 19307
    },
    {
      "name": "Плавна",
      "postal_code": 21428
    },
    {
      "name": "Плажане",
      "postal_code": 35212
    },
    {
      "name": "Плана",
      "postal_code": 35247
    },
    {
      "name": "Пландиште",
      "postal_code": 26360
    },
    {
      "name": "Платичево",
      "postal_code": 22420
    },
    {
      "name": "Племетина",
      "postal_code": 38211
    },
    {
      "name": "Плеш",
      "postal_code": 37238
    },
    {
      "name": "Плочица",
      "postal_code": 26229
    },
    {
      "name": "Победа",
      "postal_code": 24313
    },
    {
      "name": "Поганово",
      "postal_code": 18326
    },
    {
      "name": "Подвис",
      "postal_code": 19362
    },
    {
      "name": "Подвршка",
      "postal_code": 19321
    },
    {
      "name": "Подгорац",
      "postal_code": 19233
    },
    {
      "name": "Подунавци",
      "postal_code": 36215
    },
    {
      "name": "Пожаревац",
      "postal_code": 12000
    },
    {
      "name": "Пожега",
      "postal_code": 31210
    },
    {
      "name": "Појате",
      "postal_code": 37214
    },
    {
      "name": "Пољана",
      "postal_code": 12372
    },
    {
      "name": "Пољска Ржана",
      "postal_code": 18328
    },
    {
      "name": "Попинци",
      "postal_code": 22428
    },
    {
      "name": "Поповац",
      "postal_code": 35254
    },
    {
      "name": "Попучке",
      "postal_code": 14221
    },
    {
      "name": "Породин",
      "postal_code": 12375
    },
    {
      "name": "Поточац",
      "postal_code": 35207
    },
    {
      "name": "Поћута",
      "postal_code": 14206
    },
    {
      "name": "Почековина",
      "postal_code": 37243
    },
    {
      "name": "Прањани",
      "postal_code": 32308
    },
    {
      "name": "Прахово",
      "postal_code": 19330
    },
    {
      "name": "Превешт",
      "postal_code": 35264
    },
    {
      "name": "Предејане",
      "postal_code": 16222
    },
    {
      "name": "Преконога",
      "postal_code": 18365
    },
    {
      "name": "Прељина",
      "postal_code": 32212
    },
    {
      "name": "Прешево",
      "postal_code": 17523
    },
    {
      "name": "Прешево-терминал",
      "postal_code": 17555
    },
    {
      "name": "Прибој",
      "postal_code": 31330
    },
    {
      "name": "Прибој Врањски",
      "postal_code": 17511
    },
    {
      "name": "Привина Глава",
      "postal_code": 22257
    },
    {
      "name": "Пригревица",
      "postal_code": 25263
    },
    {
      "name": "Пријепоље",
      "postal_code": 31300
    },
    {
      "name": "Прилички Кисељак",
      "postal_code": 32252
    },
    {
      "name": "Прилужје",
      "postal_code": 38213
    },
    {
      "name": "Причевић",
      "postal_code": 14251
    },
    {
      "name": "Прњавор (Мачвански)",
      "postal_code": 15306
    },
    {
      "name": "Прово",
      "postal_code": 15215
    },
    {
      "name": "Прокупље",
      "postal_code": 18400
    },
    {
      "name": "Пролом Бања",
      "postal_code": 18433
    },
    {
      "name": "Пружатовац",
      "postal_code": 11413
    },
    {
      "name": "Прхово",
      "postal_code": 22442
    },
    {
      "name": "Пуковац",
      "postal_code": 18255
    },
    {
      "name": "Путинци",
      "postal_code": ""
    },
    {
      "name": "Раброво",
      "postal_code": 12254
    },
    {
      "name": "Равна Дубрава",
      "postal_code": 18246
    },
    {
      "name": "Равни Тополовац",
      "postal_code": 23212
    },
    {
      "name": "Равни",
      "postal_code": 31206
    },
    {
      "name": "Равно Село",
      "postal_code": 21471
    },
    {
      "name": "Равње",
      "postal_code": 22205
    },
    {
      "name": "Радаљ",
      "postal_code": 15321
    },
    {
      "name": "Радинац",
      "postal_code": 11311
    },
    {
      "name": "Радичевић",
      "postal_code": 21225
    },
    {
      "name": "Радљево",
      "postal_code": 14211
    },
    {
      "name": "Радовница",
      "postal_code": 17561
    },
    {
      "name": "Радојево",
      "postal_code": 23221
    },
    {
      "name": "Радујевац",
      "postal_code": 19334
    },
    {
      "name": "Ражана",
      "postal_code": 31265
    },
    {
      "name": "Ражањ",
      "postal_code": 37215
    },
    {
      "name": "Разбојна",
      "postal_code": 37223
    },
    {
      "name": "Разгојна",
      "postal_code": 16252
    },
    {
      "name": "Раиновача",
      "postal_code": 15342
    },
    {
      "name": "Рајковић",
      "postal_code": 14202
    },
    {
      "name": "Раковац",
      "postal_code": 21299
    },
    {
      "name": "Раља",
      "postal_code": 11233
    },
    {
      "name": "Раниловић",
      "postal_code": 34302
    },
    {
      "name": "Ранилуг",
      "postal_code": 38267
    },
    {
      "name": "Рановац",
      "postal_code": 12304
    },
    {
      "name": "Растина",
      "postal_code": 25283
    },
    {
      "name": "Ратаје",
      "postal_code": 37236
    },
    {
      "name": "Ратари",
      "postal_code": 11411
    },
    {
      "name": "Ратина",
      "postal_code": 36212
    },
    {
      "name": "Ратково",
      "postal_code": 25253
    },
    {
      "name": "Рача Крагујевачка",
      "postal_code": 34210
    },
    {
      "name": "Рача",
      "postal_code": 18440
    },
    {
      "name": "Рашанац",
      "postal_code": 12315
    },
    {
      "name": "Рашевица",
      "postal_code": 35206
    },
    {
      "name": "Рашка",
      "postal_code": 36350
    },
    {
      "name": "Рготина",
      "postal_code": 19214
    },
    {
      "name": "Рековац",
      "postal_code": 35260
    },
    {
      "name": "Ресавица",
      "postal_code": 35237
    },
    {
      "name": "Ресник",
      "postal_code": 34225
    },
    {
      "name": "Рибаре",
      "postal_code": 35220
    },
    {
      "name": "Рибари",
      "postal_code": 15310
    },
    {
      "name": "Рибариће",
      "postal_code": 36309
    },
    {
      "name": "Рибарска Бања",
      "postal_code": 37205
    },
    {
      "name": "Риђица",
      "postal_code": 25280
    },
    {
      "name": "Рипањ",
      "postal_code": 11232
    },
    {
      "name": "Ристовац",
      "postal_code": 17521
    },
    {
      "name": "Рогача",
      "postal_code": 11453
    },
    {
      "name": "Рогачица",
      "postal_code": 31255
    },
    {
      "name": "Роге",
      "postal_code": 31237
    },
    {
      "name": "Рогљево",
      "postal_code": 19318
    },
    {
      "name": "Рожанство",
      "postal_code": 31208
    },
    {
      "name": "Роћевићи",
      "postal_code": 36205
    },
    {
      "name": "Рудна Глава",
      "postal_code": 19257
    },
    {
      "name": "Рудник",
      "postal_code": 32313
    },
    {
      "name": "Рудница",
      "postal_code": 36353
    },
    {
      "name": "Рудно",
      "postal_code": 36222
    },
    {
      "name": "Рудовци",
      "postal_code": 11566
    },
    {
      "name": "Рума",
      "postal_code": 22400
    },
    {
      "name": "Руменка",
      "postal_code": 21201
    },
    {
      "name": "Руски Крстур",
      "postal_code": 25233
    },
    {
      "name": "Руско Село",
      "postal_code": 23314
    },
    {
      "name": "Рутевац",
      "postal_code": 18224
    },
    {
      "name": "Рушањ",
      "postal_code": 11194
    },
    {
      "name": "Савинац",
      "postal_code": 19377
    },
    {
      "name": "Савино Село",
      "postal_code": 21467
    },
    {
      "name": "Сајан",
      "postal_code": 23324
    },
    {
      "name": "Сакуле",
      "postal_code": 26206
    },
    {
      "name": "Салаш Ноћајски",
      "postal_code": 22204
    },
    {
      "name": "Салаш",
      "postal_code": 19224
    },
    {
      "name": "Самаила",
      "postal_code": 36202
    },
    {
      "name": "Самош",
      "postal_code": 26350
    },
    {
      "name": "Санад",
      "postal_code": 23331
    },
    {
      "name": "Сараорци",
      "postal_code": 11315
    },
    {
      "name": "Састав Река",
      "postal_code": 16213
    },
    {
      "name": "Саставци",
      "postal_code": 31335
    },
    {
      "name": "Свети Илија",
      "postal_code": 17508
    },
    {
      "name": "Светозар Милетић",
      "postal_code": 25211
    },
    {
      "name": "Свилајнац",
      "postal_code": 35210
    },
    {
      "name": "Свилеува",
      "postal_code": 15221
    },
    {
      "name": "Свилојево",
      "postal_code": 25265
    },
    {
      "name": "Свође",
      "postal_code": 16212
    },
    {
      "name": "Својново",
      "postal_code": 35259
    },
    {
      "name": "Сврљиг",
      "postal_code": 18360
    },
    {
      "name": "Севојно",
      "postal_code": 31205
    },
    {
      "name": "Седларе",
      "postal_code": 35211
    },
    {
      "name": "Селевац",
      "postal_code": 11407
    },
    {
      "name": "Селенча",
      "postal_code": 21425
    },
    {
      "name": "Селеуш",
      "postal_code": 26351
    },
    {
      "name": "Сента",
      "postal_code": 24400
    },
    {
      "name": "Сење",
      "postal_code": 35233
    },
    {
      "name": "Сењски Рудник",
      "postal_code": 35234
    },
    {
      "name": "Сефкерин",
      "postal_code": 26203
    },
    {
      "name": "Сеча Река",
      "postal_code": 31262
    },
    {
      "name": "Сечаница",
      "postal_code": 18203
    },
    {
      "name": "Сечањ",
      "postal_code": 23240
    },
    {
      "name": "Сибач",
      "postal_code": 22440
    },
    {
      "name": "Сивац",
      "postal_code": 25223
    },
    {
      "name": "Сијаринска Бања",
      "postal_code": 16246
    },
    {
      "name": "Сикирица",
      "postal_code": 35256
    },
    {
      "name": "Сиколе",
      "postal_code": 19225
    },
    {
      "name": "Силбаш",
      "postal_code": 21433
    },
    {
      "name": "Сиоковац",
      "postal_code": 35203
    },
    {
      "name": "Сип",
      "postal_code": 19326
    },
    {
      "name": "Сипић",
      "postal_code": 34213
    },
    {
      "name": "Сириг",
      "postal_code": 21214
    },
    {
      "name": "Сирогојно",
      "postal_code": 31207
    },
    {
      "name": "Сирча",
      "postal_code": 36208
    },
    {
      "name": "Сићево",
      "postal_code": 18311
    },
    {
      "name": "Сјеница",
      "postal_code": 36310
    },
    {
      "name": "Скела",
      "postal_code": 11509
    },
    {
      "name": "Скобаљ",
      "postal_code": 11322
    },
    {
      "name": "Скореновац",
      "postal_code": 26228
    },
    {
      "name": "Славковица",
      "postal_code": 14245
    },
    {
      "name": "Слатина",
      "postal_code": 19221
    },
    {
      "name": "Словац",
      "postal_code": 14223
    },
    {
      "name": "Смедеревска Паланка",
      "postal_code": 11420
    },
    {
      "name": "Смедерево",
      "postal_code": 11300
    },
    {
      "name": "Смиловци",
      "postal_code": 18323
    },
    {
      "name": "Смољинац",
      "postal_code": 12312
    },
    {
      "name": "Сокобања",
      "postal_code": 18230
    },
    {
      "name": "Сомбор",
      "postal_code": 25101
    },
    {
      "name": "Сонта",
      "postal_code": 25264
    },
    {
      "name": "Сопот",
      "postal_code": 11450
    },
    {
      "name": "Сот",
      "postal_code": 22243
    },
    {
      "name": "Сочаница",
      "postal_code": 38217
    },
    {
      "name": "Сремска Митровица",
      "postal_code": 22000
    },
    {
      "name": "Србобран",
      "postal_code": 21480
    },
    {
      "name": "Средњево",
      "postal_code": 12253
    },
    {
      "name": "Сремска Каменица",
      "postal_code": 21202
    },
    {
      "name": "Сремска Рача",
      "postal_code": 22247
    },
    {
      "name": "Сремски Карловци",
      "postal_code": 21205
    },
    {
      "name": "Сремски Михаљевци",
      "postal_code": 22413
    },
    {
      "name": "Сремчица",
      "postal_code": 11253
    },
    {
      "name": "Српска Црња",
      "postal_code": 23220
    },
    {
      "name": "Српски Итебеј",
      "postal_code": 23233
    },
    {
      "name": "Српски Крстур",
      "postal_code": 23334
    },
    {
      "name": "Српски Милетић",
      "postal_code": 25244
    },
    {
      "name": "Ставе",
      "postal_code": 14255
    },
    {
      "name": "Стајићево",
      "postal_code": 23204
    },
    {
      "name": "Сталаћ",
      "postal_code": 37212
    },
    {
      "name": "Станишић",
      "postal_code": 25284
    },
    {
      "name": "Стапар",
      "postal_code": 25240
    },
    {
      "name": "Стара Моравица",
      "postal_code": 24340
    },
    {
      "name": "Стара Пазова",
      "postal_code": 22300
    },
    {
      "name": "Стари Бановци",
      "postal_code": 22305
    },
    {
      "name": "Стари Жедник",
      "postal_code": 24224
    },
    {
      "name": "Стари Лец",
      "postal_code": 26371
    },
    {
      "name": "Стари Сланкамен",
      "postal_code": 22329
    },
    {
      "name": "Старо Село",
      "postal_code": 11324
    },
    {
      "name": "Старчево",
      "postal_code": 26232
    },
    {
      "name": "Стејановци",
      "postal_code": 22405
    },
    {
      "name": "Стењевац",
      "postal_code": 35215
    },
    {
      "name": "Степановићево",
      "postal_code": 21212
    },
    {
      "name": "Степојевац",
      "postal_code": 11564
    },
    {
      "name": "Стојник",
      "postal_code": 34307
    },
    {
      "name": "Стопања",
      "postal_code": 37242
    },
    {
      "name": "Страгари",
      "postal_code": 34323
    },
    {
      "name": "Стража",
      "postal_code": 26345
    },
    {
      "name": "Стрелац",
      "postal_code": 18332
    },
    {
      "name": "Стубал",
      "postal_code": 17512
    },
    {
      "name": "Стубица",
      "postal_code": 35246
    },
    {
      "name": "Стублине",
      "postal_code": 11507
    },
    {
      "name": "Студеница",
      "postal_code": 36343
    },
    {
      "name": "Суботинац",
      "postal_code": 18227
    },
    {
      "name": "Суботица (код Свијанца)",
      "postal_code": 35209
    },
    {
      "name": "Суботица",
      "postal_code": 24000
    },
    {
      "name": "Суботиште",
      "postal_code": 22414
    },
    {
      "name": "Суково",
      "postal_code": 18322
    },
    {
      "name": "Сумраковац",
      "postal_code": 19376
    },
    {
      "name": "Супска",
      "postal_code": 35228
    },
    {
      "name": "Сурдук",
      "postal_code": 22307
    },
    {
      "name": "Сурдулица",
      "postal_code": 17530
    },
    {
      "name": "Сусек",
      "postal_code": 21313
    },
    {
      "name": "Сутјеска",
      "postal_code": 23244
    },
    {
      "name": "Таванкут",
      "postal_code": 24214
    },
    {
      "name": "Таково",
      "postal_code": 32304
    },
    {
      "name": "Тараш",
      "postal_code": 23209
    },
    {
      "name": "Текериш",
      "postal_code": 15234
    },
    {
      "name": "Текија",
      "postal_code": 19325
    },
    {
      "name": "Телечка",
      "postal_code": 25222
    },
    {
      "name": "Темерин",
      "postal_code": 21235
    },
    {
      "name": "Темска",
      "postal_code": 18355
    },
    {
      "name": "Тешица",
      "postal_code": 18212
    },
    {
      "name": "Тител",
      "postal_code": 21240
    },
    {
      "name": "Тоба",
      "postal_code": 23222
    },
    {
      "name": "Товаришево",
      "postal_code": 21424
    },
    {
      "name": "Томашевац",
      "postal_code": 23262
    },
    {
      "name": "Томиславци",
      "postal_code": 24334
    },
    {
      "name": "Топола",
      "postal_code": 34310
    },
    {
      "name": "Тополовник",
      "postal_code": 12226
    },
    {
      "name": "Топоница",
      "postal_code": 34243
    },
    {
      "name": "Торак",
      "postal_code": 23232
    },
    {
      "name": "Торда",
      "postal_code": 23214
    },
    {
      "name": "Торњош",
      "postal_code": 24352
    },
    {
      "name": "Тотово Село",
      "postal_code": 24427
    },
    {
      "name": "Трбушани",
      "postal_code": 32205
    },
    {
      "name": "Трговиште",
      "postal_code": 17525
    },
    {
      "name": "Трешњевац",
      "postal_code": 24426
    },
    {
      "name": "Трешњевица",
      "postal_code": 35248
    },
    {
      "name": "Трнавци",
      "postal_code": 37235
    },
    {
      "name": "Трњане",
      "postal_code": 18213
    },
    {
      "name": "Трњане",
      "postal_code": 19306
    },
    {
      "name": "Трстеник",
      "postal_code": 37240
    },
    {
      "name": "Трупале",
      "postal_code": 18211
    },
    {
      "name": "Тршић",
      "postal_code": 15303
    },
    {
      "name": "Туларе",
      "postal_code": 16247
    },
    {
      "name": "Турековац",
      "postal_code": 16231
    },
    {
      "name": "Турија",
      "postal_code": 12257
    },
    {
      "name": "Турија",
      "postal_code": 21215
    },
    {
      "name": "Тутин",
      "postal_code": 36320
    },
    {
      "name": "Ћићевац",
      "postal_code": 37210
    },
    {
      "name": "Ћуприја",
      "postal_code": 35230
    },
    {
      "name": "Уб",
      "postal_code": 14210
    },
    {
      "name": "Угао",
      "postal_code": 36313
    },
    {
      "name": "Угриновци",
      "postal_code": 32314
    },
    {
      "name": "Ужице",
      "postal_code": 31000
    },
    {
      "name": "Уздин",
      "postal_code": 26216
    },
    {
      "name": "Узовница",
      "postal_code": 15319
    },
    {
      "name": "Уљма",
      "postal_code": 26330
    },
    {
      "name": "Умка",
      "postal_code": 11260
    },
    {
      "name": "Уровица",
      "postal_code": 19305
    },
    {
      "name": "Утрине",
      "postal_code": 24437
    },
    {
      "name": "Ушће",
      "postal_code": 36342
    },
    {
      "name": "Фаркаждин",
      "postal_code": 23264
    },
    {
      "name": "Фекетић",
      "postal_code": 24323
    },
    {
      "name": "Футог",
      "postal_code": 21410
    },
    {
      "name": "Хајдуково",
      "postal_code": 24414
    },
    {
      "name": "Хајдучица",
      "postal_code": 26370
    },
    {
      "name": "Хетин",
      "postal_code": 23235
    },
    {
      "name": "Хоргош",
      "postal_code": 24410
    },
    {
      "name": "Хоргош гранични прелаз",
      "postal_code": 24411
    },
    {
      "name": "Хртковци",
      "postal_code": 22427
    },
    {
      "name": "Церовац",
      "postal_code": 15224
    },
    {
      "name": "Црвена Река",
      "postal_code": 18313
    },
    {
      "name": "Црвена Црква",
      "postal_code": 26323
    },
    {
      "name": "Црвенка",
      "postal_code": 25220
    },
    {
      "name": "Црепаја",
      "postal_code": 26213
    },
    {
      "name": "Црквине",
      "postal_code": 36321
    },
    {
      "name": "Црна Бара",
      "postal_code": 15355
    },
    {
      "name": "Црна Бара",
      "postal_code": 23328
    },
    {
      "name": "Црна Трава",
      "postal_code": 16215
    },
    {
      "name": "Црноклиште",
      "postal_code": 18304
    },
    {
      "name": "Чајетина",
      "postal_code": 31310
    },
    {
      "name": "Чалма",
      "postal_code": 22231
    },
    {
      "name": "Чантавир",
      "postal_code": 24220
    },
    {
      "name": "Чачак",
      "postal_code": 32101
    },
    {
      "name": "Челарево",
      "postal_code": 21413
    },
    {
      "name": "Ченеј",
      "postal_code": 21233
    },
    {
      "name": "Чента",
      "postal_code": 23266
    },
    {
      "name": "Черевић",
      "postal_code": 21311
    },
    {
      "name": "Честерег",
      "postal_code": 23215
    },
    {
      "name": "Чечина",
      "postal_code": 18417
    },
    {
      "name": "Читлук",
      "postal_code": 18232
    },
    {
      "name": "Читлук",
      "postal_code": 37208
    },
    {
      "name": "Чока",
      "postal_code": 23320
    },
    {
      "name": "Чонопља",
      "postal_code": 25210
    },
    {
      "name": "Чортановци",
      "postal_code": 22326
    },
    {
      "name": "Чукојевац",
      "postal_code": 36220
    },
    {
      "name": "Чумић",
      "postal_code": 34322
    },
    {
      "name": "Чуруг",
      "postal_code": 21238
    },
    {
      "name": "Џеп",
      "postal_code": 17514
    },
    {
      "name": "Џигољ",
      "postal_code": 18405
    },
    {
      "name": "Шабац",
      "postal_code": 15000
    },
    {
      "name": "Шајкаш",
      "postal_code": 21244
    },
    {
      "name": "Шарбановац",
      "postal_code": 19373
    },
    {
      "name": "Шарбановац-Тимок",
      "postal_code": 19379
    },
    {
      "name": "Шашинци",
      "postal_code": 22425
    },
    {
      "name": "Шепшин",
      "postal_code": 11433
    },
    {
      "name": "Шетоње",
      "postal_code": 12309
    },
    {
      "name": "Шид",
      "postal_code": 22239
    },
    {
      "name": "Шилово",
      "postal_code": 38252
    },
    {
      "name": "Шимановци",
      "postal_code": 22310
    },
    {
      "name": "Шљивовац",
      "postal_code": 34219
    },
    {
      "name": "Шљивовица",
      "postal_code": 31244
    },
    {
      "name": "Шљивово",
      "postal_code": 37239
    },
    {
      "name": "Штаваљ",
      "postal_code": 36311
    },
    {
      "name": "Штитар",
      "postal_code": 15354
    },
    {
      "name": "Штитаре",
      "postal_code": 36314
    },
    {
      "name": "Штрпце",
      "postal_code": 38236
    },
    {
      "name": "Штубик",
      "postal_code": 19303
    },
    {
      "name": "Шупљак",
      "postal_code": 24418
    },
    {
      "name": "Шурјан",
      "postal_code": 23254
    }
  ]