<?xml version="1.0" encoding="UTF-8"?>
<session version="1.0">
<refactoring accessors="true" comment="Delete 3 elements from project &apos;AsciiGenetics&apos;&#x0A;- Original project: &apos;AsciiGenetics&apos;&#x0A;- Original elements:&#x0A;     AsciiCharacterData.java&#x0A;     AsciiPanel.java&#x0A;     TileTransformer.java" description="Delete elements" element1="/src&lt;{AsciiCharacterData.java" element2="/src&lt;{AsciiPanel.java" element3="/src&lt;{TileTransformer.java" elements="3" flags="589830" id="org.eclipse.jdt.ui.delete" resources="0" stamp="1427211166330" subPackages="false" version="1.0"/>
</session>