<?xml version="1.0" encoding="UTF-8"?>
<session version="1.0">
<refactoring comment="Copy element &apos;&apos; to &apos;PictureTester.testMyCollage()&apos;&#x0D;&#x0A;- Original project: &apos;CBLab2&apos;&#x0D;&#x0A;- Destination element: &apos;PictureTester.testMyCollage()&apos;&#x0D;&#x0A;- Original element: &apos;PictureTester.testMyCollage()&apos;" description="Copy method" destination="/src&lt;{PictureTester.java[PictureTester~testMyCollage" element1="/src&lt;{PictureTester.java[PictureTester~testMyCollage" flags="589830" id="org.eclipse.jdt.ui.copy" members="1" policy="org.eclipse.jdt.ui.copyMembers" stamp="1426996599045" version="1.0"/>
</session>