<?xml version="1.0" encoding="UTF-8"?>
<session version="1.0">
<refactoring accessors="true" comment="Delete element from project &apos;LabNine&apos;&#x0A;- Original project: &apos;LabNine&apos;&#x0A;- Original element: &apos;LabNine.java&apos;" description="Delete element" element1="/src&lt;{LabNine.java" elements="1" flags="589830" id="org.eclipse.jdt.ui.delete" resources="0" stamp="1417451709343" subPackages="false" version="1.0"/>
</session>