<?xml version="1.0" encoding="UTF-8"?>
<session version="1.0">
<refactoring comment="Delete resource &apos;Final&apos;" deleteContents="true" description="Delete resource &apos;Final&apos;" element1="/Final" flags="7" id="org.eclipse.ltk.core.refactoring.delete.resources" resources="1" stamp="1423671502286"/>
</session>