%YAML 1.1
%TAG !u! tag:unity3d.com,2011:
--- !u!114 &11400000
MonoBehaviour:
  m_ObjectHideFlags: 0
  m_CorrespondingSourceObject: {fileID: 0}
  m_PrefabInstance: {fileID: 0}
  m_PrefabAsset: {fileID: 0}
  m_GameObject: {fileID: 0}
  m_Enabled: 1
  m_EditorHideFlags: 0
  m_Script: {fileID: 11500000, guid: b0250381004a05b4dbff246db7264ac7, type: 3}
  m_Name: Default Texture
  m_EditorClassIdentifier: 
  autoUpdate: 1
  layers:
  - texture: {fileID: 2800000, guid: 3f7f63bf26afd7a4786c8afd92f55f6d, type: 3}
    tint: {r: 0, g: 0.5881056, b: 0.8396226, a: 0}
    tintStrength: 0.22
    startHeight: 0
    blendStrength: 0
    textureScale: 15.33
  - texture: {fileID: 2800000, guid: 509eb98ef0e546146b4e6901437658e4, type: 3}
    tint: {r: 1, g: 0.850078, b: 0.4481132, a: 0}
    tintStrength: 0.61
    startHeight: 0.11
    blendStrength: 0.02
    textureScale: 14.23
  - texture: {fileID: 2800000, guid: 68cbb9a55ed702246a75d5e227875f40, type: 3}
    tint: {r: 0.09394394, g: 0.745283, b: 0.059763268, a: 0}
    tintStrength: 0.14
    startHeight: 0.18
    blendStrength: 0.09
    textureScale: 2.18
  - texture: {fileID: 2800000, guid: 6b1eb4e2b8f4b0a42ac66cfab0c134d0, type: 3}
    tint: {r: 0.4245283, g: 0.33196718, b: 0.19023673, a: 0}
    tintStrength: 0
    startHeight: 0.37
    blendStrength: 0.17
    textureScale: 6.36
  - texture: {fileID: 2800000, guid: 450b670cd8427e24f88152b2072c1a08, type: 3}
    tint: {r: 0.26415092, g: 0.24397942, b: 0.23549303, a: 0}
    tintStrength: 0
    startHeight: 0.44
    blendStrength: 0.25
    textureScale: 16.49
  - texture: {fileID: 2800000, guid: 1257561fae49ce74fa30fc5aa24c934f, type: 3}
    tint: {r: 0.8679245, g: 0.8679245, b: 0.8679245, a: 0}
    tintStrength: 0.25
    startHeight: 0.61
    blendStrength: 0.43
    textureScale: 9.16
