<?xml version="1.0" encoding="UTF-8" standalone="no"?>
<svg
   xmlns:dc="http://purl.org/dc/elements/1.1/"
   xmlns:cc="http://creativecommons.org/ns#"
   xmlns:rdf="http://www.w3.org/1999/02/22-rdf-syntax-ns#"
   xmlns:svg="http://www.w3.org/2000/svg"
   xmlns="http://www.w3.org/2000/svg"
   xmlns:xlink="http://www.w3.org/1999/xlink"
   xmlns:sodipodi="http://sodipodi.sourceforge.net/DTD/sodipodi-0.dtd"
   xmlns:inkscape="http://www.inkscape.org/namespaces/inkscape"
   version="1.1"
   preserveAspectRatio="xMidYMid meet"
   viewBox="0 0 640 465"
   width="640"
   height="465"
   id="svg100"
   sodipodi:docname="newlogolight.svg"
   inkscape:version="0.92.3 (2405546, 2018-03-11)">
  <metadata
     id="metadata104">
    <rdf:RDF>
      <cc:Work
         rdf:about="">
        <dc:format>image/svg+xml</dc:format>
        <dc:type
           rdf:resource="http://purl.org/dc/dcmitype/StillImage" />
        <dc:title />
      </cc:Work>
    </rdf:RDF>
  </metadata>
  <sodipodi:namedview
     pagecolor="#ffffff"
     bordercolor="#666666"
     borderopacity="1"
     objecttolerance="10"
     gridtolerance="10"
     guidetolerance="10"
     inkscape:pageopacity="0"
     inkscape:pageshadow="2"
     inkscape:window-width="1920"
     inkscape:window-height="1151"
     id="namedview102"
     showgrid="false"
     inkscape:pagecheckerboard="true"
     inkscape:zoom="1.0429825"
     inkscape:cx="50.624554"
     inkscape:cy="299.73352"
     inkscape:window-x="0"
     inkscape:window-y="25"
     inkscape:window-maximized="1"
     inkscape:current-layer="g96" />
  <defs
     id="defs40">
    <linearGradient
       inkscape:collect="always"
       id="linearGradient1106">
      <stop
         style="stop-color:#ffffff;stop-opacity:1;"
         offset="0"
         id="stop1102" />
      <stop
         style="stop-color:#fea000;stop-opacity:1"
         offset="1"
         id="stop1104" />
    </linearGradient>
    <linearGradient
       id="linearGradient1062"
       gradientUnits="userSpaceOnUse"
       x1="291.26999"
       y1="12.27"
       x2="291.26999"
       y2="467.92001">
      <stop
         style="stop-color:#e30049;stop-opacity:1"
         offset="0%"
         id="stop1058" />
      <stop
         style="stop-color:#d40000;stop-opacity:1"
         offset="100%"
         id="stop1060" />
    </linearGradient>
    <linearGradient
       id="linearGradient1056"
       gradientUnits="userSpaceOnUse"
       x1="291.26999"
       y1="12.27"
       x2="291.26999"
       y2="467.92001">
      <stop
         style="stop-color:#3300ff;stop-opacity:1"
         offset="0%"
         id="stop1052" />
      <stop
         style="stop-color: #010000;stop-opacity: 1"
         offset="100%"
         id="stop1054" />
    </linearGradient>
    <linearGradient
       id="linearGradient1048"
       gradientUnits="userSpaceOnUse"
       x1="291.26999"
       y1="12.27"
       x2="291.26999"
       y2="467.92001">
      <stop
         style="stop-color:#1a00ff;stop-opacity:1"
         offset="0%"
         id="stop1044" />
      <stop
         style="stop-color:#fdff79;stop-opacity:1"
         offset="100%"
         id="stop1046" />
    </linearGradient>
    <linearGradient
       id="gradientc32pQtiAZG-3-6"
       gradientUnits="userSpaceOnUse"
       x1="291.26999"
       y1="12.27"
       x2="291.26999"
       y2="467.92001">
      <stop
         style="stop-color: #0c00ff;stop-opacity: 1"
         offset="0%"
         id="stop1037" />
      <stop
         style="stop-color: #010000;stop-opacity: 1"
         offset="100%"
         id="stop1039" />
    </linearGradient>
    <linearGradient
       y2="467.92001"
       x2="291.26999"
       y1="12.27"
       x1="291.26999"
       gradientUnits="userSpaceOnUse"
       id="try5r-3-6-5">
      <stop
         id="stop1024"
         offset="0%"
         style="stop-color:#e300ff;stop-opacity:1" />
      <stop
         id="stop1026"
         offset="100%"
         style="stop-color: #010000;stop-opacity: 1" />
    </linearGradient>
    <linearGradient
       y2="467.92001"
       x2="291.26999"
       y1="12.27"
       x1="291.26999"
       gradientUnits="userSpaceOnUse"
       id="gradientc32pQtiAZG-3">
      <stop
         id="stop1019"
         offset="0%"
         style="stop-color: #0c00ff;stop-opacity: 1" />
      <stop
         id="stop1021"
         offset="100%"
         style="stop-color: #010000;stop-opacity: 1" />
    </linearGradient>
    <linearGradient
       y2="467.92001"
       x2="291.26999"
       y1="12.27"
       x1="291.26999"
       gradientUnits="userSpaceOnUse"
       id="gradientc32pQtiAZG">
      <stop
         id="stop1014"
         offset="0%"
         style="stop-color: #0c00ff;stop-opacity: 1" />
      <stop
         id="stop1016"
         offset="100%"
         style="stop-color: #010000;stop-opacity: 1" />
    </linearGradient>
    <path
       d="m 644.93,-12.03 c 0,0 0,0 0,0 0,394.19 0,613.18 0,656.98 0,0 0,0 0,0 -394.19,0 -613.18,0 -656.98,0 0,0 0,0 0,0 0,-394.19 0,-613.18 0,-656.98 0,0 0,0 0,0 394.19,0 613.18,0 656.98,0 z"
       id="b2AHKky9OO"
       inkscape:connector-curvature="0" />
    <path
       d="M 633.01,325.53 507.7,187.69 V 81.76 h -74.04 v 24.49 L 348.23,12.27 v 455.65 h 85.43 V 354.01 l 56.96,-56.96 -28.48,56.96 v 113.91 h 170.87 z"
       id="a23bO8FXwm"
       inkscape:connector-curvature="0" />
    <linearGradient
       id="gradientaftreCMl1"
       gradientUnits="userSpaceOnUse"
       x1="490.62"
       y1="12.27"
       x2="490.62"
       y2="467.92001">
      <stop
         style="stop-color: #0c00ff;stop-opacity: 1"
         offset="0%"
         id="stop4" />
      <stop
         style="stop-color: #010000;stop-opacity: 1"
         offset="100%"
         id="stop6" />
    </linearGradient>
    <path
       d="m 262.79,467.92 h 56.96 V 12.27 l -56.96,56.96 z"
       id="dOOuE9I9Q"
       inkscape:connector-curvature="0" />
    <linearGradient
       id="gradientc32pQtiAZG-3-6-7"
       gradientUnits="userSpaceOnUse"
       x1="291.26999"
       y1="12.27"
       x2="291.26999"
       y2="467.92001">
      <stop
         style="stop-color: #0c00ff;stop-opacity: 1"
         offset="0%"
         id="stop14" />
      <stop
         style="stop-color: #010000;stop-opacity: 1"
         offset="100%"
         id="stop16" />
    </linearGradient>
    <text
       id="b9NXmfje62"
       x="7.3600001"
       y="445.76999"
       font-size="208"
       font-weight="700"
       font-style="normal"
       letter-spacing="0"
       alignment-baseline="before-edge"
       transform="translate(-12.816436,-7.6780357)"
       style="font-style:normal;font-weight:700;font-size:208px;line-height:100%;font-family:Rajdhani;letter-spacing:0;dominant-baseline:text-before-edge"
       xml:space="preserve"
       dominant-baseline="text-before-edge"><tspan
         x="7.3600001"
         dy="0em"
         alignment-baseline="before-edge"
         dominant-baseline="text-before-edge"
         id="tspan19"
         style="dominant-baseline:text-before-edge;text-anchor:start">kstat.io</tspan></text>
    <path
       d="m 177.36,467.92 h 56.96 V 97.7 l -56.96,56.96 z"
       id="c4b37qOG9"
       inkscape:connector-curvature="0" />
    <linearGradient
       id="gradientbDJy64uHZ"
       gradientUnits="userSpaceOnUse"
       x1="205.84"
       y1="97.699997"
       x2="205.84"
       y2="467.92001">
      <stop
         style="stop-color: #0c00ff;stop-opacity: 1"
         offset="0%"
         id="stop23" />
      <stop
         style="stop-color: #010000;stop-opacity: 1"
         offset="100%"
         id="stop25" />
    </linearGradient>
    <path
       d="M 6.49,467.92 H 63.45 V 268.57 L 6.49,325.53 Z"
       id="cG0ScehiJ"
       inkscape:connector-curvature="0" />
    <linearGradient
       id="gradientc1CI05Sa69"
       gradientUnits="userSpaceOnUse"
       x1="34.970001"
       y1="268.57001"
       x2="34.970001"
       y2="467.92001">
      <stop
         style="stop-color: #0c00ff;stop-opacity: 1"
         offset="0%"
         id="stop29" />
      <stop
         style="stop-color: #010000;stop-opacity: 1"
         offset="100%"
         id="stop31" />
    </linearGradient>
    <path
       d="m 91.93,467.92 h 56.95 V 183.14 l -56.95,56.95 z"
       id="d74JqJSLr6"
       inkscape:connector-curvature="0" />
    <linearGradient
       id="gradienta1KHLeEBKX"
       gradientUnits="userSpaceOnUse"
       x1="120.4"
       y1="183.14"
       x2="120.4"
       y2="467.92001">
      <stop
         style="stop-color: #0c00ff;stop-opacity: 1"
         offset="0%"
         id="stop35" />
      <stop
         style="stop-color: #010000;stop-opacity: 1"
         offset="100%"
         id="stop37" />
    </linearGradient>
    <linearGradient
       inkscape:collect="always"
       xlink:href="#try5r-3-6-5"
       id="linearGradient1035"
       x1="331.01941"
       y1="24.929609"
       x2="368.88428"
       y2="663.48297"
       gradientUnits="userSpaceOnUse" />
    <linearGradient
       inkscape:collect="always"
       xlink:href="#linearGradient1106"
       id="linearGradient1108"
       x1="322.39032"
       y1="512.95319"
       x2="323.82123"
       y2="226.27528"
       gradientUnits="userSpaceOnUse" />
  </defs>
  <g
     id="g98"
     transform="translate(0,-175)"
     style="fill:url(#linearGradient1035);fill-opacity:1">
    <g
       id="g96"
       style="fill:url(#linearGradient1035);fill-opacity:1.0">
      <g
         id="g56"
         transform="translate(0,165.87047)"
         style="fill:url(#linearGradient1035);fill-opacity:1.0" />
      <g
         id="c2WSriHxiN"
         style="fill:url(#linearGradient1035);fill-opacity:1.0">
        <use
           xlink:href="#a51fzNP62s"
           id="use58"
           style="opacity:1;fill:url(#linearGradient1035);fill-opacity:1.0"
           x="0"
           y="0"
           width="100%"
           height="100%" />
      </g>
      <g
         id="bigBqL9CZ"
         transform="translate(0.08225109,35.767701)"
         style="fill:url(#linearGradient1035);fill-opacity:1.0" />
      <g
         id="g1002"
         style="fill:url(#linearGradient1108);fill-opacity:1"
         inkscape:transform-center-x="116.01345"
         inkscape:transform-center-y="-110.82282">
        <use
           height="100%"
           width="100%"
           y="0"
           x="0"
           style="opacity:1;fill:url(#linearGradient1108);fill-opacity:1"
           id="use50"
           xlink:href="#a23bO8FXwm"
           transform="translate(0,165.87047)" />
        <g
           id="g54"
           transform="translate(0,165.87047)"
           style="fill:url(#linearGradient1108);fill-opacity:1">
          <use
             height="100%"
             width="100%"
             y="0"
             x="0"
             style="opacity:1;fill:url(#linearGradient1108);fill-opacity:1;stroke:#000000;stroke-width:1;stroke-opacity:0"
             id="use52"
             xlink:href="#a23bO8FXwm" />
        </g>
        <g
           transform="translate(0,165.87047)"
           id="g67"
           style="fill:url(#linearGradient1108);fill-opacity:1">
          <use
             height="100%"
             width="100%"
             y="0"
             x="0"
             style="opacity:1;fill:url(#linearGradient1108);fill-opacity:1"
             id="use61"
             xlink:href="#dOOuE9I9Q" />
          <g
             id="g65"
             style="fill:url(#linearGradient1108);fill-opacity:1">
            <use
               height="100%"
               width="100%"
               y="0"
               x="0"
               style="opacity:1;fill:url(#linearGradient1108);fill-opacity:1;stroke:#000000;stroke-width:1;stroke-opacity:0"
               id="use63"
               xlink:href="#dOOuE9I9Q" />
          </g>
        </g>
        <g
           transform="translate(0,165.87047)"
           id="g78"
           style="fill:url(#linearGradient1108);fill-opacity:1">
          <use
             height="100%"
             width="100%"
             y="0"
             x="0"
             style="opacity:1;fill:url(#linearGradient1108);fill-opacity:1"
             id="use72"
             xlink:href="#c4b37qOG9" />
          <g
             id="g76"
             style="fill:url(#linearGradient1108);fill-opacity:1">
            <use
               height="100%"
               width="100%"
               y="0"
               x="0"
               style="opacity:1;fill:url(#linearGradient1108);fill-opacity:1;stroke:#000000;stroke-width:1;stroke-opacity:0"
               id="use74"
               xlink:href="#c4b37qOG9" />
          </g>
        </g>
        <g
           transform="translate(0,165.87047)"
           id="g86"
           style="fill:url(#linearGradient1108);fill-opacity:1">
          <use
             height="100%"
             width="100%"
             y="0"
             x="0"
             style="opacity:1;fill:url(#linearGradient1108);fill-opacity:1"
             id="use80"
             xlink:href="#cG0ScehiJ" />
          <g
             id="g84"
             style="fill:url(#linearGradient1108);fill-opacity:1">
            <use
               height="100%"
               width="100%"
               y="0"
               x="0"
               style="opacity:1;fill:url(#linearGradient1108);fill-opacity:1;stroke:#000000;stroke-width:1;stroke-opacity:0"
               id="use82"
               xlink:href="#cG0ScehiJ" />
          </g>
        </g>
        <g
           transform="translate(0,165.87047)"
           id="g94"
           style="fill:url(#linearGradient1108);fill-opacity:1">
          <use
             height="100%"
             width="100%"
             y="0"
             x="0"
             style="opacity:1;fill:url(#linearGradient1108);fill-opacity:1"
             id="use88"
             xlink:href="#d74JqJSLr6" />
          <g
             id="g92"
             style="fill:url(#linearGradient1108);fill-opacity:1">
            <use
               height="100%"
               width="100%"
               y="0"
               x="0"
               style="opacity:1;fill:url(#linearGradient1108);fill-opacity:1;stroke:#000000;stroke-width:1;stroke-opacity:0"
               id="use90"
               xlink:href="#d74JqJSLr6" />
          </g>
        </g>
      </g>
    </g>
  </g>
</svg>
