<?xml version="1.0" encoding="UTF-8" standalone="no"?>
<svg
   xmlns:dc="http://purl.org/dc/elements/1.1/"
   xmlns:cc="http://creativecommons.org/ns#"
   xmlns:rdf="http://www.w3.org/1999/02/22-rdf-syntax-ns#"
   xmlns:svg="http://www.w3.org/2000/svg"
   xmlns="http://www.w3.org/2000/svg"
   xmlns:sodipodi="http://sodipodi.sourceforge.net/DTD/sodipodi-0.dtd"
   xmlns:inkscape="http://www.inkscape.org/namespaces/inkscape"
   width="128px"
   height="128px"
   viewbox="0 0 128 128"
   version="1.1"
   id="svg54"
   sodipodi:docname="logo.svg"
   inkscape:version="0.92.3 (unknown)">
  <metadata
     id="metadata58">
    <rdf:RDF>
      <cc:Work
         rdf:about="">
        <dc:format>image/svg+xml</dc:format>
        <dc:type
           rdf:resource="http://purl.org/dc/dcmitype/StillImage" />
        <dc:title></dc:title>
      </cc:Work>
    </rdf:RDF>
  </metadata>
  <sodipodi:namedview
     pagecolor="#ffffff"
     bordercolor="#666666"
     borderopacity="1"
     objecttolerance="10"
     gridtolerance="10"
     guidetolerance="10"
     inkscape:pageopacity="0"
     inkscape:pageshadow="2"
     inkscape:window-width="1920"
     inkscape:window-height="1149"
     id="namedview56"
     showgrid="false"
     inkscape:zoom="5.6568542"
     inkscape:cx="172.52128"
     inkscape:cy="47.77431"
     inkscape:window-x="1920"
     inkscape:window-y="27"
     inkscape:window-maximized="1"
     inkscape:current-layer="svg54"
     inkscape:snap-global="false" />
  <defs
     id="defs2" />
  <path
     d="m 103.54742,122.98633 a 24.463954,24.463954 0 0 0 0,-48.927902"
     id="path4"
     inkscape:connector-curvature="0"
     style="fill:#222222;stroke-width:0" />
  <circle
     cx="11.530859"
     cy="111.45541"
     id="circle6"
     style="fill:#222222;stroke:#222222;stroke-width:0"
     r="11.530907" />
  <ellipse
     cx="24.463943"
     cy="42.132622"
     id="circle8"
     style="fill:#222222;stroke:#222222;stroke-width:0"
     rx="24.463982"
     ry="24.601376" />
  <path
     d="M 11.530882,111.45543 H 28.827229 V 19.208271 L 11.530882,37.657678"
     id="path10"
     inkscape:connector-curvature="0"
     style="fill:#fca636;stroke-width:0" />
  <rect
     x="28.827221"
     y="14.700421"
     width="17.296349"
     height="96.755058"
     id="rect12"
     style="fill:#f0f921;stroke-width:0" />
  <path
     d="M 46.123574,111.45543 H 63.419911 V 37.657678 L 46.123574,19.208271"
     id="path14"
     inkscape:connector-curvature="0"
     style="fill:#fca636;stroke-width:0" />
  <path
     d="m 63.419911,114.10708 h 17.29636 V 56.305998 L 63.419911,37.03896"
     id="path16"
     inkscape:connector-curvature="0"
     style="fill:#e16462;stroke-width:0" />
  <path
     d="M 80.716271,114.10708 H 98.012622 V 74.527095 L 80.716271,54.737105"
     id="path18"
     inkscape:connector-curvature="0"
     style="fill:#b12a90;stroke-width:0" />
  <path
     d="M 98.012622,111.45543 H 103.6153 L 113.0028,90.699818 98.012622,74.556558"
     id="path20"
     inkscape:connector-curvature="0"
     style="fill:#6a00a8;stroke-width:0"
     sodipodi:nodetypes="cccc" />
  <path
     d="M 80.716271,40.513667 98.012622,58.999999 V 30.11508 H 80.716271 Z"
     id="path22"
     inkscape:connector-curvature="0"
     style="fill:#222222;stroke:#222222;stroke-width:0" />
  <path
     d="m 46.123574,112.07415 h 9.224712 V 67.756498 L 46.123574,57.260211 Z"
     id="path24"
     inkscape:connector-curvature="0"
     style="fill:#222222;stroke:#222222;stroke-width:0" />
  <rect
     x="-3.2054639e-05"
     y="42.270035"
     width="11.530907"
     height="69.185394"
     id="rect26"
     style="fill:#222222;stroke:#222222;stroke-width:0" />
  <path
     d="m 55.348286,67.63802 a 17.872889,17.872889 0 0 0 -35.745775,0"
     id="path28"
     inkscape:connector-curvature="0"
     style="fill:#222222;stroke-width:0" />
  <circle
     cx="37.475376"
     cy="67.638016"
     id="circle30"
     style="fill:#f0f921;stroke-width:0"
     r="8.6481743" />
  <path
     d="M 11.530882,37.657678 28.827229,19.208271 c 5.651115,-4.794255 11.419687,-4.789629 17.296345,0 L 117.61513,96.465258 121.305,81.705718 54.425817,10.214139 H 20.52498 L 6.9185237,24.973682 Z"
     id="path32"
     inkscape:connector-curvature="0"
     style="fill:#222222;stroke-width:0"
     sodipodi:nodetypes="ccccccccc" />
  <path
     d="m 56.215878,12.131279 a 24.463951,24.463951 0 0 0 -37.48095,0"
     id="path36"
     inkscape:connector-curvature="0"
     style="fill:#222222;stroke-width:0" />
  <rect
     x="11.530859"
     y="111.45541"
     width="92.247253"
     height="11.530907"
     id="rect38"
     style="fill:#222222;stroke:#222222;stroke-width:0" />
  <path
     d="m 98.012622,30.739148 a 8.6481793,8.6481793 0 0 0 -17.296351,0"
     id="path40"
     inkscape:connector-curvature="0"
     style="fill:#222222;stroke-width:0" />
  <path
     d="m 103.5677,111.45279 c 10.87183,0 16.29625,-13.237592 8.60866,-20.925142"
     id="path42"
     inkscape:connector-curvature="0"
     style="fill:#6a00a8;stroke-width:0"
     sodipodi:nodetypes="cc" />
  <rect
     x="11.530859"
     y="105.89732"
     width="5.7654533"
     height="5.5581694"
     id="rect44"
     style="fill:#222222;stroke-width:0" />
  <circle
     cx="17.296333"
     cy="105.68997"
     id="circle46"
     style="fill:#fca636;stroke-width:0"
     r="5.7654533" />
  <rect
     x="11.530859"
     y="36.504601"
     width="3.459269"
     height="3.459269"
     id="rect48"
     style="fill:#222222;stroke-width:0" />
  <circle
     cx="17.296333"
     cy="39.96386"
     id="circle50"
     style="fill:#fca636;stroke-width:0"
     r="5.7654533" />
  <path
     d="m 19.602511,112.60448 h 9.224718 V 57.260211 l -9.224718,10.59784 z"
     id="path52"
     inkscape:connector-curvature="0"
     style="fill:#222222;stroke:#222222;stroke-width:0" />
  <flowRoot
     xml:space="preserve"
     id="flowRoot33"
     style="fill:black;stroke:none;stroke-opacity:1;stroke-width:1px;stroke-linejoin:miter;stroke-linecap:butt;fill-opacity:1;font-family:'Apple Garamond';font-style:normal;font-weight:normal;font-size:5.33333333px;line-height:125%;letter-spacing:0px;word-spacing:0px;-inkscape-font-specification:'Apple Garamond';font-stretch:normal;font-variant:normal"><flowRegion
       id="flowRegion35"><rect
         id="rect37"
         width="458.55875"
         height="61.518291"
         x="-112.07642"
         y="186.26703" /></flowRegion><flowPara
       id="flowPara39" /></flowRoot></svg>
