<?xml version="1.0" encoding="UTF-8" standalone="no"?>
<svg
   xmlns:dc="http://purl.org/dc/elements/1.1/"
   xmlns:cc="http://creativecommons.org/ns#"
   xmlns:rdf="http://www.w3.org/1999/02/22-rdf-syntax-ns#"
   xmlns:svg="http://www.w3.org/2000/svg"
   xmlns="http://www.w3.org/2000/svg"
   xmlns:sodipodi="http://sodipodi.sourceforge.net/DTD/sodipodi-0.dtd"
   xmlns:inkscape="http://www.inkscape.org/namespaces/inkscape"
   inkscape:export-ydpi="69"
   inkscape:export-xdpi="69"
   inkscape:export-filename="/home/viniciusglinden/Desktop/HDL_files_hierarchy.png"
   sodipodi:docname="HDL_files_hierarchy.svg"
   inkscape:version="1.0 (4035a4fb49, 2020-05-01)"
   id="svg8"
   version="1.1"
   viewBox="0 0 90 101"
   height="101mm"
   width="90mm">
  <defs
     id="defs2" />
  <sodipodi:namedview
     inkscape:document-rotation="0"
     inkscape:window-maximized="1"
     inkscape:window-y="21"
     inkscape:window-x="0"
     inkscape:window-height="1055"
     inkscape:window-width="1916"
     showgrid="true"
     inkscape:current-layer="layer1"
     inkscape:document-units="mm"
     inkscape:cy="160.48714"
     inkscape:cx="284.82758"
     inkscape:zoom="1.979899"
     inkscape:pageshadow="2"
     inkscape:pageopacity="1"
     borderopacity="1.0"
     bordercolor="#666666"
     pagecolor="#ffffff"
     id="base">
    <inkscape:grid
       empspacing="2"
       spacingy="2.6458333"
       spacingx="2.6458333"
       id="grid815"
       type="xygrid" />
  </sodipodi:namedview>
  <metadata
     id="metadata5">
    <rdf:RDF>
      <cc:Work
         rdf:about="">
        <dc:format>image/svg+xml</dc:format>
        <dc:type
           rdf:resource="http://purl.org/dc/dcmitype/StillImage" />
        <dc:title></dc:title>
      </cc:Work>
    </rdf:RDF>
  </metadata>
  <g
     style="display:inline"
     transform="translate(0,-207)"
     id="layer1"
     inkscape:groupmode="layer"
     inkscape:label="Drawing">
    <rect
       ry="0"
       y="212.29167"
       x="5.2916665"
       height="74.083336"
       width="79.374992"
       id="rect817-5"
       style="fill:#ffffff;fill-opacity:1;stroke:#000000;stroke-width:0.5;stroke-linecap:butt;stroke-miterlimit:4;stroke-dasharray:none;stroke-dashoffset:0;stroke-opacity:1" />
    <rect
       ry="0"
       y="222.875"
       x="10.583334"
       height="58.208332"
       width="68.791664"
       id="rect817"
       style="fill:none;fill-opacity:1;stroke:#4d4d4d;stroke-width:0.5;stroke-linecap:butt;stroke-miterlimit:4;stroke-dasharray:4, 0.5;stroke-dashoffset:0;stroke-opacity:1" />
    <text
       id="text821"
       y="230.07281"
       x="31.23237"
       style="font-style:normal;font-variant:normal;font-weight:normal;font-stretch:normal;font-size:7.76111px;line-height:1.25;font-family:'Times New Roman';-inkscape-font-specification:'Times New Roman, ';letter-spacing:0px;word-spacing:0px;fill:#4d4d4d;fill-opacity:1;stroke:none;stroke-width:0.264583"
       xml:space="preserve"><tspan
         style="fill:#4d4d4d;stroke:none;stroke-width:0.264583"
         y="230.07281"
         x="31.23237"
         id="tspan819"
         sodipodi:role="line">top-level</tspan></text>
    <rect
       ry="0"
       y="233.45833"
       x="15.875"
       height="42.333324"
       width="58.208332"
       id="rect817-0-0-3"
       style="fill:#ffffff;fill-opacity:1;stroke:#000000;stroke-width:0.5;stroke-linecap:butt;stroke-miterlimit:4;stroke-dasharray:none;stroke-dashoffset:0;stroke-opacity:1" />
    <rect
       style="display:inline;fill:#ffffff;fill-opacity:1;stroke:#000000;stroke-width:0.499999;stroke-linecap:butt;stroke-miterlimit:4;stroke-dasharray:none;stroke-dashoffset:0;stroke-opacity:1"
       id="rect817-0-3"
       width="47.625"
       height="10.583339"
       x="21.166666"
       y="259.91663"
       ry="0" />
    <text
       id="text821-8-8"
       y="240.87041"
       x="33.353046"
       style="font-style:normal;font-variant:normal;font-weight:normal;font-stretch:normal;font-size:7.76111px;line-height:1.25;font-family:'Times New Roman';-inkscape-font-specification:'Times New Roman, ';letter-spacing:0px;word-spacing:0px;fill:#000000;fill-opacity:1;stroke:none;stroke-width:0.264583"
       xml:space="preserve"><tspan
         style="stroke-width:0.264583"
         y="240.87041"
         x="33.353046"
         id="tspan819-5-3"
         sodipodi:role="line">module</tspan></text>
    <rect
       ry="0"
       y="244.04167"
       x="21.166666"
       height="10.583338"
       width="47.625"
       id="rect817-0"
       style="fill:#ffffff;fill-opacity:1;stroke:#000000;stroke-width:0.5;stroke-linecap:butt;stroke-miterlimit:4;stroke-dasharray:none;stroke-dashoffset:0;stroke-opacity:1" />
    <text
       id="text821-8"
       y="251.29689"
       x="22.561272"
       style="font-style:normal;font-variant:normal;font-weight:normal;font-stretch:normal;font-size:7.76111px;line-height:1.25;font-family:'Times New Roman';-inkscape-font-specification:'Times New Roman, ';letter-spacing:0px;word-spacing:0px;fill:#000000;fill-opacity:1;stroke:none;stroke-width:0.264583"
       xml:space="preserve"><tspan
         style="stroke-width:0.264583"
         y="251.29689"
         x="22.561272"
         id="tspan819-5"
         sodipodi:role="line">(sub-)modules</tspan></text>
    <text
       id="text821-8-8-3"
       y="267.81992"
       x="24.377369"
       style="font-style:normal;font-variant:normal;font-weight:normal;font-stretch:normal;font-size:7.76111px;line-height:1.25;font-family:'Times New Roman';-inkscape-font-specification:'Times New Roman, ';letter-spacing:0px;word-spacing:0px;fill:#000000;fill-opacity:1;stroke:none;stroke-width:0.264583"
       xml:space="preserve"><tspan
         style="stroke-width:0.264583"
         y="267.81992"
         x="24.377369"
         id="tspan819-5-3-4"
         sodipodi:role="line">instantiations</tspan></text>
    <text
       id="text821-5"
       y="220.26636"
       x="28.435648"
       style="font-style:normal;font-variant:normal;font-weight:normal;font-stretch:normal;font-size:7.76111px;line-height:1.25;font-family:'Times New Roman';-inkscape-font-specification:'Times New Roman, ';letter-spacing:0px;word-spacing:0px;fill:#000000;fill-opacity:1;stroke:none;stroke-width:0.264583"
       xml:space="preserve"><tspan
         style="stroke-width:0.264583"
         y="220.26636"
         x="28.435648"
         id="tspan819-1"
         sodipodi:role="line">simulation</tspan></text>
    <text
       xml:space="preserve"
       style="font-style:normal;font-variant:normal;font-weight:normal;font-stretch:normal;font-size:4.23333px;line-height:1;font-family:'Times New Roman';-inkscape-font-specification:'Times New Roman, ';letter-spacing:0px;word-spacing:0px;display:inline;fill:#000000;fill-opacity:1;stroke:none;stroke-width:0.264583"
       x="7.8405991"
       y="300.853"
       id="text821-8-8-5"><tspan
         id="tspan944"
         sodipodi:role="line"
         x="7.8405991"
         y="300.853"
         style="font-size:4.23333px;stroke-width:0.264583">modules assembly</tspan></text>
    <text
       id="text821-8-8-5-2"
       y="290.54904"
       x="7.8702331"
       style="font-style:normal;font-variant:normal;font-weight:normal;font-stretch:normal;font-size:4.23333px;line-height:1;font-family:'Times New Roman';-inkscape-font-specification:'Times New Roman, ';letter-spacing:0px;word-spacing:0px;display:inline;fill:#000000;fill-opacity:1;stroke:none;stroke-width:0.264583"
       xml:space="preserve"><tspan
         id="tspan946"
         style="font-size:4.23333px;stroke-width:0.264583"
         y="290.54904"
         x="7.8702331"
         sodipodi:role="line">hardware interface</tspan></text>
    <path
       sodipodi:nodetypes="ccc"
       id="path940"
       d="M 5.2916666,291.66666 H 42.333333 l 10.583333,-10.58333"
       style="fill:none;stroke:#4d4d4d;stroke-width:0.5;stroke-linecap:butt;stroke-linejoin:miter;stroke-miterlimit:4;stroke-dasharray:4, 0.5;stroke-dashoffset:1.4;stroke-opacity:1" />
    <path
       sodipodi:nodetypes="ccc"
       id="path942"
       d="M 5.2916651,302.25001 44.979166,302.25 71.437499,275.79167"
       style="fill:none;stroke:#000000;stroke-width:0.5;stroke-linecap:butt;stroke-linejoin:miter;stroke-miterlimit:4;stroke-dasharray:none;stroke-opacity:1" />
    <path
       style="display:inline;fill:none;stroke:#4d4d4d;stroke-width:0.5;stroke-linecap:butt;stroke-linejoin:miter;stroke-miterlimit:4;stroke-dasharray:4, 0.5;stroke-dashoffset:4;stroke-opacity:1"
       d="m 42.333333,291.66667 -5.291667,5.29166 H 5.2916666"
       id="path940-3"
       sodipodi:nodetypes="ccc" />
    <text
       id="text821-8-8-5-6"
       y="295.56345"
       x="6.7051334"
       style="font-style:normal;font-variant:normal;font-weight:normal;font-stretch:normal;font-size:4.23333px;line-height:1;font-family:'Times New Roman';-inkscape-font-specification:'Times New Roman, ';letter-spacing:0px;word-spacing:0px;display:inline;fill:#000000;fill-opacity:1;stroke:none;stroke-width:0.264583"
       xml:space="preserve"><tspan
         style="font-size:4.23333px;stroke-width:0.264583"
         y="295.56345"
         x="6.7051334"
         sodipodi:role="line"
         id="tspan944-0">(optional)</tspan></text>
  </g>
  <g
     style="display:inline"
     transform="translate(0,-120)"
     inkscape:label="Guide"
     id="layer2"
     inkscape:groupmode="layer">
    <path
       sodipodi:nodetypes="cc"
       inkscape:connector-curvature="0"
       id="path881"
       d="m -2.6458331,146.45832 v 10.58334"
       style="fill:none;stroke:#000000;stroke-width:1;stroke-linecap:butt;stroke-linejoin:miter;stroke-miterlimit:4;stroke-dasharray:none;stroke-opacity:1" />
    <path
       style="fill:none;stroke:#000000;stroke-width:1;stroke-linecap:butt;stroke-linejoin:miter;stroke-miterlimit:4;stroke-dasharray:none;stroke-opacity:1"
       d="m -5.2916664,135.87498 v 10.58334"
       id="path881-3"
       inkscape:connector-curvature="0"
       sodipodi:nodetypes="cc" />
    <path
       style="fill:none;stroke:#000000;stroke-width:1;stroke-linecap:butt;stroke-linejoin:miter;stroke-miterlimit:4;stroke-dasharray:none;stroke-opacity:1"
       d="m -2.6458331,125.29165 v 10.58334"
       id="path881-6"
       inkscape:connector-curvature="0"
       sodipodi:nodetypes="cc" />
    <path
       sodipodi:nodetypes="cc"
       inkscape:connector-curvature="0"
       id="path881-6-1"
       d="m 7.4083332,223.1875 v 10.58334"
       style="display:inline;fill:none;stroke:#000000;stroke-width:1;stroke-linecap:butt;stroke-linejoin:miter;stroke-miterlimit:4;stroke-dasharray:none;stroke-opacity:1" />
    <path
       sodipodi:nodetypes="cc"
       inkscape:connector-curvature="0"
       id="path881-6-1-2-0"
       d="m -2.6458333,206.25415 v 2.64584"
       style="display:inline;fill:none;stroke:#000000;stroke-width:1;stroke-linecap:butt;stroke-linejoin:miter;stroke-miterlimit:4;stroke-dasharray:none;stroke-opacity:1" />
    <path
       style="display:inline;fill:none;stroke:#000000;stroke-width:1;stroke-linecap:butt;stroke-linejoin:miter;stroke-miterlimit:4;stroke-dasharray:none;stroke-opacity:1"
       d="m -2.6458333,200.96248 v 2.64584"
       id="path881-6-1-2-0-9"
       inkscape:connector-curvature="0"
       sodipodi:nodetypes="cc" />
    <path
       style="display:inline;fill:none;stroke:#000000;stroke-width:1;stroke-linecap:butt;stroke-linejoin:miter;stroke-miterlimit:4;stroke-dasharray:none;stroke-opacity:1"
       d="m -2.6458333,211.54582 v 2.64584"
       id="path881-6-1-2-0-3"
       inkscape:connector-curvature="0"
       sodipodi:nodetypes="cc" />
  </g>
</svg>
