{
  "project_info": {
    "project_number": "874868245578",
    "project_id": "test-47e86",
    "storage_bucket": "test-47e86.appspot.com"
  },
  "client": [
    {
      "client_info": {
        "mobilesdk_app_id": "1:874868245578:android:3b1ecd8491b9d4c2ba12b3",
        "android_client_info": {
          "package_name": "com.example.firebase"
        }
      },
      "oauth_client": [
        {
          "client_id": "874868245578-cicbvm93r9rtnuckavjj44hopomskitd.apps.googleusercontent.com",
          "client_type": 1,
          "android_info": {
            "package_name": "com.example.firebase",
            "certificate_hash": "f717c07ef13e15d8ed0f47f5ab28b4c2e94db78e"
          }
        },
        {
          "client_id": "874868245578-7liov8q4j8qaq4hdabebtd6qit168m3j.apps.googleusercontent.com",
          "client_type": 3
        }
      ],
      "api_key": [
        {
          "current_key": "AIzaSyAeShaWXhn33NMmPVR5tOxL0APfMbjNk8k"
        }
      ],
      "services": {
        "appinvite_service": {
          "other_platform_oauth_client": [
            {
              "client_id": "874868245578-7liov8q4j8qaq4hdabebtd6qit168m3j.apps.googleusercontent.com",
              "client_type": 3
            }
          ]
        }
      }
    },
    {
      "client_info": {
        "mobilesdk_app_id": "1:874868245578:android:d6e6c2318aa8a218ba12b3",
        "android_client_info": {
          "package_name": "com.example.myproject"
        }
      },
      "oauth_client": [
        {
          "client_id": "874868245578-7liov8q4j8qaq4hdabebtd6qit168m3j.apps.googleusercontent.com",
          "client_type": 3
        }
      ],
      "api_key": [
        {
          "current_key": "AIzaSyAeShaWXhn33NMmPVR5tOxL0APfMbjNk8k"
        }
      ],
      "services": {
        "appinvite_service": {
          "other_platform_oauth_client": [
            {
              "client_id": "874868245578-7liov8q4j8qaq4hdabebtd6qit168m3j.apps.googleusercontent.com",
              "client_type": 3
            }
          ]
        }
      }
    }
  ],
  "configuration_version": "1"
}