{
	"TV_Data": {
		"Channel_List": {
			"is_channel_list": true,
			"is_override": true,
			"thumb_width": 150,
			"all_Channels_Tab_Name": "",
			"main": {
				"id": 1,
				"name": "Afghanistan Channels",
				"sub_name": "Channels",
				"thumbnail_url": "https://flagpedia.net/data/flags/h80/af.png",
				"sub": [{
						"id": 1,
						"mode": "video",
						"name_original": "Movie 1",
						"name": "Vitals. Una Historia Humana",
						"sub_name": "",
						"stream_video_url": "https://objectstorage.us-ashburn-1.oraclecloud.com/n/idobiqa76ql5/b/Vid/o/covid.mp4",
						"thumbnail_url": "https://tse2.mm.bing.net/th?id=OIP.t0aGgARLnAm1FcVrsyHurQHaLH&pid=Api&P=0&w=300&h=300",
						"thumbnail_url_original": "https://tse2.mm.bing.net/th?id=OIP.t0aGgARLnAm1FcVrsyHurQHaLH&pid=Api&P=0&w=300&h=300"
					},
					{
						"id": 2,
						"mode": "video",
						"name_original": "Movie 2",
						"name": "EL JUEGO DEL CALAMAR",
						"sub_name": "",
						"stream_video_url": "http://199.188.103.26/rombwgshgfhgdsjr/85455532potroxvix/Series/El%20Juego%20del%20Calamar/temp1/1.mp4",
						"thumbnail_url": "https://tse2.explicit.bing.net/th?id=OIP.cqd4ItkGawU5a02vGeYs_QHaKY&pid=Api&P=0&w=300&h=300",
						"thumbnail_url_original": "https://tse2.explicit.bing.net/th?id=OIP.cqd4ItkGawU5a02vGeYs_QHaKY&pid=Api&P=0&w=300&h=300"
					},
					{
						"id": 3,
						"mode": "website",
						"name_original": "",
						"name": "YOYO Videochats",
						"sub_name": "Free Random Video calls (Ad)",
						"website_url": "https://play.google.com/store/apps/details?id=com.yoyolive.llc",
						"is_system_browser": true,
						"thumbnail_url": "https://play-lh.googleusercontent.com/33_mPNzvE6WRV6czGRm8EhSrSh0G9wnRQRfMXfcqQLU8j3z4UYu7nrgw5SmaP9UFf0U=w240-h480-rw",
						"thumbnail_url_original": ""
					},
					{
						"id": 4,
						"mode": "video",
						"name_original": "Movie 4",
						"name": "CALAMAR2",
						"sub_name": "",
						"stream_video_url": "http://199.188.103.26/rombwgshgfhgdsjr/85455532potroxvix/Series/El%20Juego%20del%20Calamar/temp1/2.mp4",
						"thumbnail_url": "https://tse2.mm.bing.net/th?id=OIP.Yx669Xpau0otrwzxo0Q8RQHaHa&pid=Api&P=0&w=300&h=300",
						"thumbnail_url_original": "https://tse2.mm.bing.net/th?id=OIP.Yx669Xpau0otrwzxo0Q8RQHaHa&pid=Api&P=0&w=300&h=300"
					},
					{
						"id": 5,
						"mode": "video",
						"name_original": "Movie 5",
						"name": "CALAMAR5",
						"sub_name": "",
						"stream_video_url": "http://199.188.103.26/rombwgshgfhgdsjr/85455532potroxvix/Series/El%20Juego%20del%20Calamar/temp1/5.mp4",
						"thumbnail_url": "https://tse2.mm.bing.net/th?id=OIP.J9JneGzV0TcEBIZ9lZOVogHaKc&pid=Api&P=0&w=300&h=300",
						"thumbnail_url_original": "https://tse2.mm.bing.net/th?id=OIP.J9JneGzV0TcEBIZ9lZOVogHaKc&pid=Api&P=0&w=300&h=300"
					},
					{
						"id": 6,
						"mode": "website",
						"name_original": "",
						"name": "World Live TV",
						"sub_name": "Free All country TV Channels (Ad)",
						"website_url": "https://play.google.com/store/apps/details?id=com.iptv.m3u.playlists",
						"is_system_browser": true,
						"thumbnail_url": "https://play-lh.googleusercontent.com/8mPNKodK65zCjQHS8aqF4o0cX9YlKZYN-3qYCd9oMlcTkGaAf_3AxB0vnE9Kud6bPw=w240-h480-rw",
						"thumbnail_url_original": ""
					},
					{
						"id": 7,
						"mode": "video",
						"name_original": "Movie 7",
						"name": "CALAMAR6",
						"sub_name": "",
						"stream_video_url": "http://199.188.103.26/rombwgshgfhgdsjr/85455532potroxvix/Series/El%20Juego%20del%20Calamar/temp1/6.mp4",
						"thumbnail_url": "https://tse2.mm.bing.net/th?id=OIP.ctTrptKQsGguAy_Wkl8d0AAAAA&pid=Api&P=0&w=300&h=300",
						"thumbnail_url_original": "https://tse2.mm.bing.net/th?id=OIP.ctTrptKQsGguAy_Wkl8d0AAAAA&pid=Api&P=0&w=300&h=300"
					},
					{
						"id": 8,
						"mode": "video",
						"name_original": "Movie 8",
						"name": "CALAMAR7",
						"sub_name": "",
						"stream_video_url": "http://199.188.103.26/rombwgshgfhgdsjr/85455532potroxvix/Series/El%20Juego%20del%20Calamar/temp1/7.mp4",
						"thumbnail_url": "https://tse2.mm.bing.net/th?id=OIP.J9JneGzV0TcEBIZ9lZOVogHaKc&pid=Api&P=0&w=300&h=300",
						"thumbnail_url_original": "https://tse2.mm.bing.net/th?id=OIP.J9JneGzV0TcEBIZ9lZOVogHaKc&pid=Api&P=0&w=300&h=300"
					},
					{
						"id": 9,
						"mode": "website",
						"name_original": "",
						"name": "Latest HD Movies",
						"sub_name": "Free HD Movie (Ad)",
						"website_url": "https://play.google.com/store/apps/details?id=com.watch.live.movies",
						"is_system_browser": true,
						"thumbnail_url": "https://play-lh.googleusercontent.com/Qz8xpOMY97Nd_g0DSsb29DJqZVMfQhIO94qoP8KG8wpaXeU0eJ2r5TJjJmHXVgab8Q=w240-h480-rw",
						"thumbnail_url_original": ""
					},
					{
						"id": 10,
						"mode": "video",
						"name_original": "Movie 10",
						"name": "CALAMAR9",
						"sub_name": "",
						"stream_video_url": "http://199.188.103.26/rombwgshgfhgdsjr/85455532potroxvix/Series/El%20Juego%20del%20Calamar/temp1/9.mp4",
						"thumbnail_url": "https://tse2.mm.bing.net/th?id=OIP.ctTrptKQsGguAy_Wkl8d0AAAAA&pid=Api&P=0&w=300&h=300",
						"thumbnail_url_original": "https://tse2.mm.bing.net/th?id=OIP.ctTrptKQsGguAy_Wkl8d0AAAAA&pid=Api&P=0&w=300&h=300"
					},
					{
						"id": 11,
						"mode": "video",
						"name_original": "Movie 11",
						"name": "LA CASA DE PAPEL 5",
						"sub_name": "",
						"stream_video_url": "http://199.188.103.26/rombwgshgfhgdsjr/85455532potroxvix/Series/La%20casa%20de%20papel/temp5/1.mp4",
						"thumbnail_url": "https://tse2.mm.bing.net/th?id=OIP.hpM6_zQJcGfAt6TUKXCm_AHaLH&pid=Api&P=0&w=300&h=300",
						"thumbnail_url_original": "https://tse2.mm.bing.net/th?id=OIP.hpM6_zQJcGfAt6TUKXCm_AHaLH&pid=Api&P=0&w=300&h=300"
					},
					{
						"id": 12,
						"mode": "website",
						"name_original": "",
						"name": "X Vids",
						"sub_name": "Free HD X (Ad)",
						"website_url": "https://play.google.com/store/apps/details?id=com.x.iptv.hot.playlist",
						"is_system_browser": true,
						"thumbnail_url": "https://play-lh.googleusercontent.com/LeS87rlHYowQ_9Zk-TQIBFsEKGYRrepfkhRF74ELqACUcohUAJUKb-LcNol-H5cNs1k=w240-h480-rw",
						"thumbnail_url_original": ""
					},
					{
						"id": 13,
						"mode": "video",
						"name_original": "Movie 13",
						"name": "LA CASA2",
						"sub_name": "",
						"stream_video_url": "http://199.188.103.26/rombwgshgfhgdsjr/85455532potroxvix/Series/La%20casa%20de%20papel/temp5/2.mp4",
						"thumbnail_url": "https://tse4.mm.bing.net/th?id=OIP.u9InFRoqHpCS9M0B0E2qLAHaLH&pid=Api&P=0&w=300&h=300",
						"thumbnail_url_original": "https://tse4.mm.bing.net/th?id=OIP.u9InFRoqHpCS9M0B0E2qLAHaLH&pid=Api&P=0&w=300&h=300"
					},
					{
						"id": 14,
						"mode": "video",
						"name_original": "Movie 14",
						"name": "LA CASA3",
						"sub_name": "",
						"stream_video_url": "http://199.188.103.26/rombwgshgfhgdsjr/85455532potroxvix/Series/La%20casa%20de%20papel/temp5/3.mp4",
						"thumbnail_url": "https://tse4.mm.bing.net/th?id=OIP.WHuE-RX86yYKZ7JE-J_dWQAAAA&pid=Api&P=0&w=300&h=300",
						"thumbnail_url_original": "https://tse4.mm.bing.net/th?id=OIP.WHuE-RX86yYKZ7JE-J_dWQAAAA&pid=Api&P=0&w=300&h=300"
					},
					{
						"id": 15,
						"mode": "website",
						"name_original": "",
						"name": "Russia TV Channels",
						"sub_name": "Free Live TV Channels (Ad)",
						"website_url": "https://play.google.com/store/apps/details?id=com.bitlinks.russia.iptv.m3ulist",
						"is_system_browser": true,
						"thumbnail_url": "https://play-lh.googleusercontent.com/RqKQ6F66BwQskDZMfaUFulbteZWuNQuM7ivSEDM30IIuxujnigTn7GEz1a-WP9mMVR5a=w240-h480-rw",
						"thumbnail_url_original": ""
					},
					{
						"id": 16,
						"mode": "video",
						"name_original": "Movie 16",
						"name": "LA CASA5",
						"sub_name": "",
						"stream_video_url": "http://199.188.103.26/rombwgshgfhgdsjr/85455532potroxvix/Series/La%20casa%20de%20papel/temp5/5.mp4",
						"thumbnail_url": "https://tse2.mm.bing.net/th?id=OIP.7Uc6g9vVjdLV7O9geG_WvQHaKM&pid=Api&P=0&w=300&h=300",
						"thumbnail_url_original": "https://tse2.mm.bing.net/th?id=OIP.7Uc6g9vVjdLV7O9geG_WvQHaKM&pid=Api&P=0&w=300&h=300"
					},
					{
						"id": 17,
						"mode": "video",
						"name_original": "Movie 17",
						"name": "SEX4",
						"sub_name": "",
						"stream_video_url": "http://199.188.103.26/rombwgshgfhgdsjr/Series/Sex%20Education/Temporada%203/4.mp4",
						"thumbnail_url": "https://tse1.explicit.bing.net/th?id=OIP.QdeN5zEzgONtio7ZX919fQHaJ6&pid=Api&P=0&w=300&h=300",
						"thumbnail_url_original": "https://tse1.explicit.bing.net/th?id=OIP.QdeN5zEzgONtio7ZX919fQHaJ6&pid=Api&P=0&w=300&h=300"
					},
					{
						"id": 18,
						"mode": "website",
						"name_original": "",
						"name": "USA Live TV",
						"sub_name": "USA Live TV Channels( Ad)",
						"website_url": "https://play.google.com/store/apps/details?id=com.tvgram.usalivetv",
						"is_system_browser": true,
						"thumbnail_url": "https://play-lh.googleusercontent.com/6VtBPY8-Yq-DmTW_rEfKbxVC_6EY-bZx7QXTetHmqMM2tNvL7TXITbfjkGPMXIGaNbI=w240-h480-rw",
						"thumbnail_url_original": ""
					},
					{
						"id": 19,
						"mode": "video",
						"name_original": "Movie 19",
						"name": "SEX5",
						"sub_name": "",
						"stream_video_url": "http://199.188.103.26/rombwgshgfhgdsjr/Series/Sex%20Education/Temporada%203/5.mp4",
						"thumbnail_url": "https://tse3.mm.bing.net/th?id=OIP.z4Owja9hWV_pWaESUU09kwHaK9&pid=Api&P=0&w=300&h=300",
						"thumbnail_url_original": "https://tse3.mm.bing.net/th?id=OIP.z4Owja9hWV_pWaESUU09kwHaK9&pid=Api&P=0&w=300&h=300"
					},
					{
						"id": 20,
						"mode": "video",
						"name_original": "Movie 20",
						"name": "SEX6",
						"sub_name": "",
						"stream_video_url": "http://199.188.103.26/rombwgshgfhgdsjr/Series/Sex%20Education/Temporada%203/6.mp4",
						"thumbnail_url": "https://tse3.explicit.bing.net/th?id=OIP.2Dxd_xd9tx3rURIm80Bt7gAAAA&pid=Api&P=0&w=300&h=300",
						"thumbnail_url_original": "https://tse3.explicit.bing.net/th?id=OIP.2Dxd_xd9tx3rURIm80Bt7gAAAA&pid=Api&P=0&w=300&h=300"
					},
					{
						"id": 21,
						"mode": "website",
						"name_original": "",
						"name": "Live Cricket",
						"sub_name": "Cricket Score 2023 (Ad)",
						"website_url": "https://play.google.com/store/apps/details?id=com.bitmedia.ipl2k22",
						"is_system_browser": true,
						"thumbnail_url": "https://play-lh.googleusercontent.com/yAiVkEdk1YbKEvZf6SLujni0dQgA9U2_B86aqt0_k-b2_ASEWjnqdeL-UyNq-GWx1Jc=w240-h480-rw",
						"thumbnail_url_original": ""
					},
					{
						"id": 22,
						"mode": "video",
						"name_original": "Movie 22",
						"name": "SEX8",
						"sub_name": "",
						"stream_video_url": "http://199.188.103.26/rombwgshgfhgdsjr/Series/Sex%20Education/Temporada%203/8.mp4",
						"thumbnail_url": "https://tse4.explicit.bing.net/th?id=OIP.eMfeprkg7AigLVP08gLAAwAAAA&pid=Api&P=0&w=300&h=300",
						"thumbnail_url_original": "https://tse4.explicit.bing.net/th?id=OIP.eMfeprkg7AigLVP08gLAAwAAAA&pid=Api&P=0&w=300&h=300"
					},
					{
						"id": 23,
						"mode": "video",
						"name_original": "Movie 23",
						"name": "COBRA1",
						"sub_name": "",
						"stream_video_url": "https://d1yei2z3i6k35z.cloudfront.net/2102480/631bbce158f16_5x1CKNumero4k_A.mp4",
						"thumbnail_url": "https://tse1.mm.bing.net/th?id=OIP.9z9JugwNO5Lq7vtVVf4MJQHaLH&pid=Api&P=0&w=300&h=300",
						"thumbnail_url_original": "https://tse1.mm.bing.net/th?id=OIP.9z9JugwNO5Lq7vtVVf4MJQHaLH&pid=Api&P=0&w=300&h=300"
					},
					{
						"id": 24,
						"mode": "website",
						"name_original": "",
						"name": "Love Tester",
						"sub_name": "Real Love Tester (Ad)",
						"website_url": "https://play.google.com/store/apps/details?id=com.real.love.tester",
						"is_system_browser": true,
						"thumbnail_url": "https://play-lh.googleusercontent.com/BT81t7C4KUg0ushx9ueKsQ1RkLpOgzYcqcraMSvoRW5yPSmmyj6N9tngZIcNfIAcm08=w240-h480-rw",
						"thumbnail_url_original": ""
					},
					{
						"id": 25,
						"mode": "video",
						"name_original": "Movie 25",
						"name": "COBRA2",
						"sub_name": "",
						"stream_video_url": "https://d1yei2z3i6k35z.cloudfront.net/2102480/631bbdec2d6ef_5x2CKNumero4k_A.mp4",
						"thumbnail_url": "https://tse2.mm.bing.net/th?id=OIP.Z6k-dPE87N8D1bnfIc3wwAHaJ1&pid=Api&P=0&w=300&h=300",
						"thumbnail_url_original": "https://tse2.mm.bing.net/th?id=OIP.Z6k-dPE87N8D1bnfIc3wwAHaJ1&pid=Api&P=0&w=300&h=300"
					},
					{
						"id": 26,
						"mode": "video",
						"name_original": "Movie 26",
						"name": "COBRA3",
						"sub_name": "",
						"stream_video_url": "https://d1yei2z3i6k35z.cloudfront.net/2102480/631bbe651645d_5x3CKNumero4k_A.mp4",
						"thumbnail_url": "https://tse1.mm.bing.net/th?id=OIP.e4SDuX80v3TCs2kxug8q5QHaLC&pid=Api&P=0&w=300&h=300",
						"thumbnail_url_original": "https://tse1.mm.bing.net/th?id=OIP.e4SDuX80v3TCs2kxug8q5QHaLC&pid=Api&P=0&w=300&h=300"
					},
					{
						"id": 27,
						"mode": "website",
						"name_original": "",
						"name": "India TV Channels",
						"sub_name": "Indian Live TV Channels (Ad)",
						"website_url": "https://play.google.com/store/apps/details?id=com.bitlinks.india.iptv.m3ulist",
						"is_system_browser": true,
						"thumbnail_url": "https://play-lh.googleusercontent.com/l3rJ2qzJtRFzqUzr55ano_WEhcDx5YznwIpd7uRVxooEbOW5444QY8HeeZbiZhd4Ayc=w240-h480-rw",
						"thumbnail_url_original": ""
					},
					{
						"id": 28,
						"mode": "video",
						"name_original": "Movie 28",
						"name": "COBRA4",
						"sub_name": "",
						"stream_video_url": "https://d1yei2z3i6k35z.cloudfront.net/2102480/631bbf79cce15_5x4CKNumero4k_A.mp4",
						"thumbnail_url": "https://tse3.mm.bing.net/th?id=OIP.il5xUYvciC0qNo88U6lX_wHaLC&pid=Api&P=0&w=300&h=300",
						"thumbnail_url_original": "https://tse3.mm.bing.net/th?id=OIP.il5xUYvciC0qNo88U6lX_wHaLC&pid=Api&P=0&w=300&h=300"
					},
					{
						"id": 29,
						"mode": "video",
						"name_original": "Movie 29",
						"name": "COBRA5",
						"sub_name": "",
						"stream_video_url": "https://d1yei2z3i6k35z.cloudfront.net/2102480/631bce17a9370_5x5CKNumero4k_A.mp4",
						"thumbnail_url": "https://tse1.mm.bing.net/th?id=OIP.zbhxc2CXexuThukxr5xaEAHaKj&pid=Api&P=0&w=300&h=300",
						"thumbnail_url_original": "https://tse1.mm.bing.net/th?id=OIP.zbhxc2CXexuThukxr5xaEAHaKj&pid=Api&P=0&w=300&h=300"
					},
					{
						"id": 30,
						"mode": "website",
						"name_original": "",
						"name": "Russian VideoChats",
						"sub_name": "Free Random Video calls (Ad)",
						"website_url": "https://play.google.com/store/apps/details?id=com.minichat.prekrasnyy.videochat",
						"is_system_browser": true,
						"thumbnail_url": "https://sg-res.9appsdownloading.com/sg/res/jpg/6c/37/9aab0a03f983556c3b664efef390-1q19.jpg",
						"thumbnail_url_original": ""
					},
					{
						"id": 31,
						"mode": "video",
						"name_original": "Movie 31",
						"name": "COBRA6",
						"sub_name": "",
						"stream_video_url": "https://d1yei2z3i6k35z.cloudfront.net/2102480/631bd49618d43_5x6CKNumero4k_A.mp4",
						"thumbnail_url": "https://tse1.mm.bing.net/th?id=OIP.zbhxc2CXexuThukxr5xaEAHaKj&pid=Api&P=0&w=300&h=300",
						"thumbnail_url_original": "https://tse1.mm.bing.net/th?id=OIP.zbhxc2CXexuThukxr5xaEAHaKj&pid=Api&P=0&w=300&h=300"
					},
					{
						"id": 656,
						"mode": "video",
						"name_original": "Movie 656",
						"name": "Volver al Futuro 3 (1990)",
						"sub_name": "",
						"stream_video_url": "http://discontrol@ia601500.us.archive.org/0/items/84CK.70-3/84CK.70.FU7U93.3-ES-720.mp4",
						"thumbnail_url": "https://tse2.mm.bing.net/th?id=OIP.VP5ezFzZBZpP8R-rnwzOywHaLQ&pid=Api&P=0&w=300&h=300",
						"thumbnail_url_original": "https://tse2.mm.bing.net/th?id=OIP.VP5ezFzZBZpP8R-rnwzOywHaLQ&pid=Api&P=0&w=300&h=300"
					}
				]
			}
		}
	}
}
