{
    "app_update_list" :  [
			{
				"title": "Kishan===11",
				"sub_title": "kishan---11",
				"website_url": "https://play.google.com/store/apps/details?id=com.adult.iptv.hot.playlist",
				"app_icon": "https://play-lh.googleusercontent.com/puoKL06VOKbYoXPB-O2JfueIgMDuy2vGWdSZ7f7XsGG9idZQ7Sr42E54Uv-M5a5fqXo=w240-h480-rw"
			},
			{
				"title": "Kishan===22",
				"sub_title": "kishan---22",
				"website_url": "https://play.google.com/store/apps/details?id=com.dream11.fantasy.cricket.football.kabaddi",
				"app_icon": "https://encrypted-tbn0.gstatic.com/images?q=tbn:ANd9GcTY6bF93GdZ4ln0el4a1BipEWLKNCQvL_4OmofE8he2&s"
			},
			{
				"title": "Kishan===33",
				"sub_title": "kishan---33",
				"website_url": "https://play.google.com/store/apps/details?id=com.bravestars.snow.race",
				"app_icon": "https://burst.shopifycdn.com/photos/fog-on-dark-waters-edge.jpg?width=1200&format=pjpg&exif=1&iptc=1"
			},
			{
				"title": "Kishan===44fdhgjkhasfdgsdfjhghdfhgvdfgjhdhfjhghjdhfgjhdasdjhgfjhsdfjhgvbfjkhsd",
				"sub_title": "kishan---44jhsdfhasjhgfsdweiouhriueyrtijkdnsgvbdmnmxzn,mvdmbsvsd",
				"website_url": "https://play.google.com/store/apps/details?id=com.king.candycrushsaga",
				"app_icon": "https://www.shutterstock.com/image-illustration/3d-nature-waterfall-wallpaper-260nw-1369776521.jpg"
			},
			{
				"title": "Kishan===55",
				"sub_title": "kishan---55",
				"website_url": "https://play.google.com/store/apps/details?id=com.imangi.templerun",
				"app_icon": "https://cdn.pixabay.com/photo/2018/01/12/10/19/fantasy-3077928__480.jpg"
			}	
		]

}
