{
  "TV_Data": {
    "Channel_List": {
      "is_channel_list": true,
      "is_override": true,
      "thumb_width": 150,
      "all_Channels_Tab_Name": "",
      "main": {
        "id": 1,
        "name": "Indian Channels",
        "sub_name": "Channels",
        "thumbnail_url": "https://www.iptv-updated.com/wp-content/uploads/2019/12/iconfinder_flag-india_748132.png",
        "sub": {
          "sub_1": {
            "id": 1,
            "mode": "video",
            "name_original": "9XM",
            "name": "Channel 1",
            "sub_name": "",
            "stream_video_url": "https://d2q8p4pe5spbak.cloudfront.net/bpk-tv/9XM/9XM.isml/index.m3u8",
            "thumbnail_url": "https://raw.githubusercontent.com/tvgram-inc/TVGram/master/TVGram/ChannelsLogo/India.png",
            "thumbnail_url_original": "https://i.imgur.com/fD7wLka.jpg"
          },
          "sub_2": {
            "id": 2,
            "mode": "video",
            "name_original": "3 Tamil TV",
            "name": "Channel 2",
            "sub_name": "",
            "stream_video_url": "https://6n3yogbnd9ok-hls-live.5centscdn.com/threetamil/d0dbe915091d400bd8ee7f27f0791303.sdp/index.m3u8",
            "thumbnail_url": "https://raw.githubusercontent.com/tvgram-inc/TVGram/master/TVGram/ChannelsLogo/India.png",
            "thumbnail_url_original": "https://i.imgur.com/WfAU7pB.png"
          },
          "sub_3": {
            "id": 3,
            "mode": "website",
            "name_original": "",
            "name": "VidChat : Live",
            "sub_name": "Random Video Chat (Ad)",
            "website_url": "https://play.google.com/store/apps/details?id=com.booya.videochat",
            "is_system_browser": true,
            "thumbnail_url": "https://play-lh.googleusercontent.com/OwvRNTvvyUo8g9MQUdJJBGT_cL4S7ObS_xCyzwHYTS-rLrapbZzD1cQYowyHy-uVgw=w240-h480-rw",

            "thumbnail_url_original": ""
          },
          "sub_4": {
            "id": 4,
            "mode": "video",
            "name_original": "ABP Ananda",
            "name": "Channel 4",
            "sub_name": "",
            "stream_video_url": "https://abp-i.akamaihd.net/hls/live/765530/abpananda/masterhls_1564.m3u8",
            "thumbnail_url": "https://raw.githubusercontent.com/tvgram-inc/TVGram/master/TVGram/ChannelsLogo/India.png",
            "thumbnail_url_original": "https://www.iptv-updated.com/wp-content/themes/shootingstar-child/uploaded_images/default_img.png"
          },
          "sub_5": {
            "id": 5,
            "mode": "video",
            "name_original": "ABP Ananda",
            "name": "Channel 5",
            "sub_name": "",
            "stream_video_url": "https://abp-i.akamaihd.net/hls/live/765530/abpananda/master.m3u8",
            "thumbnail_url": "https://raw.githubusercontent.com/tvgram-inc/TVGram/master/TVGram/ChannelsLogo/India.png",
            "thumbnail_url_original": "https://www.iptv-updated.com/wp-content/themes/shootingstar-child/uploaded_images/default_img.png"
          },
          "sub_6": {
            "id": 6,
            "mode": "website",
            "name_original": "",
            "name": "World IPTV",
            "sub_name": "IPTV m3u Playlists(Ad)",
            "website_url": "https://play.google.com/store/apps/details?id=com.iptv.m3u.playlists",
            "is_system_browser": true,
            "thumbnail_url": "https://play-lh.googleusercontent.com/8mPNKodK65zCjQHS8aqF4o0cX9YlKZYN-3qYCd9oMlcTkGaAf_3AxB0vnE9Kud6bPw=w240-h480-rw",

            "thumbnail_url_original": ""
          },
          "sub_7": {
            "id": 7,
            "mode": "video",
            "name_original": "ABP Asmita",
            "name": "Channel 7",
            "sub_name": "",
            "stream_video_url": "https://abp-i.akamaihd.net/hls/live/765532/abpasmita/masterhls_1564.m3u8",
            "thumbnail_url": "https://raw.githubusercontent.com/tvgram-inc/TVGram/master/TVGram/ChannelsLogo/India.png",
            "thumbnail_url_original": "https://www.iptv-updated.com/wp-content/themes/shootingstar-child/uploaded_images/abp_asmita_img_2297.png"
          },
          "sub_8": {
            "id": 8,
            "mode": "video",
            "name_original": "ABP Asmita",
            "name": "Channel 8",
            "sub_name": "",
            "stream_video_url": "https://abp-i.akamaihd.net/hls/live/765532/abpasmita/master.m3u8",
            "thumbnail_url": "https://raw.githubusercontent.com/tvgram-inc/TVGram/master/TVGram/ChannelsLogo/India.png",
            "thumbnail_url_original": "https://www.iptv-updated.com/wp-content/themes/shootingstar-child/uploaded_images/abp_asmita_img_2297.png"
          },
          "sub_9": {
            "id": 9,
            "mode": "website",
            "name_original": "",
           "name": "India Live Tv",
            "sub_name": "Live Tv channels (Ad)",
            "website_url": "https://play.google.com/store/apps/details?id=com.tvgram.indialivetv",
            "is_system_browser": true,
            "thumbnail_url": "https://play-lh.googleusercontent.com/vgl19gTHQxeqFw_2kQJIhLfQTuV4V60xQ7rOvym-DUsiGlPgfBXZ0Uf-bIkc2zP7ng=w240-h480-rw",
            "thumbnail_url_original": ""
          },
          "sub_10": {
            "id": 10,
            "mode": "video",
            "name_original": "ABP Hindi",
            "name": "Channel 10",
            "sub_name": "",
            "stream_video_url": "http://hindiabp-lh.akamaihd.net/i/hindiabp1new_1@192103/master.m3u8",
            "thumbnail_url": "https://raw.githubusercontent.com/tvgram-inc/TVGram/master/TVGram/ChannelsLogo/India.png",
            "thumbnail_url_original": "https://static.abplive.in/wp-content/themes/abp-hindi/images/logo/hindiLogoD.png"
          },
          "sub_11": {
            "id": 11,
            "mode": "video",
            "name_original": "ABP Majha",
            "name": "Channel 11",
            "sub_name": "",
            "stream_video_url": "https://abp-i.akamaihd.net/hls/live/765531/abpmajha/masterhls_1564.m3u8",
            "thumbnail_url": "https://raw.githubusercontent.com/tvgram-inc/TVGram/master/TVGram/ChannelsLogo/India.png",
            "thumbnail_url_original": "https://www.iptv-updated.com/wp-content/themes/shootingstar-child/uploaded_images/abp_majha_img_2298.png"
          },
          "sub_12": {
            "id": 12,
            "mode": "website",
            "name_original": "",
            "name": "YoYo Video Calls",
            "sub_name": "Live Random Video Chat (Ad)",
            "website_url": "https://play.google.com/store/apps/details?id=com.yoyolive.llc",
            "is_system_browser": true,
            "thumbnail_url": "https://play-lh.googleusercontent.com/33_mPNzvE6WRV6czGRm8EhSrSh0G9wnRQRfMXfcqQLU8j3z4UYu7nrgw5SmaP9UFf0U=s64-rw",
            "thumbnail_url_original": ""
          },
          "sub_13": {
            "id": 13,
            "mode": "video",
            "name_original": "Fashion TV",
            "name": "Channel 13",
            "sub_name": "",
            "stream_video_url": "http://fash1043.cloudycdn.services/slive/_definst_/ftv_pg16_adaptive.smil/playlist.m3u8",
            "thumbnail_url": "https://raw.githubusercontent.com/tvgram-inc/TVGram/master/TVGram/ChannelsLogo/India.png",
            "thumbnail_url_original": "https://i.imgur.com/auHH1Ig.png"
          },
          "sub_14": {
            "id": 14,
            "mode": "video",
            "name_original": "Fashion TV",
            "name": "Channel 14",
            "sub_name": "",
            "stream_video_url": "https://fash1043.cloudycdn.services/slive/_definst_/ftv_pg16_adaptive.smil/playlist.m3u8",
            "thumbnail_url": "https://raw.githubusercontent.com/tvgram-inc/TVGram/master/TVGram/ChannelsLogo/India.png",
            "thumbnail_url_original": "https://i.imgur.com/auHH1Ig.png"
          },
          "sub_15": {
            "id": 15,
            "mode": "website",
            "name_original": "",
            "name": "USA Live TV",
            "sub_name": "USA Tv channels (Ad)",
            "website_url": "https://play.google.com/store/apps/details?id=com.tvgram.usalivetv",
            "is_system_browser": true,
            "thumbnail_url": "https://play-lh.googleusercontent.com/6VtBPY8-Yq-DmTW_rEfKbxVC_6EY-bZx7QXTetHmqMM2tNvL7TXITbfjkGPMXIGaNbI=w240-h480-rw",
            "thumbnail_url_original": ""
          },
          "sub_16": {
            "id": 16,
            "mode": "video",
            "name_original": "Fashion TV",
            "name": "Channel 16",
            "sub_name": "",
            "stream_video_url": "https://fashiontv-fashiontv-1-eu.rakuten.wurl.com/manifest/playlist.m3u8",
            "thumbnail_url": "https://raw.githubusercontent.com/tvgram-inc/TVGram/master/TVGram/ChannelsLogo/India.png",
            "thumbnail_url_original": "https://i.imgur.com/auHH1Ig.png"
          },
          "sub_17": {
            "id": 17,
            "mode": "video",
            "name_original": "Fashion TV",
            "name": "Channel 17",
            "sub_name": "",
            "stream_video_url": "https://fashiontv-fashiontv-4-de.samsung.wurl.com/manifest/playlist.m3u8",
            "thumbnail_url": "https://raw.githubusercontent.com/tvgram-inc/TVGram/master/TVGram/ChannelsLogo/India.png",
            "thumbnail_url_original": "https://i.imgur.com/auHH1Ig.png"
          },
          "sub_18": {
            "id": 18,
            "mode": "website",
            "name_original": "",
          "name": "India IPTV List",
            "sub_name": "Indian m3u Playlist (Ad)",
            "website_url": "https://play.google.com/store/apps/details?id=com.bitlinks.india.iptv.m3ulist",
            "is_system_browser": true,
            "thumbnail_url": "https://play-lh.googleusercontent.com/l3rJ2qzJtRFzqUzr55ano_WEhcDx5YznwIpd7uRVxooEbOW5444QY8HeeZbiZhd4Ayc=w240-h480-rw",

            "thumbnail_url_original": ""
          },
          "sub_19": {
            "id": 19,
            "mode": "video",
            "name_original": "Fashion TV",
            "name": "Channel 19",
            "sub_name": "",
            "stream_video_url": "https://fashiontv-fashiontv-3-it.samsung.wurl.com/manifest/playlist.m3u8",
            "thumbnail_url": "https://raw.githubusercontent.com/tvgram-inc/TVGram/master/TVGram/ChannelsLogo/India.png",
            "thumbnail_url_original": "https://i.imgur.com/auHH1Ig.png"
          },
          "sub_20": {
            "id": 20,
            "mode": "video",
            "name_original": "Fashion TV",
            "name": "Channel 20",
            "sub_name": "",
            "stream_video_url": "https://fashiontv-fashiontv-2-es.samsung.wurl.com/manifest/playlist.m3u8",
            "thumbnail_url": "https://raw.githubusercontent.com/tvgram-inc/TVGram/master/TVGram/ChannelsLogo/India.png",
            "thumbnail_url_original": "https://i.imgur.com/auHH1Ig.png"
          },
          "sub_21": {
            "id": 21,
            "mode": "website",
            "name_original": "",
           "name": "Cash Counter",
            "sub_name": "Cash Calculator",
            "website_url": "https://play.google.com/store/apps/details?id=com.money_count_save",
            "is_system_browser": true,
            "thumbnail_url": "https://play-lh.googleusercontent.com/kB7MXSAbO8vKrfbnM8QrzIcNbNm2tWH8rImp5xsIZY1lwKqK3FkNkEFRQpyskJliEbQ=w240-h480-rw",
            "thumbnail_url_original": ""
          },
          "sub_22": {
            "id": 22,
            "mode": "video",
            "name_original": "APB",
            "name": "Channel 22",
            "sub_name": "",
            "stream_video_url": "https://hindiabp-lh.akamaihd.net/i/hindiabp1new_1@192103/master.m3u8",
            "thumbnail_url": "https://raw.githubusercontent.com/tvgram-inc/TVGram/master/TVGram/ChannelsLogo/India.png",
            "thumbnail_url_original": ""
          },
          "sub_23": {
            "id": 23,
            "mode": "video",
            "name_original": "Apna Punjab",
            "name": "Channel 23",
            "sub_name": "",
            "stream_video_url": "http://cdn5.live247stream.com/apnapunjab/tv/playlist.m3u8",
            "thumbnail_url": "https://raw.githubusercontent.com/tvgram-inc/TVGram/master/TVGram/ChannelsLogo/India.png",
            "thumbnail_url_original": ""
          },
          "sub_24": {
            "id": 24,
            "mode": "website",
            "name_original": "",
            "name": "German Live Tv",
            "sub_name": "Live Tv Channels (Ad)",
            "website_url": "https://play.google.com/store/apps/details?id=com.tvgram.germanlivetv",
            "is_system_browser": true,
            "thumbnail_url": "https://play-lh.googleusercontent.com/R56Rq08GnY1LDkWF-kK_ys4FkVokh5qXhBdnIwoO1xe4-b9VQlxlBhIEuygrLCzt5UU=w240-h480-rw",
            "thumbnail_url_original": ""
          },
          "sub_25": {
            "id": 25,
            "mode": "video",
            "name_original": "Ashrafi Channel [Not 24/7]",
            "name": "Channel 25",
            "sub_name": "",
            "stream_video_url": "http://ashrafichannel.livebox.co.in/ashrafivhannelhls/live.m3u8",
            "thumbnail_url": "https://raw.githubusercontent.com/tvgram-inc/TVGram/master/TVGram/ChannelsLogo/India.png",
            "thumbnail_url_original": ""
          },
          "sub_26": {
            "id": 26,
            "mode": "video",
            "name_original": "Asianet News",
            "name": "Channel 26",
            "sub_name": "",
            "stream_video_url": "http://103.199.161.254/Content/asianetnews/Live/Channel(Asianetnews)/index.m3u8",
            "thumbnail_url": "https://raw.githubusercontent.com/tvgram-inc/TVGram/master/TVGram/ChannelsLogo/India.png",
            "thumbnail_url_original": "https://www.iptv-updated.com/wp-content/themes/shootingstar-child/uploaded_images/asianet_news_img_2313.png"
          },
          "sub_27": {
            "id": 27,
            "mode": "website",
            "name_original": "",
           "name": "Dream 11",
            "sub_name": "Live Scricket Score (Ad)",
            "website_url": "https://play.google.com/store/apps/details?id=com.bitmedia.ipl2k22",
            "is_system_browser": true,
            "thumbnail_url": "https://play-lh.googleusercontent.com/yAiVkEdk1YbKEvZf6SLujni0dQgA9U2_B86aqt0_k-b2_ASEWjnqdeL-UyNq-GWx1Jc=w240-h480-rw",
            "thumbnail_url_original": ""
          },
          "sub_28": {
            "id": 28,
            "mode": "video",
            "name_original": "Asianet News",
            "name": "Channel 28",
            "sub_name": "",
            "stream_video_url": "https://vidcdn.vidgyor.com/asianet-origin/liveabr/playlist.m3u8",
            "thumbnail_url": "https://raw.githubusercontent.com/tvgram-inc/TVGram/master/TVGram/ChannelsLogo/India.png",
            "thumbnail_url_original": "https://www.iptv-updated.com/wp-content/themes/shootingstar-child/uploaded_images/asianet_news_img_2313.png"
          },
          "sub_29": {
            "id": 29,
            "mode": "video",
            "name_original": "Asianet News Bangla",
            "name": "Channel 29",
            "sub_name": "",
            "stream_video_url": "https://vidcdn.vidgyor.com/rplus-origin/rplusasianetlive/playlist.m3u8",
            "thumbnail_url": "https://raw.githubusercontent.com/tvgram-inc/TVGram/master/TVGram/ChannelsLogo/India.png",
            "thumbnail_url_original": "https://static.asianetnews.com/v1/images/bangla_logo.png"
          },
          "sub_30": {
            "id": 30,
            "mode": "website",
            "name_original": "",
           "name": "Video Player",
            "sub_name": "HD Video Player (Ad)",
            "website_url": "https://play.google.com/store/apps/details?id=com.line.hdplayer",
            "is_system_browser": true,
            "thumbnail_url": "https://play-lh.googleusercontent.com/IPqZNMTj7o1agUs1LkuQ0OJU4Ue_udMnOwxENKdKTaTEL_6GyH1YjS4lfq8hUGCVxGA=w240-h480-rw",
            "thumbnail_url_original": ""
          },
          "sub_31": {
            "id": 31,
            "mode": "video",
            "name_original": "Asianet News Tamil",
            "name": "Channel 31",
            "sub_name": "",
            "stream_video_url": "https://vidcdn.vidgyor.com/ptm-origin/aslive/playlist.m3u8",
            "thumbnail_url": "https://raw.githubusercontent.com/tvgram-inc/TVGram/master/TVGram/ChannelsLogo/India.png",
            "thumbnail_url_original": "https://static.asianetnews.com/v1/images/tamil_logo.png"
          },
          "sub_32": {
            "id": 32,
            "mode": "video",
            "name_original": "Assam Talks",
            "name": "Channel 32",
            "sub_name": "",
            "stream_video_url": "http://vidnetcdn.vidgyor.com/assamtalks-origin/liveabr/playlist.m3u8",
            "thumbnail_url": "https://raw.githubusercontent.com/tvgram-inc/TVGram/master/TVGram/ChannelsLogo/India.png",
            "thumbnail_url_original": "https://www.iptv-updated.com/wp-content/themes/shootingstar-child/uploaded_images/assam_talks_img_2316.png"
          },
          "sub_33": {
            "id": 33,
            "mode": "website",
            "name_original": "",
            "name": "Pocket IPTV",
            "sub_name": "IPTV Player (Ad)",
            "website_url": "https://play.google.com/store/apps/details?id=com.pocketiptv",
            "is_system_browser": true,
            "thumbnail_url": "https://play-lh.googleusercontent.com/DviEA28-3k_q7mb1mbF8ZMRdYNRmqEGYMzQ3SJnSdEo5hRkFmxgpr2uKb1z8wnsCpcU=w240-h480-rw",
            "thumbnail_url_original": ""
          },
          "sub_34": {
            "id": 34,
            "mode": "video",
            "name_original": "Ayush TV",
            "name": "Channel 34",
            "sub_name": "",
            "stream_video_url": "https://95eryw39dwn4-hls-live.wmncdn.net/Ayushu/271ddf829afeece44d8732757fba1a66.sdp/index.m3u8",
            "thumbnail_url": "https://raw.githubusercontent.com/tvgram-inc/TVGram/master/TVGram/ChannelsLogo/India.png",
            "thumbnail_url_original": "https://www.iptv-updated.com/wp-content/themes/shootingstar-child/uploaded_images/ayush_tv_img_2317.png"
          },
          "sub_35": {
            "id": 35,
            "mode": "video",
            "name_original": "BFLIX MOVIES",
            "name": "Channel 35",
            "sub_name": "",
            "stream_video_url": "https://m-c036-j2apps.s.llnwi.net/hls/5045.BFlixMovies.in.m3u8",
            "thumbnail_url": "https://raw.githubusercontent.com/tvgram-inc/TVGram/master/TVGram/ChannelsLogo/India.png",
            "thumbnail_url_original": ""
          },
          "sub_36": {
            "id": 36,
            "mode": "website",
            "name_original": "",
           "name": "ITALY Live Tv",
            "sub_name": "Live TvChannels (Ad)",
            "website_url": "https://play.google.com/store/apps/details?id=com.tvgram.italylivetv",
            "is_system_browser": true,
            "thumbnail_url": "https://play-lh.googleusercontent.com/Rp6doj1nrji6K3xmzN9gWq1EhQNhkGQSacggPhSA5zzhSZNEVr6-Qm9tsjF9n4-F5T0=w240-h480-rw",
            "thumbnail_url_original": ""
          },
          "sub_37": {
            "id": 37,
            "mode": "video",
            "name_original": "Channel Y",
            "name": "Channel 37",
            "sub_name": "",
            "stream_video_url": "http://cdn19.live247stream.com/channely/tv/playlist.m3u8",
            "thumbnail_url": "https://raw.githubusercontent.com/tvgram-inc/TVGram/master/TVGram/ChannelsLogo/India.png",
            "thumbnail_url_original": "https://www.iptv-updated.com/wp-content/themes/shootingstar-child/uploaded_images/channel_y_img_2326.png"
          },
          "sub_38": {
            "id": 38,
            "mode": "video",
            "name_original": "Cine Voice",
            "name": "Channel 38",
            "sub_name": "",
            "stream_video_url": "http://live.wmncdn.net/cinevoice/508a8ec9dfdb9c61df9823aac272b719.sdp/index.m3u8",
            "thumbnail_url": "https://raw.githubusercontent.com/tvgram-inc/TVGram/master/TVGram/ChannelsLogo/India.png",
            "thumbnail_url_original": "https://www.iptv-updated.com/wp-content/themes/shootingstar-child/uploaded_images/cine_voice_img_2327.png"
          },
          "sub_39": {
            "id": 39,
            "mode": "website",
            "name_original": "",
           "name": "TATA IPL",
            "sub_name": "IPL Cricket Score (Ad)",
            "website_url": "https://play.google.com/store/apps/details?id=com.liveiplscore",
            "is_system_browser": true,
            "thumbnail_url": "https://play-lh.googleusercontent.com/cQjAwnCNumqKujr05049ssTcSmFAD-dHmfDPBr2jQcnlyYLZmsvSEPYnnYN9YJw0qw=w240-h480-rw",
            "thumbnail_url_original": ""
          },
          "sub_40": {
            "id": 40,
            "mode": "video",
            "name_original": "Cine Voice",
            "name": "Channel 40",
            "sub_name": "",
            "stream_video_url": "https://live.wmncdn.net/cinevoice/508a8ec9dfdb9c61df9823aac272b719.sdp/index.m3u8",
            "thumbnail_url": "https://raw.githubusercontent.com/tvgram-inc/TVGram/master/TVGram/ChannelsLogo/India.png",
            "thumbnail_url_original": "https://www.iptv-updated.com/wp-content/themes/shootingstar-child/uploaded_images/cine_voice_img_2327.png"
          },
          "sub_41": {
            "id": 41,
            "mode": "video",
            "name_original": "Cine Voice",
            "name": "Channel 41",
            "sub_name": "",
            "stream_video_url": "https://live.wmncdn.net/cinevoice/508a8ec9dfdb9c61df9823aac272b719.sdp/mono.m3u8",
            "thumbnail_url": "https://raw.githubusercontent.com/tvgram-inc/TVGram/master/TVGram/ChannelsLogo/India.png",
            "thumbnail_url_original": "https://www.iptv-updated.com/wp-content/themes/shootingstar-child/uploaded_images/cine_voice_img_2327.png"
          },
          "sub_42": {
            "id": 42,
            "mode": "website",
            "name_original": "",
           "name": "Sound Prank",
            "sub_name": "Air Horn Sound Prank (Ad)",
            "website_url": "https://play.google.com/store/apps/details?id=com.airhorn.sounds.pranks",
            "is_system_browser": true,
            "thumbnail_url": "https://play-lh.googleusercontent.com/CPgsxnjr_o73B1-GW-mCeFQ47BOaY_sKFSO85JYurcs68DYz0tYQ0HqHRKIv22EDmKab=w240-h480-rw",
            "thumbnail_url_original": ""
          },
          "sub_43": {
            "id": 43,
            "mode": "video",
            "name_original": "CNBC Awaaz",
            "name": "Channel 43",
            "sub_name": "",
            "stream_video_url": "https://ch.iptvmate.net/0062d390de66fa0026f07fda64beeee2.m3u8",
            "thumbnail_url": "https://raw.githubusercontent.com/tvgram-inc/TVGram/master/TVGram/ChannelsLogo/India.png",
            "thumbnail_url_original": "https://www.iptv-updated.com/wp-content/themes/shootingstar-child/uploaded_images/cnbc_awaaz_img_2332.png"
          },
          "sub_44": {
            "id": 44,
            "mode": "video",
            "name_original": "CNBC TV18",
            "name": "Channel 44",
            "sub_name": "",
            "stream_video_url": "https://cnbctv18-lh.akamaihd.net/i/cnbctv18_1@174868/index_5_av-p.m3u8",
            "thumbnail_url": "https://raw.githubusercontent.com/tvgram-inc/TVGram/master/TVGram/ChannelsLogo/India.png",
            "thumbnail_url_original": "https://www.iptv-updated.com/wp-content/themes/shootingstar-child/uploaded_images/cnbc_tv18_img_2334.png"
          },
          "sub_45": {
            "id": 45,
            "mode": "website",
            "name_original": "",
           "name": "Brazil Live Tv",
            "sub_name": "Live Tv Channels (Ad)",
            "website_url": "https://play.google.com/store/apps/details?id=com.tvgram.brazillivetv",
            "is_system_browser": true,
            "thumbnail_url": "https://play-lh.googleusercontent.com/bDQlYcVEfFfB5uDSRYWYeLiXpb68C5xJ_bko-Fhdvmu7Ooet80_J6yCfntLE8uVMMQ=w240-h480-rw",
            "thumbnail_url_original": ""
          },
          "sub_46": {
            "id": 46,
            "mode": "video",
            "name_original": "CNBC TV18",
            "name": "Channel 46",
            "sub_name": "",
            "stream_video_url": "https://ch.iptvmate.net/ea6f7b1281c52c9b7b199e1fe73cbf5c.m3u8",
            "thumbnail_url": "https://raw.githubusercontent.com/tvgram-inc/TVGram/master/TVGram/ChannelsLogo/India.png",
            "thumbnail_url_original": "https://www.iptv-updated.com/wp-content/themes/shootingstar-child/uploaded_images/cnbc_tv18_img_2334.png"
          },
          "sub_47": {
            "id": 47,
            "mode": "video",
            "name_original": "Colors Bangla",
            "name": "Channel 47",
            "sub_name": "",
            "stream_video_url": "https://yuppcatchup.akamaized.net/preview/etvbengali/master.m3u8",
            "thumbnail_url": "https://raw.githubusercontent.com/tvgram-inc/TVGram/master/TVGram/ChannelsLogo/India.png",
            "thumbnail_url_original": ""
          },
          "sub_48": {
            "id": 48,
            "mode": "website",
            "name_original": "",
           "name": "Arabic IPTV",
            "sub_name": "m3u Playlist (Ad)",
            "website_url": "https://play.google.com/store/apps/details?id=com.bitlinks.arebic.iptv.m3ulist",
            "is_system_browser": true,
            "thumbnail_url": "https://play-lh.googleusercontent.com/sGSMoSuytTPbNuMjKFU0omN7y814nhnqYxEHDtwSPNkrAiqCLuH_asc06xb52U5tAoo=w240-h480-rw",
             "thumbnail_url_original": ""
          },
          "sub_49": {
            "id": 49,
            "mode": "video",
            "name_original": "Desi Channel",
            "name": "Channel 49",
            "sub_name": "",
            "stream_video_url": "http://live.wmncdn.net/desichannel/7e2dd0aed46b70a5c77f4affdb702e4b.sdp/mono.m3u8",
            "thumbnail_url": "https://raw.githubusercontent.com/tvgram-inc/TVGram/master/TVGram/ChannelsLogo/India.png",
            "thumbnail_url_original": "https://www.iptv-updated.com/wp-content/themes/shootingstar-child/uploaded_images/desi_channel_img_2339.png"
          },
          "sub_50": {
            "id": 50,
            "mode": "video",
            "name_original": "Desi Channel",
            "name": "Channel 50",
            "sub_name": "",
            "stream_video_url": "https://live.wmncdn.net/desichannel/7e2dd0aed46b70a5c77f4affdb702e4b.sdp/mono.m3u8",
            "thumbnail_url": "https://raw.githubusercontent.com/tvgram-inc/TVGram/master/TVGram/ChannelsLogo/India.png",
            "thumbnail_url_original": "https://www.iptv-updated.com/wp-content/themes/shootingstar-child/uploaded_images/desi_channel_img_2339.png"
          },
          "sub_51": {
            "id": 51,
            "mode": "website",
            "name_original": "",
           "name": "Spanish Live TV",
            "sub_name": "Live Tv Channels (Ad)",
            "website_url": "https://play.google.com/store/apps/details?id=com.tvgram.spanishlivetv",
            "is_system_browser": true,
            "thumbnail_url": "https://play-lh.googleusercontent.com/Z5TOSShWV4wJp-3ZX8nHV2wvjaltrAmsKsn2qNo0vgXDa-67qZlrQVtIdWzgBXYMcWQ=w240-h480-rw",
            "thumbnail_url_original": ""
          },
          "sub_52": {
            "id": 52,
            "mode": "video",
            "name_original": "Desi Plus",
            "name": "Channel 52",
            "sub_name": "",
            "stream_video_url": "http://cdn2.live247stream.com/desiplus/tv/playlist.m3u8",
            "thumbnail_url": "https://raw.githubusercontent.com/tvgram-inc/TVGram/master/TVGram/ChannelsLogo/India.png",
            "thumbnail_url_original": "https://www.iptv-updated.com/wp-content/themes/shootingstar-child/uploaded_images/desi_plus_img_2340.png"
          },
          "sub_53": {
            "id": 53,
            "mode": "video",
            "name_original": "Dil Se",
            "name": "Channel 53",
            "sub_name": "",
            "stream_video_url": "http://linear07hun-lh.akamaihd.net/i/dilse_1@673921/master.m3u8",
            "thumbnail_url": "https://raw.githubusercontent.com/tvgram-inc/TVGram/master/TVGram/ChannelsLogo/India.png",
            "thumbnail_url_original": "https://www.iptv-updated.com/wp-content/themes/shootingstar-child/uploaded_images/dil_se_img_2342.png"
          },
          "sub_54": {
            "id": 54,
            "mode": "website",
            "name_original": "",
            "name": "Whtsapp Status Saver",
            "sub_name": "Status Saver (Ad)",
            "website_url": "https://play.google.com/store/apps/details?id=com.appclub.whats.status.saver",
            "is_system_browser": true,
            "thumbnail_url": "https://play-lh.googleusercontent.com/K76-feE-GOTDz9SoEWVKtom1ngUVTIPEsQ_damw8lCyaoh77awQifmc4A5wXdSyx84M=w240-h480-rw",
            "thumbnail_url_original": ""
          },
          "sub_55": {
            "id": 55,
            "mode": "video",
            "name_original": "Dil Se",
            "name": "Channel 55",
            "sub_name": "",
            "stream_video_url": "https://live.hungama.com/linear/dil-se/playlist.m3u8",
            "thumbnail_url": "https://raw.githubusercontent.com/tvgram-inc/TVGram/master/TVGram/ChannelsLogo/India.png",
            "thumbnail_url_original": "https://www.iptv-updated.com/wp-content/themes/shootingstar-child/uploaded_images/dil_se_img_2342.png"
          },
          "sub_56": {
            "id": 56,
            "mode": "video",
            "name_original": "Disha TV",
            "name": "Channel 56",
            "sub_name": "",
            "stream_video_url": "http://xlbor3aadvaj-hls-live.wmncdn.net/disha/stream.stream/playlist.m3u8",
            "thumbnail_url": "https://raw.githubusercontent.com/tvgram-inc/TVGram/master/TVGram/ChannelsLogo/India.png",
            "thumbnail_url_original": ""
          },
          "sub_57": {
            "id": 57,
            "mode": "website",
            "name_original": "",
             "name": "France Live TV",
            "sub_name": "Live Tv Channels",
            "website_url": "https://play.google.com/store/apps/details?id=com.tvgram.francelivetv",
            "is_system_browser": true,
            "thumbnail_url": "https://play-lh.googleusercontent.com/WoPxNu1ZO7bHJvi32q-CNLVZyVXqqMBtTBqY8Dh71icnw6xJAG8ZYfwzli26KyjN5W9_=w240-h480-rw",
            "thumbnail_url_original": ""
          },
          "sub_58": {
            "id": 58,
            "mode": "video",
            "name_original": "ETV Uttarakhand",
            "name": "Channel 58",
            "sub_name": "",
            "stream_video_url": "https://etv-up.akamaized.net/i/etv_up_hls_1@175735/index_5_av-p.m3u8",
            "thumbnail_url": "https://raw.githubusercontent.com/tvgram-inc/TVGram/master/TVGram/ChannelsLogo/India.png",
            "thumbnail_url_original": ""
          },
          "sub_59": {
            "id": 59,
            "mode": "video",
            "name_original": "Filmeraa",
            "name": "Channel 59",
            "sub_name": "",
            "stream_video_url": "https://a.jsrdn.com/broadcast/7ef91d3d7a/+0000/c.m3u8",
            "thumbnail_url": "https://raw.githubusercontent.com/tvgram-inc/TVGram/master/TVGram/ChannelsLogo/India.png",
            "thumbnail_url_original": ""
          },
          "sub_60": {
            "id": 60,
            "mode": "website",
            "name_original": "",
              "name": "VidChat : Live",
            "sub_name": "Random Video Chat (Ad)",
            "website_url": "https://play.google.com/store/apps/details?id=com.booya.videochat",
            "is_system_browser": true,
            "thumbnail_url": "https://play-lh.googleusercontent.com/OwvRNTvvyUo8g9MQUdJJBGT_cL4S7ObS_xCyzwHYTS-rLrapbZzD1cQYowyHy-uVgw=w240-h480-rw",
            "thumbnail_url_original": ""
          },
          "sub_61": {
            "id": 61,
            "mode": "video",
            "name_original": "GDNS Ludhiana",
            "name": "Channel 61",
            "sub_name": "",
            "stream_video_url": "http://akalmultimedia.net:1935/gdnslive/gdns-live/chunklist.m3u8",
            "thumbnail_url": "https://raw.githubusercontent.com/tvgram-inc/TVGram/master/TVGram/ChannelsLogo/India.png",
            "thumbnail_url_original": ""
          },
          "sub_62": {
            "id": 62,
            "mode": "video",
            "name_original": "Global Punjab",
            "name": "Channel 62",
            "sub_name": "",
            "stream_video_url": "https://wowzaprod207-i.akamaihd.net/hls/live/827936/2eba5b83/playlist.m3u8",
            "thumbnail_url": "https://raw.githubusercontent.com/tvgram-inc/TVGram/master/TVGram/ChannelsLogo/India.png",
            "thumbnail_url_original": ""
          },
          "sub_63": {
            "id": 63,
            "mode": "website",
            "name_original": "",
            "name": "World IPTV",
            "sub_name": "IPTV m3u Playlists(Ad)",
            "website_url": "https://play.google.com/store/apps/details?id=com.iptv.m3u.playlists",
            "is_system_browser": true,
            "thumbnail_url": "https://play-lh.googleusercontent.com/8mPNKodK65zCjQHS8aqF4o0cX9YlKZYN-3qYCd9oMlcTkGaAf_3AxB0vnE9Kud6bPw=w240-h480-rw",
            "thumbnail_url_original": ""
          },
          "sub_64": {
            "id": 64,
            "mode": "video",
            "name_original": "India Today",
            "name": "Channel 64",
            "sub_name": "",
            "stream_video_url": "https://feeds.intoday.in/hltapps/api/master.m3u8",
            "thumbnail_url": "https://raw.githubusercontent.com/tvgram-inc/TVGram/master/TVGram/ChannelsLogo/India.png",
            "thumbnail_url_original": "https://www.iptv-updated.com/wp-content/themes/shootingstar-child/uploaded_images/india_today_img_2363.png"
          },
          "sub_65": {
            "id": 65,
            "mode": "video",
            "name_original": "India Today",
            "name": "Channel 65",
            "sub_name": "",
            "stream_video_url": "https://edge-1192-ch-gv.filmon.com/live/3482.high.stream/playlist.m3u8",
            "thumbnail_url": "https://raw.githubusercontent.com/tvgram-inc/TVGram/master/TVGram/ChannelsLogo/India.png",
            "thumbnail_url_original": "https://www.iptv-updated.com/wp-content/themes/shootingstar-child/uploaded_images/india_today_img_2363.png"
          },
          "sub_66": {
            "id": 66,
            "mode": "website",
            "name_original": "",
            "name": "India Live Tv",
            "sub_name": "Live Tv channels (Ad)",
            "website_url": "https://play.google.com/store/apps/details?id=com.tvgram.indialivetv",
            "is_system_browser": true,
            "thumbnail_url": "https://i.postimg.cc/Gm3YYCdq/India-Tv.png",

            "thumbnail_url_original": ""
          },
          "sub_67": {
            "id": 67,
            "mode": "video",
            "name_original": "Janam TV",
            "name": "Channel 67",
            "sub_name": "",
            "stream_video_url": "https://vidcdn.vidgyor.com/janamtv-origin/liveabr/janamtv-origin/live3/chunks.m3u8",
            "thumbnail_url": "https://raw.githubusercontent.com/tvgram-inc/TVGram/master/TVGram/ChannelsLogo/India.png",
            "thumbnail_url_original": "https://www.iptv-updated.com/wp-content/themes/shootingstar-child/uploaded_images/default_img.png"
          },
          "sub_68": {
            "id": 68,
            "mode": "video",
            "name_original": "Janam TV",
            "name": "Channel 68",
            "sub_name": "",
            "stream_video_url": "https://vidcdn.vidgyor.com/janamtv-origin/liveabr/janamtv-origin/live3/playlist.m3u8",
            "thumbnail_url": "https://raw.githubusercontent.com/tvgram-inc/TVGram/master/TVGram/ChannelsLogo/India.png",
            "thumbnail_url_original": "https://www.iptv-updated.com/wp-content/themes/shootingstar-child/uploaded_images/default_img.png"
          },
          "sub_69": {
            "id": 69,
            "mode": "website",
            "name_original": "",
            "name": "Play",
            "sub_name": "Win 15,000",
            "website_url": "https://333.game.qureka.com",
            "is_system_browser": true,
            "thumbnail_url": "https://raw.githubusercontent.com/kp-bitcoding/ad-manager/main/Interstitial/2.png",
            "thumbnail_url_original": ""
          },
          "sub_70": {
            "id": 70,
            "mode": "video",
            "name_original": "Janta TV",
            "name": "Channel 70",
            "sub_name": "",
            "stream_video_url": "http://live.wmncdn.net/jantatv/live.stream/index.m3u8",
            "thumbnail_url": "https://raw.githubusercontent.com/tvgram-inc/TVGram/master/TVGram/ChannelsLogo/India.png",
            "thumbnail_url_original": "https://www.iptv-updated.com/wp-content/themes/shootingstar-child/uploaded_images/janta_tv_img_2372.png"
          },
          "sub_71": {
            "id": 71,
            "mode": "video",
            "name_original": "Janta TV",
            "name": "Channel 71",
            "sub_name": "",
            "stream_video_url": "https://live.wmncdn.net/jantatv/live.stream/index.m3u8",
            "thumbnail_url": "https://raw.githubusercontent.com/tvgram-inc/TVGram/master/TVGram/ChannelsLogo/India.png",
            "thumbnail_url_original": "https://www.iptv-updated.com/wp-content/themes/shootingstar-child/uploaded_images/janta_tv_img_2372.png"
          },
          "sub_72": {
            "id": 72,
            "mode": "website",
            "name_original": "",
           "name": "YoYo Video Calls",
            "sub_name": "Live Random Video Chat (Ad)",
            "website_url": "https://play.google.com/store/apps/details?id=com.yoyolive.llc",
            "is_system_browser": true,
            "thumbnail_url": "https://i.postimg.cc/KvDBRzS1/YOYO.png",
            "thumbnail_url_original": ""
          },
          "sub_73": {
            "id": 73,
            "mode": "video",
            "name_original": "Kadak Hits",
            "name": "Channel 73",
            "sub_name": "",
            "stream_video_url": "http://linear01hun-lh.akamaihd.net/i/faaduhits_1@660838/master.m3u8",
            "thumbnail_url": "https://raw.githubusercontent.com/tvgram-inc/TVGram/master/TVGram/ChannelsLogo/India.png",
            "thumbnail_url_original": "https://www.iptv-updated.com/wp-content/themes/shootingstar-child/uploaded_images/kadak_hits_img_2376.png"
          },
          "sub_74": {
            "id": 74,
            "mode": "video",
            "name_original": "Kadak Hits",
            "name": "Channel 74",
            "sub_name": "",
            "stream_video_url": "https://linear01hun-lh.akamaihd.net/i/faaduhits_1@660838/master.m3u8",
            "thumbnail_url": "https://raw.githubusercontent.com/tvgram-inc/TVGram/master/TVGram/ChannelsLogo/India.png",
            "thumbnail_url_original": "https://www.iptv-updated.com/wp-content/themes/shootingstar-child/uploaded_images/kadak_hits_img_2376.png"
          },
          "sub_75": {
            "id": 75,
            "mode": "website",
            "name_original": "",
             "name": "USA Live TV",
            "sub_name": "USA Tv channels (Ad)",
            "website_url": "https://play.google.com/store/apps/details?id=com.tvgram.usalivetv",
            "is_system_browser": true,
            "thumbnail_url": "https://i.postimg.cc/gJh6dcHk/USA-Tv.png",

            "thumbnail_url_original": ""
          },
          "sub_76": {
            "id": 76,
            "mode": "video",
            "name_original": "Kairali Arabia",
            "name": "Channel 76",
            "sub_name": "",
            "stream_video_url": "https://idvd.multitvsolution.com/idvo/kairaliarabia_540p/index.m3u8",
            "thumbnail_url": "https://raw.githubusercontent.com/tvgram-inc/TVGram/master/TVGram/ChannelsLogo/India.png",
            "thumbnail_url_original": "https://i.imgur.com/dp6BvWJ.png"
          },
          "sub_77": {
            "id": 77,
            "mode": "video",
            "name_original": "Kalinga TV",
            "name": "Channel 77",
            "sub_name": "",
            "stream_video_url": "https://live.mycast.in/kalingatv/d0dbe915091d400bd8ee7f27f0791303.sdp/playlist.m3u8",
            "thumbnail_url": "https://raw.githubusercontent.com/tvgram-inc/TVGram/master/TVGram/ChannelsLogo/India.png",
            "thumbnail_url_original": ""
          },
          "sub_78": {
            "id": 78,
            "mode": "website",
            "name_original": "",
           "name": "India IPTV List",
            "sub_name": "Indian m3u Playlist (Ad)",
            "website_url": "https://play.google.com/store/apps/details?id=com.bitlinks.india.iptv.m3ulist",
            "is_system_browser": true,
            "thumbnail_url": "https://play-lh.googleusercontent.com/l3rJ2qzJtRFzqUzr55ano_WEhcDx5YznwIpd7uRVxooEbOW5444QY8HeeZbiZhd4Ayc=w240-h480-rw",

            "thumbnail_url_original": ""
          },
          "sub_79": {
            "id": 79,
            "mode": "video",
            "name_original": "Kanak News",
            "name": "Channel 79",
            "sub_name": "",
            "stream_video_url": "https://live.kanaknews.com:4443/live/stream/playlist.m3u8",
            "thumbnail_url": "https://raw.githubusercontent.com/tvgram-inc/TVGram/master/TVGram/ChannelsLogo/India.png",
            "thumbnail_url_original": "https://www.iptv-updated.com/wp-content/themes/shootingstar-child/uploaded_images/default_img.png"
          },
          "sub_80": {
            "id": 80,
            "mode": "video",
            "name_original": "KCL TV",
            "name": "Channel 80",
            "sub_name": "",
            "stream_video_url": "http://kcltv.livebox.co.in/kclhls/live.m3u8",
            "thumbnail_url": "https://raw.githubusercontent.com/tvgram-inc/TVGram/master/TVGram/ChannelsLogo/India.png",
            "thumbnail_url_original": "https://i.imgur.com/bkp9dIm.png"
          },
          "sub_81": {
            "id": 81,
            "mode": "website",
            "name_original": "",
            "name": "Cash Counter",
            "sub_name": "Cash Calculator",
            "website_url": "https://play.google.com/store/apps/details?id=com.money_count_save",
            "is_system_browser": true,
            "thumbnail_url": "https://play-lh.googleusercontent.com/kB7MXSAbO8vKrfbnM8QrzIcNbNm2tWH8rImp5xsIZY1lwKqK3FkNkEFRQpyskJliEbQ=w240-h480-rw",

            "thumbnail_url_original": ""
          },
          "sub_82": {
            "id": 82,
            "mode": "video",
            "name_original": "Khabrain Abhi Tak",
            "name": "Channel 82",
            "sub_name": "",
            "stream_video_url": "https://vidcdn.vidgyor.com/kat-origin/liveabr/playlist.m3u8",
            "thumbnail_url": "https://raw.githubusercontent.com/tvgram-inc/TVGram/master/TVGram/ChannelsLogo/India.png",
            "thumbnail_url_original": ""
          },
          "sub_83": {
            "id": 83,
            "mode": "video",
            "name_original": "KITE Victers",
            "name": "Channel 83",
            "sub_name": "",
            "stream_video_url": "https://932y4x26ljv8-hls-live.5centscdn.com/victers/tv.stream/playlist.m3u8",
            "thumbnail_url": "https://raw.githubusercontent.com/tvgram-inc/TVGram/master/TVGram/ChannelsLogo/India.png",
            "thumbnail_url_original": "https://i.imgur.com/RvZxSkx.png"
          },
          "sub_84": {
            "id": 84,
            "mode": "website",
            "name_original": "",
            "name": "German Live Tv",
            "sub_name": "Live Tv Channels (Ad)",
            "website_url": "https://play.google.com/store/apps/details?id=com.tvgram.germanlivetv",
            "is_system_browser": true,
            "thumbnail_url": "https://i.postimg.cc/tJHng0Bd/German-TV.png",

            "thumbnail_url_original": ""
          },
          "sub_85": {
            "id": 85,
            "mode": "video",
            "name_original": "Lok Sabha TV",
            "name": "Channel 85",
            "sub_name": "",
            "stream_video_url": "https://nicls1-lh.akamaihd.net/i/lst_1@26969/master.m3u8",
            "thumbnail_url": "https://raw.githubusercontent.com/tvgram-inc/TVGram/master/TVGram/ChannelsLogo/India.png",
            "thumbnail_url_original": "https://www.iptv-updated.com/wp-content/themes/shootingstar-child/uploaded_images/lok_sabha_tv_img_2387.png"
          },
          "sub_86": {
            "id": 86,
            "mode": "video",
            "name_original": "Lok Sabha TV",
            "name": "Channel 86",
            "sub_name": "",
            "stream_video_url": "https://nicls1-lh.akamaihd.net/i/lst_1@26969/index_1_av-p.m3u8?rebase=on&sd=10",
            "thumbnail_url": "https://raw.githubusercontent.com/tvgram-inc/TVGram/master/TVGram/ChannelsLogo/India.png",
            "thumbnail_url_original": "https://www.iptv-updated.com/wp-content/themes/shootingstar-child/uploaded_images/lok_sabha_tv_img_2387.png"
          },
          "sub_87": {
            "id": 87,
            "mode": "website",
            "name_original": "",
            "name": "Loveme video Chat",
            "sub_name": "Random Video Chat (Ad)",
            "website_url": "https://play.google.com/store/apps/details?id=com.minichat.loveme.randome.videochat",
            "is_system_browser": true,
            "thumbnail_url": "https://play-lh.googleusercontent.com/TtbIIApy4sV1iyFKNEgoyNso6yjHo63XJIVqTuLQ2mIX3mohug1irZ6XHCDTa0ySjA=w240-h480-rw",

            "thumbnail_url_original": ""
          },
          "sub_88": {
            "id": 88,
            "mode": "video",
            "name_original": "MANORANJAN MOVIES",
            "name": "Channel 88",
            "sub_name": "",
            "stream_video_url": "https://m-c036-j2apps.s.llnwi.net/hls/2172.ManoranjanMovies.in.m3u8",
            "thumbnail_url": "https://raw.githubusercontent.com/tvgram-inc/TVGram/master/TVGram/ChannelsLogo/India.png",
            "thumbnail_url_original": ""
          },
          "sub_89": {
            "id": 89,
            "mode": "video",
            "name_original": "Marutam TV",
            "name": "Channel 89",
            "sub_name": "",
            "stream_video_url": "https://mntv.livebox.co.in/mntvhls/mntv.m3u8",
            "thumbnail_url": "https://raw.githubusercontent.com/tvgram-inc/TVGram/master/TVGram/ChannelsLogo/India.png",
            "thumbnail_url_original": "https://i.imgur.com/u3ZwRHX.png"
          },
          "sub_90": {
            "id": 90,
            "mode": "website",
            "name_original": "",
            "name": "Dream 11",
            "sub_name": "Live Scricket Score (Ad)",
            "website_url": "https://play.google.com/store/apps/details?id=com.bitmedia.ipl2k22",
            "is_system_browser": true,
            "thumbnail_url": "https://play-lh.googleusercontent.com/yAiVkEdk1YbKEvZf6SLujni0dQgA9U2_B86aqt0_k-b2_ASEWjnqdeL-UyNq-GWx1Jc=w240-h480-rw",
            "thumbnail_url_original": ""
          },
          "sub_91": {
            "id": 91,
            "mode": "video",
            "name_original": "MH1 Music",
            "name": "Channel 91",
            "sub_name": "",
            "stream_video_url": "http://rtmp.smartstream.video:1935/mhonemusic/mhonemusic/playlist.m3u8",
            "thumbnail_url": "https://raw.githubusercontent.com/tvgram-inc/TVGram/master/TVGram/ChannelsLogo/India.png",
            "thumbnail_url_original": ""
          },
          "sub_92": {
            "id": 92,
            "mode": "video",
            "name_original": "MH1 Prime",
            "name": "Channel 92",
            "sub_name": "",
            "stream_video_url": "http://rtmp.smartstream.video:1935/mhonenews/mhonenews/playlist.m3u8",
            "thumbnail_url": "https://raw.githubusercontent.com/tvgram-inc/TVGram/master/TVGram/ChannelsLogo/India.png",
            "thumbnail_url_original": ""
          },
          "sub_93": {
            "id": 93,
            "mode": "website",
            "name_original": "",
           "name": "Joli Video Chat",
            "sub_name": "Random Video Chat (Ad)",
            "website_url": "https://play.google.com/store/apps/details?id=com.minichat.joli.random.videochat",
            "is_system_browser": true,
            "thumbnail_url": "https://play-lh.googleusercontent.com/ODeJvN0w3lTWCQQrzndPvge2xjMVfrVewgWfi0zHeLYFi5397N4_c4-GlYStW77skQ=w240-h480-rw",

            "thumbnail_url_original": ""
          },
          "sub_94": {
            "id": 94,
            "mode": "video",
            "name_original": "Mirror Now",
            "name": "Channel 94",
            "sub_name": "",
            "stream_video_url": "https://mbnowweb-lh.akamaihd.net/i/MRN_1@346545/master.m3u8",
            "thumbnail_url": "https://raw.githubusercontent.com/tvgram-inc/TVGram/master/TVGram/ChannelsLogo/India.png",
            "thumbnail_url_original": "https://www.iptv-updated.com/wp-content/themes/shootingstar-child/uploaded_images/mirror_now_img_2397.png"
          },
          "sub_95": {
            "id": 95,
            "mode": "video",
            "name_original": "Nazrana",
            "name": "Channel 95",
            "sub_name": "",
            "stream_video_url": "http://linear08hun-lh.akamaihd.net/i/nazrana_1@673935/master.m3u8",
            "thumbnail_url": "https://raw.githubusercontent.com/tvgram-inc/TVGram/master/TVGram/ChannelsLogo/India.png",
            "thumbnail_url_original": "https://www.iptv-updated.com/wp-content/themes/shootingstar-child/uploaded_images/nazrana_img_2406.png"
          },
          "sub_96": {
            "id": 96,
            "mode": "website",
            "name_original": "",
           "name": "Video Player",
            "sub_name": "HD Video Player (Ad)",
            "website_url": "https://play.google.com/store/apps/details?id=com.line.hdplayer",
            "is_system_browser": true,
            "thumbnail_url": "https://play-lh.googleusercontent.com/IPqZNMTj7o1agUs1LkuQ0OJU4Ue_udMnOwxENKdKTaTEL_6GyH1YjS4lfq8hUGCVxGA=w240-h480-rw",
            "thumbnail_url_original": ""
          },
          "sub_97": {
            "id": 97,
            "mode": "video",
            "name_original": "Nazrana",
            "name": "Channel 97",
            "sub_name": "",
            "stream_video_url": "https://live.hungama.com/linear/nazrana/playlist.m3u8",
            "thumbnail_url": "https://raw.githubusercontent.com/tvgram-inc/TVGram/master/TVGram/ChannelsLogo/India.png",
            "thumbnail_url_original": "https://www.iptv-updated.com/wp-content/themes/shootingstar-child/uploaded_images/nazrana_img_2406.png"
          },
          "sub_98": {
            "id": 98,
            "mode": "video",
            "name_original": "NDTV",
            "name": "Channel 98",
            "sub_name": "",
            "stream_video_url": "https://ndtvindiaelemarchana.akamaized.net//hls//live//2003679//ndtvindia//ndtvindiamaster.m3u8",
            "thumbnail_url": "https://raw.githubusercontent.com/tvgram-inc/TVGram/master/TVGram/ChannelsLogo/India.png",
            "thumbnail_url_original": ""
          },
          "sub_99": {
            "id": 99,
            "mode": "website",
            "name_original": "",
            "name": "Pocket IPTV",
            "sub_name": "IPTV Player (Ad)",
            "website_url": "https://play.google.com/store/apps/details?id=com.pocketiptv",
            "is_system_browser": true,
            "thumbnail_url": "https://play-lh.googleusercontent.com/DviEA28-3k_q7mb1mbF8ZMRdYNRmqEGYMzQ3SJnSdEo5hRkFmxgpr2uKb1z8wnsCpcU=w240-h480-rw",
            "thumbnail_url_original": ""
          },
          "sub_100": {
            "id": 100,
            "mode": "video",
            "name_original": "NDTV 24x7",
            "name": "Channel 100",
            "sub_name": "",
            "stream_video_url": "https://ndtv24x7elemarchana.akamaized.net/hls/live/2003678/ndtv24x7/master.m3u8",
            "thumbnail_url": "https://raw.githubusercontent.com/tvgram-inc/TVGram/master/TVGram/ChannelsLogo/India.png",
            "thumbnail_url_original": "https://www.iptv-updated.com/wp-content/themes/shootingstar-child/uploaded_images/default_img.png"
          },
          "sub_101": {
            "id": 101,
            "mode": "video",
            "name_original": "NDTV India",
            "name": "Channel 101",
            "sub_name": "",
            "stream_video_url": "https://ndtvindiaelemarchana.akamaized.net/hls/live/2003679/ndtvindia/ndtvindiamaster.m3u8",
            "thumbnail_url": "https://raw.githubusercontent.com/tvgram-inc/TVGram/master/TVGram/ChannelsLogo/India.png",
            "thumbnail_url_original": "https://i.imgur.com/80vwZaO.png"
          },
          "sub_102": {
            "id": 102,
            "mode": "website",
            "name_original": "",
            "name": "Sexy video calls",
            "sub_name": "Random Video Chat (Ad)",
            "website_url": "https://play.google.com/store/apps/details?id=com.minichat.lyubimiy.videochat",
            "is_system_browser": true,
            "thumbnail_url": "https://play-lh.googleusercontent.com/R93sG4-ovSRJaDNIVx6PaMkfZGATne9MN0S8Ihp7uSgKxaC2qmdXYpYP3GAslVtP5_5f=w240-h480-rw",
            "thumbnail_url_original": ""
          },
          "sub_103": {
            "id": 103,
            "mode": "video",
            "name_original": "NDTV Profit",
            "name": "Channel 103",
            "sub_name": "",
            "stream_video_url": "https://ndtvprofitelemarchana.akamaized.net/hls/live/2003680/ndtvprofit/ndtvprofitmaster.m3u8",
            "thumbnail_url": "https://raw.githubusercontent.com/tvgram-inc/TVGram/master/TVGram/ChannelsLogo/India.png",
            "thumbnail_url_original": "https://i.imgur.com/pQ7nl12.png"
          },
          "sub_104": {
            "id": 104,
            "mode": "video",
            "name_original": "NDTV Profit",
            "name": "Channel 104",
            "sub_name": "",
            "stream_video_url": "https://ndtvprofitelemarchana.akamaized.net/hls/live/2003680-b/ndtvprofit/master.m3u8",
            "thumbnail_url": "https://raw.githubusercontent.com/tvgram-inc/TVGram/master/TVGram/ChannelsLogo/India.png",
            "thumbnail_url_original": "https://i.imgur.com/pQ7nl12.png"
          },
          "sub_105": {
            "id": 105,
            "mode": "website",
            "name_original": "",
            "name": "ITALY Live Tv",
            "sub_name": "Live TvChannels (Ad)",
            "website_url": "https://play.google.com/store/apps/details?id=com.tvgram.italylivetv",
            "is_system_browser": true,
            "thumbnail_url": "https://i.postimg.cc/nrYjjdWy/Italy-Tv.png",
            "thumbnail_url_original": ""
          },
          "sub_106": {
            "id": 106,
            "mode": "video",
            "name_original": "Nee Cinema",
            "name": "Channel 106",
            "sub_name": "",
            "stream_video_url": "https://live.neestream.com/neestream_01/nee_cinema/tracks-v1a1/mono.m3u8",
            "thumbnail_url": "https://raw.githubusercontent.com/tvgram-inc/TVGram/master/TVGram/ChannelsLogo/India.png",
            "thumbnail_url_original": "https://i.imgur.com/vYme2fs.png"
          },
          "sub_107": {
            "id": 107,
            "mode": "video",
            "name_original": "Nethra TV",
            "name": "Channel 107",
            "sub_name": "",
            "stream_video_url": "http://dammikartmp.tulix.tv/slrc3/slrc3/playlist.m3u8",
            "thumbnail_url": "https://raw.githubusercontent.com/tvgram-inc/TVGram/master/TVGram/ChannelsLogo/India.png",
            "thumbnail_url_original": "https://www.iptv-updated.com/wp-content/themes/shootingstar-child/uploaded_images/nethra_tv_img_2408.png"
          },
          "sub_108": {
            "id": 108,
            "mode": "website",
            "name_original": "",
            "name": "Habibi Video Chat",
            "sub_name": "Random Video Chat (Ad)",
            "website_url": "https://play.google.com/store/apps/details?id=com.minichat.habibi.fidyu.haya",
            "is_system_browser": true,
            "thumbnail_url": "https://play-lh.googleusercontent.com/ktkX_Fbez2I8iHc1O0-OrrlJRBMiROugVlO0KsZb9h3MfOL6fviRhJ7UaDdbH6JU0EhU=w240-h480-rw",
            "thumbnail_url_original": ""
          },
          "sub_109": {
            "id": 109,
            "mode": "video",
            "name_original": "News 18 Chhattisgarh",
            "name": "Channel 109",
            "sub_name": "",
            "stream_video_url": "https://news18mp-lh.akamaihd.net/i/n18mpcg_1@175737/index_4_av-p.m3u8?rebase=on&sd=10",
            "thumbnail_url": "https://raw.githubusercontent.com/tvgram-inc/TVGram/master/TVGram/ChannelsLogo/India.png",
            "thumbnail_url_original": ""
          },
          "sub_110": {
            "id": 110,
            "mode": "video",
            "name_original": "News 18 Gujarati",
            "name": "Channel 110",
            "sub_name": "",
            "stream_video_url": "https://news18gujarati-lh.akamaihd.net/i/n18gujarat_1@370955/index_4_av-p.m3u8?rebase=on&sd=10",
            "thumbnail_url": "https://raw.githubusercontent.com/tvgram-inc/TVGram/master/TVGram/ChannelsLogo/India.png",
            "thumbnail_url_original": ""
          },
          "sub_111": {
            "id": 111,
            "mode": "website",
            "name_original": "",
            "name": "Sound Prank",
            "sub_name": "Air Horn Sound Prank (Ad)",
            "website_url": "https://i.postimg.cc/ZqBWFYgF/Horn-Prank.png",
            "is_system_browser": true,
            "thumbnail_url": "https://play-lh.googleusercontent.com/CPgsxnjr_o73B1-GW-mCeFQ47BOaY_sKFSO85JYurcs68DYz0tYQ0HqHRKIv22EDmKab=w240-h480-rw",
            "thumbnail_url_original": ""
          },
          "sub_112": {
            "id": 112,
            "mode": "video",
            "name_original": "News 18 Jharkhand",
            "name": "Channel 112",
            "sub_name": "",
            "stream_video_url": "https://news18bihar-lh.akamaihd.net/i/n18biharjh_1@175736/index_4_av-p.m3u8?rebase=on&sd=10",
            "thumbnail_url": "https://raw.githubusercontent.com/tvgram-inc/TVGram/master/TVGram/ChannelsLogo/India.png",
            "thumbnail_url_original": ""
          },
          "sub_113": {
            "id": 113,
            "mode": "video",
            "name_original": "News 18 Malayalam",
            "name": "Channel 113",
            "sub_name": "",
            "stream_video_url": "https://news18kerala-lh.akamaihd.net/i/n18kerala_1@526583/index_4_av-p.m3u8?rebase=on&sd=10",
            "thumbnail_url": "https://raw.githubusercontent.com/tvgram-inc/TVGram/master/TVGram/ChannelsLogo/India.png",
            "thumbnail_url_original": "https://i.imgur.com/D9lMLmX.png"
          },
          "sub_114": {
            "id": 114,
            "mode": "website",
            "name_original": "",
             "name": "Brazil Live Tv",
            "sub_name": "Live Tv Channels (Ad)",
            "website_url": "https://play.google.com/store/apps/details?id=com.tvgram.brazillivetv",
            "is_system_browser": true,
            "thumbnail_url": "https://i.postimg.cc/HkLcn99N/Brazil-Tv.png",
            "thumbnail_url_original": ""
          },
          "sub_115": {
            "id": 115,
            "mode": "video",
            "name_original": "News 18 Punjab",
            "name": "Channel 115",
            "sub_name": "",
            "stream_video_url": "https://news18haryana-lh.akamaihd.net/i/n18punjabhimhar_1@349009/index_4_av-p.m3u8?rebase=on&sd=10",
            "thumbnail_url": "https://raw.githubusercontent.com/tvgram-inc/TVGram/master/TVGram/ChannelsLogo/India.png",
            "thumbnail_url_original": ""
          },
          "sub_116": {
            "id": 116,
            "mode": "video",
            "name_original": "News 18 Rajasthan",
            "name": "Channel 116",
            "sub_name": "",
            "stream_video_url": "https://news18rajasthan-lh.akamaihd.net/i/n18raj_1@175738/index_4_av-p.m3u8?rebase=on&sd=10",
            "thumbnail_url": "https://raw.githubusercontent.com/tvgram-inc/TVGram/master/TVGram/ChannelsLogo/India.png",
            "thumbnail_url_original": ""
          },
          "sub_117": {
            "id": 117,
            "mode": "website",
            "name_original": "",
            "name": "Arabic IPTV",
            "sub_name": "m3u Playlist (Ad)",
            "website_url": "https://play.google.com/store/apps/details?id=com.bitlinks.arebic.iptv.m3ulist",
            "is_system_browser": true,
            "thumbnail_url": "https://play-lh.googleusercontent.com/sGSMoSuytTPbNuMjKFU0omN7y814nhnqYxEHDtwSPNkrAiqCLuH_asc06xb52U5tAoo=w240-h480-rw",
            "thumbnail_url_original": ""
          },
          "sub_118": {
            "id": 118,
            "mode": "video",
            "name_original": "News 18 Urdu",
            "name": "Channel 118",
            "sub_name": "",
            "stream_video_url": "https://news18urdu-lh.akamaihd.net/i/n18urdu_1@373059/index_4_av-p.m3u8?rebase=on&sd=10",
            "thumbnail_url": "https://raw.githubusercontent.com/tvgram-inc/TVGram/master/TVGram/ChannelsLogo/India.png",
            "thumbnail_url_original": ""
          },
          "sub_119": {
            "id": 119,
            "mode": "video",
            "name_original": "News 18 Uttarakhand",
            "name": "Channel 119",
            "sub_name": "",
            "stream_video_url": "https://news18up-lh.akamaihd.net/i/n18upuk_1@175735/index_4_av-p.m3u8?rebase=on&sd=10",
            "thumbnail_url": "https://raw.githubusercontent.com/tvgram-inc/TVGram/master/TVGram/ChannelsLogo/India.png",
            "thumbnail_url_original": ""
          },
          "sub_120": {
            "id": 120,
            "mode": "website",
            "name_original": "",
            "name": "Spanish Live TV",
            "sub_name": "Live Tv Channels (Ad)",
            "website_url": "https://play.google.com/store/apps/details?id=com.tvgram.spanishlivetv",
            "is_system_browser": true,
            "thumbnail_url": "https://i.postimg.cc/QxmKjy15/Spanish-tv.png",

            "thumbnail_url_original": ""
          },
          "sub_121": {
            "id": 121,
            "mode": "video",
            "name_original": "News 24",
            "name": "Channel 121",
            "sub_name": "",
            "stream_video_url": "https://vidcdn.vidgyor.com/news24-origin/liveabr/news24-origin/live1/playlist.m3u8",
            "thumbnail_url": "https://raw.githubusercontent.com/tvgram-inc/TVGram/master/TVGram/ChannelsLogo/India.png",
            "thumbnail_url_original": ""
          },
          "sub_122": {
            "id": 122,
            "mode": "video",
            "name_original": "News 24",
            "name": "Channel 122",
            "sub_name": "",
            "stream_video_url": "https://vidcdn.vidgyor.com/news24-origin/liveabr/news24-origin/live2/chunks.m3u8",
            "thumbnail_url": "https://raw.githubusercontent.com/tvgram-inc/TVGram/master/TVGram/ChannelsLogo/India.png",
            "thumbnail_url_original": ""
          },
          "sub_123": {
            "id": 123,
            "mode": "website",
            "name_original": "",
            "name": "Whtsapp Status Saver",
            "sub_name": "Status Saver (Ad)",
            "website_url": "https://play.google.com/store/apps/details?id=com.appclub.whats.status.saver",
            "is_system_browser": true,
            "thumbnail_url": "https://play-lh.googleusercontent.com/K76-feE-GOTDz9SoEWVKtom1ngUVTIPEsQ_damw8lCyaoh77awQifmc4A5wXdSyx84M=w240-h480-rw",
            "thumbnail_url_original": ""
          },
          "sub_124": {
            "id": 124,
            "mode": "video",
            "name_original": "Santhora TV",
            "name": "Channel 124",
            "sub_name": "",
            "stream_video_url": "http://rtmp.santhoratv.zecast.net/santhoratv/santhoratv/chunklist_w1802293946.m3u8",
            "thumbnail_url": "https://raw.githubusercontent.com/tvgram-inc/TVGram/master/TVGram/ChannelsLogo/India.png",
            "thumbnail_url_original": "https://www.iptv-updated.com/wp-content/themes/shootingstar-child/uploaded_images/santhora_tv_img_2250.png"
          },
          "sub_125": {
            "id": 125,
            "mode": "video",
            "name_original": "Santhora TV",
            "name": "Channel 125",
            "sub_name": "",
            "stream_video_url": "http://santhoratv.zecast.net/santhoratv/santhoratv/index.m3u8",
            "thumbnail_url": "https://raw.githubusercontent.com/tvgram-inc/TVGram/master/TVGram/ChannelsLogo/India.png",
            "thumbnail_url_original": "https://www.iptv-updated.com/wp-content/themes/shootingstar-child/uploaded_images/santhora_tv_img_2250.png"
          },
          "sub_126": {
            "id": 126,
            "mode": "website",
            "name_original": "",
           "name": "France Live TV",
            "sub_name": "Live Tv Channels",
            "website_url": "https://play.google.com/store/apps/details?id=com.tvgram.francelivetv",
            "is_system_browser": true,
            "thumbnail_url": "https://i.postimg.cc/7ZQC2JBZ/France-Tv.png",
            "thumbnail_url_original": ""
          },
          "sub_127": {
            "id": 127,
            "mode": "video",
            "name_original": "News18 India",
            "name": "Channel 127",
            "sub_name": "",
            "stream_video_url": "https://news18india-lh.akamaihd.net/i/news18india_1@174951/index_5_av-p.m3u8",
            "thumbnail_url": "https://raw.githubusercontent.com/tvgram-inc/TVGram/master/TVGram/ChannelsLogo/India.png",
            "thumbnail_url_original": ""
          },
          "sub_128": {
            "id": 128,
            "mode": "video",
            "name_original": "News18 Lokmat",
            "name": "Channel 128",
            "sub_name": "",
            "stream_video_url": "https://news18lokmat-lh.akamaihd.net/i/n18lokmat_1@178974/index_5_av-p.m3u8",
            "thumbnail_url": "https://raw.githubusercontent.com/tvgram-inc/TVGram/master/TVGram/ChannelsLogo/India.png",
            "thumbnail_url_original": "https://www.iptv-updated.com/wp-content/themes/shootingstar-child/uploaded_images/news18_lokmat_img_2414.png"
          },
          "sub_129": {
            "id": 129,
            "mode": "website",
            "name_original": "",
            "name": "VidChat : Live",
            "sub_name": "Random Video Chat (Ad)",
            "website_url": "https://play.google.com/store/apps/details?id=com.booya.videochat",
            "is_system_browser": true,
            "thumbnail_url": "https://play-lh.googleusercontent.com/OwvRNTvvyUo8g9MQUdJJBGT_cL4S7ObS_xCyzwHYTS-rLrapbZzD1cQYowyHy-uVgw=w240-h480-rw",
            "thumbnail_url_original": ""
          },
          "sub_130": {
            "id": 130,
            "mode": "video",
            "name_original": "Pop Pataka",
            "name": "Channel 130",
            "sub_name": "",
            "stream_video_url": "http://linear04hun-lh.akamaihd.net/i/poppataka_1@665241/master.m3u8",
            "thumbnail_url": "https://raw.githubusercontent.com/tvgram-inc/TVGram/master/TVGram/ChannelsLogo/India.png",
            "thumbnail_url_original": "https://www.iptv-updated.com/wp-content/themes/shootingstar-child/uploaded_images/pop_pataka_img_2415.png"
          },
          "sub_131": {
            "id": 131,
            "mode": "video",
            "name_original": "Pop Pataka",
            "name": "Channel 131",
            "sub_name": "",
            "stream_video_url": "https://linear04hun-lh.akamaihd.net/i/poppataka_1@665241/index_2128_av-p.m3u8",
            "thumbnail_url": "https://raw.githubusercontent.com/tvgram-inc/TVGram/master/TVGram/ChannelsLogo/India.png",
            "thumbnail_url_original": "https://www.iptv-updated.com/wp-content/themes/shootingstar-child/uploaded_images/pop_pataka_img_2415.png"
          },
          "sub_132": {
            "id": 132,
            "mode": "website",
            "name_original": "",
            "name": "World IPTV",
            "sub_name": "IPTV m3u Playlists(Ad)",
            "website_url": "https://play.google.com/store/apps/details?id=com.iptv.m3u.playlists",
            "is_system_browser": true,
            "thumbnail_url": "https://play-lh.googleusercontent.com/8mPNKodK65zCjQHS8aqF4o0cX9YlKZYN-3qYCd9oMlcTkGaAf_3AxB0vnE9Kud6bPw=w240-h480-rw",
            "thumbnail_url_original": ""
          },
          "sub_133": {
            "id": 133,
            "mode": "video",
            "name_original": "Pop Pataka",
            "name": "Channel 133",
            "sub_name": "",
            "stream_video_url": "https://live.hungama.com/linear/pop-pataka/playlist.m3u8",
            "thumbnail_url": "https://raw.githubusercontent.com/tvgram-inc/TVGram/master/TVGram/ChannelsLogo/India.png",
            "thumbnail_url_original": "https://www.iptv-updated.com/wp-content/themes/shootingstar-child/uploaded_images/pop_pataka_img_2415.png"
          },
          "sub_134": {
            "id": 134,
            "mode": "video",
            "name_original": "Pramaya News7",
            "name": "Channel 134",
            "sub_name": "",
            "stream_video_url": "https://live.mycast.in/encode/ee0c5a36ff5a7083ee044991974ad3ba.sdp/playlist.m3u8",
            "thumbnail_url": "https://raw.githubusercontent.com/tvgram-inc/TVGram/master/TVGram/ChannelsLogo/India.png",
            "thumbnail_url_original": ""
          },
          "sub_135": {
            "id": 135,
            "mode": "website",
            "name_original": "",
            "name": "India Live Tv",
            "sub_name": "Live Tv channels (Ad)",
            "website_url": "https://play.google.com/store/apps/details?id=com.tvgram.indialivetv",
            "is_system_browser": true,
            "thumbnail_url": "https://i.postimg.cc/Gm3YYCdq/India-Tv.png",
            "thumbnail_url_original": ""
          },
          "sub_136": {
            "id": 136,
            "mode": "video",
            "name_original": "Prime Canada TV",
            "name": "Channel 136",
            "sub_name": "",
            "stream_video_url": "http://cdn27.live247stream.com/primecanada/247/primecanada/stream1/playlist.m3u8",
            "thumbnail_url": "https://raw.githubusercontent.com/tvgram-inc/TVGram/master/TVGram/ChannelsLogo/India.png",
            "thumbnail_url_original": "https://www.iptv-updated.com/wp-content/themes/shootingstar-child/uploaded_images/prime_canada_tv_img_2418.png"
          },
          "sub_137": {
            "id": 137,
            "mode": "video",
            "name_original": "Punjabi TV",
            "name": "Channel 137",
            "sub_name": "",
            "stream_video_url": "http://cdn9.live247stream.com/punjabitvcanada/tv/playlist.m3u8",
            "thumbnail_url": "https://raw.githubusercontent.com/tvgram-inc/TVGram/master/TVGram/ChannelsLogo/India.png",
            "thumbnail_url_original": "https://www.iptv-updated.com/wp-content/themes/shootingstar-child/uploaded_images/default_img.png"
          },
          "sub_138": {
            "id": 138,
            "mode": "website",
            "name_original": "",
           "name": "YoYo Video Calls",
            "sub_name": "Live Random Video Chat (Ad)",
            "website_url": "https://play.google.com/store/apps/details?id=com.yoyolive.llc",
            "is_system_browser": true,
            "thumbnail_url": "https://i.postimg.cc/KvDBRzS1/YOYO.png",

            "thumbnail_url_original": ""
          },
          "sub_139": {
            "id": 139,
            "mode": "video",
            "name_original": "Sada TV",
            "name": "Channel 139",
            "sub_name": "",
            "stream_video_url": "http://cdn12.henico.net:8080/live/sadatv/index.m3u8",
            "thumbnail_url": "https://raw.githubusercontent.com/tvgram-inc/TVGram/master/TVGram/ChannelsLogo/India.png",
            "thumbnail_url_original": ""
          },
          "sub_140": {
            "id": 140,
            "mode": "video",
            "name_original": "Sana Plus",
            "name": "Channel 140",
            "sub_name": "",
            "stream_video_url": "http://media.7starcloud.com:1935/live/sanatv2/playlist.m3u8",
            "thumbnail_url": "https://raw.githubusercontent.com/tvgram-inc/TVGram/master/TVGram/ChannelsLogo/India.png",
            "thumbnail_url_original": ""
          },
          "sub_141": {
            "id": 141,
            "mode": "website",
            "name_original": "",
            "name": "USA Live TV",
            "sub_name": "USA Tv channels (Ad)",
            "website_url": "https://play.google.com/store/apps/details?id=com.tvgram.usalivetv",
            "is_system_browser": true,
            "thumbnail_url": "https://i.postimg.cc/gJh6dcHk/USA-Tv.png",
            "thumbnail_url_original": ""
          },
          "sub_142": {
            "id": 142,
            "mode": "video",
            "name_original": "Sardari TV",
            "name": "Channel 142",
            "sub_name": "",
            "stream_video_url": "http://158.69.124.9:1935/sardaritv/sardaritv/playlist.m3u8",
            "thumbnail_url": "https://raw.githubusercontent.com/tvgram-inc/TVGram/master/TVGram/ChannelsLogo/India.png",
            "thumbnail_url_original": "https://www.iptv-updated.com/wp-content/themes/shootingstar-child/uploaded_images/sardari_tv_img_2433.png"
          },
          "sub_143": {
            "id": 143,
            "mode": "video",
            "name_original": "Shemaroo Bollywood Classic",
            "name": "Channel 143",
            "sub_name": "",
            "stream_video_url": "https://livechannel.shemaroome.com/linearplayout/02-bollywood-classic/chunklist_1920x1080_cf.m3u8",
            "thumbnail_url": "https://raw.githubusercontent.com/tvgram-inc/TVGram/master/TVGram/ChannelsLogo/India.png",
            "thumbnail_url_original": "https://i.imgur.com/cMJVuIr.jpg"
          },
          "sub_144": {
            "id": 144,
            "mode": "website",
            "name_original": "",
            "name": "India IPTV List",
            "sub_name": "Indian m3u Playlist (Ad)",
            "website_url": "https://play.google.com/store/apps/details?id=com.bitlinks.india.iptv.m3ulist",
            "is_system_browser": true,
            "thumbnail_url": "https://play-lh.googleusercontent.com/l3rJ2qzJtRFzqUzr55ano_WEhcDx5YznwIpd7uRVxooEbOW5444QY8HeeZbiZhd4Ayc=w240-h480-rw",

            "thumbnail_url_original": ""
          },
          "sub_145": {
            "id": 145,
            "mode": "video",
            "name_original": "SHEMARRO KIDS",
            "name": "Channel 145",
            "sub_name": "",
            "stream_video_url": "https://livechannel.shemaroome.com/linearplayout/kids-linear-channel/chunklist_640x360_cf.m3u8",
            "thumbnail_url": "https://raw.githubusercontent.com/tvgram-inc/TVGram/master/TVGram/ChannelsLogo/India.png",
            "thumbnail_url_original": ""
          },
          "sub_146": {
            "id": 146,
            "mode": "video",
            "name_original": "Shraddha",
            "name": "Channel 146",
            "sub_name": "",
            "stream_video_url": "http://rtmp.smartstream.video:1935/mhoneshradha/mhoneshradha/playlist.m3u8",
            "thumbnail_url": "https://raw.githubusercontent.com/tvgram-inc/TVGram/master/TVGram/ChannelsLogo/India.png",
            "thumbnail_url_original": ""
          },
          "sub_147": {
            "id": 147,
            "mode": "website",
            "name_original": "",
            "name": "Cash Counter",
            "sub_name": "Cash Calculator",
            "website_url": "https://play.google.com/store/apps/details?id=com.money_count_save",
            "is_system_browser": true,
            "thumbnail_url": "https://play-lh.googleusercontent.com/kB7MXSAbO8vKrfbnM8QrzIcNbNm2tWH8rImp5xsIZY1lwKqK3FkNkEFRQpyskJliEbQ=w240-h480-rw",
            "thumbnail_url_original": ""
          },
          "sub_148": {
            "id": 148,
            "mode": "video",
            "name_original": "Shubhsandesh",
            "name": "Channel 148",
            "sub_name": "",
            "stream_video_url": "https://6284rn2xr7xv-hls-live.wmncdn.net/shubhsandeshtv1/live123.stream/index.m3u8",
            "thumbnail_url": "https://raw.githubusercontent.com/tvgram-inc/TVGram/master/TVGram/ChannelsLogo/India.png",
            "thumbnail_url_original": "https://www.iptv-updated.com/wp-content/themes/shootingstar-child/uploaded_images/shubhsandesh_img_2435.png"
          },
          "sub_149": {
            "id": 149,
            "mode": "video",
            "name_original": "Sri Sankara",
            "name": "Channel 149",
            "sub_name": "",
            "stream_video_url": "https://8noro432dm6g-hls-live.wmncdn.net/Sri/a5518065f47332dad6b509920c827474.sdp/index.m3u8",
            "thumbnail_url": "https://raw.githubusercontent.com/tvgram-inc/TVGram/master/TVGram/ChannelsLogo/India.png",
            "thumbnail_url_original": ""
          },
          "sub_150": {
            "id": 150,
            "mode": "website",
            "name_original": "",
            "name": "German Live Tv",
            "sub_name": "Live Tv Channels (Ad)",
            "website_url": "https://play.google.com/store/apps/details?id=com.tvgram.germanlivetv",
            "is_system_browser": true,
            "thumbnail_url": "https://i.postimg.cc/tJHng0Bd/German-TV.png",
            "thumbnail_url_original": ""
          },
          "sub_151": {
            "id": 151,
            "mode": "video",
            "name_original": "Super TV",
            "name": "Channel 151",
            "sub_name": "",
            "stream_video_url": "http://wms.shared.streamshow.it/supertv/mp4:supertv/playlist.m3u8",
            "thumbnail_url": "https://raw.githubusercontent.com/tvgram-inc/TVGram/master/TVGram/ChannelsLogo/India.png",
            "thumbnail_url_original": "https://www.iptv-updated.com/wp-content/themes/shootingstar-child/uploaded_images/super_tv_img_2442.png"
          },
          "sub_152": {
            "id": 152,
            "mode": "video",
            "name_original": "Super TV",
            "name": "Channel 152",
            "sub_name": "",
            "stream_video_url": "http://193.70.81.40:1935/supertvoristano/_definst_/supertvoristano/playlist.m3u8",
            "thumbnail_url": "https://raw.githubusercontent.com/tvgram-inc/TVGram/master/TVGram/ChannelsLogo/India.png",
            "thumbnail_url_original": "https://www.iptv-updated.com/wp-content/themes/shootingstar-child/uploaded_images/super_tv_img_2442.png"
          },
          "sub_153": {
            "id": 153,
            "mode": "website",
            "name_original": "",
            "name": "Loveme video Chat",
            "sub_name": "Random Video Chat (Ad)",
            "website_url": "https://play.google.com/store/apps/details?id=com.minichat.loveme.randome.videochat",
            "is_system_browser": true,
            "thumbnail_url": "https://play-lh.googleusercontent.com/TtbIIApy4sV1iyFKNEgoyNso6yjHo63XJIVqTuLQ2mIX3mohug1irZ6XHCDTa0ySjA=w240-h480-rw",

            "thumbnail_url_original": ""
          },
          "sub_154": {
            "id": 154,
            "mode": "video",
            "name_original": "Surya TV",
            "name": "Channel 154",
            "sub_name": "",
            "stream_video_url": "https://indo51.gcdn.co/MALYLAM-SuryaHD/index.m3u8",
            "thumbnail_url": "https://raw.githubusercontent.com/tvgram-inc/TVGram/master/TVGram/ChannelsLogo/India.png",
            "thumbnail_url_original": "https://i.imgur.com/ENrptYg.png"
          },
          "sub_155": {
            "id": 155,
            "mode": "video",
            "name_original": "Suvarna News 24×7",
            "name": "Channel 155",
            "sub_name": "",
            "stream_video_url": "https://vidcdn.vidgyor.com/suvarna-origin/liveabr/suvarna-origin/live1/chunks.m3u8",
            "thumbnail_url": "https://raw.githubusercontent.com/tvgram-inc/TVGram/master/TVGram/ChannelsLogo/India.png",
            "thumbnail_url_original": "https://www.iptv-updated.com/wp-content/themes/shootingstar-child/uploaded_images/default_img.png"
          },
          "sub_156": {
            "id": 156,
            "mode": "website",
            "name_original": "",
             "name": "Dream 11",
            "sub_name": "Live Scricket Score (Ad)",
            "website_url": "https://play.google.com/store/apps/details?id=com.bitmedia.ipl2k22",
            "is_system_browser": true,
            "thumbnail_url": "https://play-lh.googleusercontent.com/yAiVkEdk1YbKEvZf6SLujni0dQgA9U2_B86aqt0_k-b2_ASEWjnqdeL-UyNq-GWx1Jc=w240-h480-rw",
            "thumbnail_url_original": ""
          },
          "sub_157": {
            "id": 157,
            "mode": "video",
            "name_original": "SWARAJ EXPRESS",
            "name": "Channel 157",
            "sub_name": "",
            "stream_video_url": "http://live.wmncdn.net/highnews/swaraj.stream/index.m3u8",
            "thumbnail_url": "https://raw.githubusercontent.com/tvgram-inc/TVGram/master/TVGram/ChannelsLogo/India.png",
            "thumbnail_url_original": ""
          },
          "sub_158": {
            "id": 158,
            "mode": "video",
            "name_original": "SWARAJ EXPRESS",
            "name": "Channel 158",
            "sub_name": "",
            "stream_video_url": "https://live.wmncdn.net/highnews/swaraj.stream/index.m3u8",
            "thumbnail_url": "https://raw.githubusercontent.com/tvgram-inc/TVGram/master/TVGram/ChannelsLogo/India.png",
            "thumbnail_url_original": ""
          },
          "sub_159": {
            "id": 159,
            "mode": "website",
            "name_original": "",
            "name": "Joli Video Chat",
            "sub_name": "Random Video Chat (Ad)",
            "website_url": "https://play.google.com/store/apps/details?id=com.minichat.joli.random.videochat",
            "is_system_browser": true,
            "thumbnail_url": "https://play-lh.googleusercontent.com/ODeJvN0w3lTWCQQrzndPvge2xjMVfrVewgWfi0zHeLYFi5397N4_c4-GlYStW77skQ=w240-h480-rw",
            "thumbnail_url_original": ""
          },
          "sub_160": {
            "id": 160,
            "mode": "video",
            "name_original": "Tamil Vision International",
            "name": "Channel 160",
            "sub_name": "",
            "stream_video_url": "http://live.tamilvision.tv:8081/TVI/SD/playlist.m3u8",
            "thumbnail_url": "https://raw.githubusercontent.com/tvgram-inc/TVGram/master/TVGram/ChannelsLogo/India.png",
            "thumbnail_url_original": "https://www.iptv-updated.com/wp-content/themes/shootingstar-child/uploaded_images/tamil_vision_international_img_2447.png"
          },
          "sub_161": {
            "id": 161,
            "mode": "video",
            "name_original": "Tamil Vision International",
            "name": "Channel 161",
            "sub_name": "",
            "stream_video_url": "http://live.tamilvision.tv:8081/TVI/HD/playlist.m3u8",
            "thumbnail_url": "https://raw.githubusercontent.com/tvgram-inc/TVGram/master/TVGram/ChannelsLogo/India.png",
            "thumbnail_url_original": "https://www.iptv-updated.com/wp-content/themes/shootingstar-child/uploaded_images/tamil_vision_international_img_2447.png"
          },
          "sub_162": {
            "id": 162,
            "mode": "website",
            "name_original": "",
            "name": "Video Player",
            "sub_name": "HD Video Player (Ad)",
            "website_url": "https://play.google.com/store/apps/details?id=com.line.hdplayer",
            "is_system_browser": true,
            "thumbnail_url": "https://play-lh.googleusercontent.com/IPqZNMTj7o1agUs1LkuQ0OJU4Ue_udMnOwxENKdKTaTEL_6GyH1YjS4lfq8hUGCVxGA=w240-h480-rw",

            "thumbnail_url_original": ""
          },
          "sub_163": {
            "id": 163,
            "mode": "video",
            "name_original": "Thanthi TV",
            "name": "Channel 163",
            "sub_name": "",
            "stream_video_url": "https://vidcdn.vidgyor.com/thanthi-origin/liveabr/thanthi-origin/live1/chunks.m3u8",
            "thumbnail_url": "https://raw.githubusercontent.com/tvgram-inc/TVGram/master/TVGram/ChannelsLogo/India.png",
            "thumbnail_url_original": "https://www.iptv-updated.com/wp-content/themes/shootingstar-child/uploaded_images/thanthi_tv_img_2448.png"
          },
          "sub_164": {
            "id": 164,
            "mode": "video",
            "name_original": "Thanthi TV",
            "name": "Channel 164",
            "sub_name": "",
            "stream_video_url": "https://vidcdn.vidgyor.com/thanthi-origin/liveabr/thanthi-origin/live1/playlist.m3u8",
            "thumbnail_url": "https://raw.githubusercontent.com/tvgram-inc/TVGram/master/TVGram/ChannelsLogo/India.png",
            "thumbnail_url_original": "https://www.iptv-updated.com/wp-content/themes/shootingstar-child/uploaded_images/thanthi_tv_img_2448.png"
          },
          "sub_165": {
            "id": 165,
            "mode": "website",
            "name_original": "",
            "name": "Pocket IPTV",
            "sub_name": "IPTV Player (Ad)",
            "website_url": "https://play.google.com/store/apps/details?id=com.pocketiptv",
            "is_system_browser": true,
            "thumbnail_url": "https://play-lh.googleusercontent.com/DviEA28-3k_q7mb1mbF8ZMRdYNRmqEGYMzQ3SJnSdEo5hRkFmxgpr2uKb1z8wnsCpcU=w240-h480-rw",
            "thumbnail_url_original": ""
          },
          "sub_166": {
            "id": 166,
            "mode": "video",
            "name_original": "The Q India",
            "name": "Channel 166",
            "sub_name": "",
            "stream_video_url": "https://amg1-i.akamaihd.net/hls/live/784034/Q001/playlist.m3u8?__nn__=5606168722001&hdnea=st=1566232200~exp=1566235800~acl=/hls/live/784034/Q001/*~hmac=4de929fdc0ee53199a11237ee75a695383a82a42623fa92c1376493e5fc91d7b",
            "thumbnail_url": "https://raw.githubusercontent.com/tvgram-inc/TVGram/master/TVGram/ChannelsLogo/India.png",
            "thumbnail_url_original": "https://www.iptv-updated.com/wp-content/themes/shootingstar-child/uploaded_images/the_q_india_img_2449.png"
          },
          "sub_167": {
            "id": 167,
            "mode": "video",
            "name_original": "Time Vision News",
            "name": "Channel 167",
            "sub_name": "",
            "stream_video_url": "http://cloud.logicwebs.in:1935/timevision/timevision/playlist.m3u8",
            "thumbnail_url": "https://raw.githubusercontent.com/tvgram-inc/TVGram/master/TVGram/ChannelsLogo/India.png",
            "thumbnail_url_original": "https://i.imgur.com/YSQVbIm.png"
          },
          "sub_168": {
            "id": 168,
            "mode": "website",
            "name_original": "",
             "name": "Sexy video calls",
            "sub_name": "Random Video Chat (Ad)",
            "website_url": "https://play.google.com/store/apps/details?id=com.minichat.lyubimiy.videochat",
            "is_system_browser": true,
            "thumbnail_url": "https://play-lh.googleusercontent.com/R93sG4-ovSRJaDNIVx6PaMkfZGATne9MN0S8Ihp7uSgKxaC2qmdXYpYP3GAslVtP5_5f=w240-h480-rw",
            "thumbnail_url_original": ""
          },
          "sub_169": {
            "id": 169,
            "mode": "video",
            "name_original": "TV9 News",
            "name": "Channel 169",
            "sub_name": "",
            "stream_video_url": "https://vidcdn.vidgyor.com/tv9telugu-origin/live/tv9telugu-origin/live1/playlist.m3u8",
            "thumbnail_url": "https://raw.githubusercontent.com/tvgram-inc/TVGram/master/TVGram/ChannelsLogo/India.png",
            "thumbnail_url_original": "https://www.lyngsat-logo.com/logo/tv/tt/tv-9-telugu-in.png"
          },
          "sub_170": {
            "id": 170,
            "mode": "video",
            "name_original": "Xplore Channel",
            "name": "Channel 170",
            "sub_name": "",
            "stream_video_url": "http://cdn18.live247stream.com/ndachannel/tv/playlist.m3u8",
            "thumbnail_url": "https://raw.githubusercontent.com/tvgram-inc/TVGram/master/TVGram/ChannelsLogo/India.png",
            "thumbnail_url_original": ""
          }
        }
      }
    }
  }
}
