{		
	"com.bitlinks.brazil.iptv.m3ulist": 	
	{	
		
	"ads_sequence": [	
		
		"facebook_ads",
		"app_lovin"
		
	],	
	"more_app_url": "https://play.google.com/store/apps/developer?id=Bit+Links", 	
	"extra_url": "https://gitlab.com/bitcodingsolutions/TVGram/-/raw/master/TVGram/Data/Brazil_Live.json", 	
	"iptv_player_url": "com.pocketiptv",	
	"ad_setting": {	

		"app_version_code": 3,			
		
		"is_full_ads": true,
		"onesignal_id": "07de0128-c4bc-45f0-8baa-6867a262a6b7", 
		"ads_loading_text": "Ads will loading...",
		"global_intra_interval_click": 1,
		"interstitial_ad_time_interval": 0
	},	
	"app_update": {	
		"is_popup_dialog": true,
		"is_update_require": false,
		"package_id": "com.adult.iptv.hot.playlist", 
		"website_url": "https://play.google.com/store/apps/details?id=com.adult.iptv.hot.playlist", 
		"app_icon": "https://play-lh.googleusercontent.com/puoKL06VOKbYoXPB-O2JfueIgMDuy2vGWdSZ7f7XsGG9idZQ7Sr42E54Uv-M5a5fqXo=w240-h480-rw",
		"updated_version_code": 50,
		"title": "Enjoy Free Live Channels",
		"default_message": "Don't feel Alone."

	},	
	"exit_dialog": {	
		"is_exit_require": true,
		"exit_title": "Exit",
		"exit_message": "Do you want to exit from App?"
	},
	"reward_dialog": {	
		"is_reward_require": true,
		"reward_message": "Watch Reward ads for get IPTV list free"
   	 },	
	"About_App": {	
		"is_override": false,
		"is_about_app": true,
		"about_title": "Brazil IPTV Links m3u Playlists", 
		"about_message": "Your app need an Update!",
		"registration_detail": "Brazil IPTV Links m3u Playlists", 
		"version_detail": "version : 1.0.0"
	},	
	"rate_app": {	
		"is_rate_app": true,
		"package_id": "com.bitlinks.brazil.iptv.m3ulist", 
		"rate_app_url": "https://play.google.com/store/apps/details?id=com.bitlinks.brazil.iptv.m3ulist", 
		"rate_message": "Please Rate us and promote us."
	},	
	"share_app": {	
		"is_share_app": true,
		"share_title": "Share link url :https://play.google.com/store/apps/details?id=com.bitlinks.brazil.iptv.m3ulist", 
		"share_message": "Now anyone can get Brazil IPTV Links m3u Playlists app : https://play.google.com/store/apps/details?id=com.bitlinks.brazil.iptv.m3ulist" 
	},	
	"privacy_policy": {	
		"is_privacy_policy": true,
		"is_system_browser": true,
		"privacy_policy": "https://pages.flycricket.io/brazil-iptv-links-m3/privacy.html" 
	},	
	"terms_of_use": {	
		"is_terms_of_use": true,
		"is_system_browser": true,
		"terms_of_use": "https://pages.flycricket.io/brazil-iptv-links-m3/privacy.html" 
	},	
	"error_report": {	
		"is_error_report_support": true,
		"email_id": "mailto:bitlinks.llc@gmail.com"
	},	
	"feedback_support": {	
		"is_feedback_support": true,
		"email_id":"mailto:bitlinks.llc@gmail.com",
		"feedback_title": "Feedback on Brazil IPTV Links m3u Playlists",
		"feedback_message": "Hi,\n\n\nYour Feedback Brazil IPTV Links m3u Playlists! I would like to give you some feedback:",
		"email_subject": "Feedback on Brazil IPTV Links m3u Playlists",
		"email_message": "Hi,\n\n\nYour Feedback Brazil IPTV Links m3u Playlists! I would like to give you some feedback:"
		
	},	
	"google_ads": {	
		"banner_ad_unit_id_android": "/6499/example/banner", 
		"interstitial_ad_unit_id_android": "/6499/example/interstitial", 
		"app_open_ad_unit_id_android": "/6499/example/app-open", 
		"native_ads_unit_id_android": "/6499/example/native", 
		"rewared_ads_unit_id": "/6499/example/rewarded", 
		"native_video_ads_unit_id_android": "/6499/example/native-video", 
		"is_banner_ads": true,
		"is_open_ads": true,
		"is_interstitial_ads": true,
		"is_rewared_ads": true,
		"is_native_ads": true,
		"no_of_click_interstitial": 1
	},	
	"facebook_ads": {	
		"banner_ad_unit_id_android": "1079129646141460_1079129946141430", 
		"interstitial_ad_unit_id_android": "1079129646141460_1079130002808091", 
		"rewared_ads_unit_id": "1079129646141460_1079130132808078", 
		"native_ads_unit_id_android": "1079129646141460_1079130052808086", 
		"is_banner_ads": true,
		"is_interstitial_ads": true,
		"is_rewared_ads": true,
		"is_native_ads": true,
		"no_of_click_interstitial": 1
	},
	"custom_ads": {	
		"qureka_link": "https://490.go.qureka.com/intro/question",
		"is_quraka_banner": true,
		"is_quraka_intera": true,
		"close_button_to_direct_web": true,
		"quraka_intra_image": [
		"https://github.com/pragneshpalsanabitcoding/image_quraka/blob/main/360X640_1.png?raw=true",
		"https://github.com/pragneshpalsanabitcoding/image_quraka/blob/main/360X640_2.png?raw=true",
		"https://github.com/pragneshpalsanabitcoding/image_quraka/blob/main/360X640_3.png?raw=true",
		"https://github.com/pragneshpalsanabitcoding/image_quraka/blob/main/360X640_4.png?raw=true",
		"https://github.com/pragneshpalsanabitcoding/image_quraka/blob/main/360X640_5.png?raw=true",
		"https://github.com/pragneshpalsanabitcoding/image_quraka/blob/main/360X640_6.png?raw=true"
	],	
	"quraka_banner_image": [	
		"https://github.com/pragneshpalsanabitcoding/image_quraka/blob/main/2.jpg?raw=true",
		"https://github.com/pragneshpalsanabitcoding/image_quraka/blob/main/3.jpg?raw=true",
		"https://github.com/pragneshpalsanabitcoding/image_quraka/blob/main/320x50.jpg?raw=true",
		"https://github.com/pragneshpalsanabitcoding/image_quraka/blob/main/4.jpg?raw=true",
		"https://github.com/pragneshpalsanabitcoding/image_quraka/blob/main/5.jpg?raw=true",
		"https://github.com/pragneshpalsanabitcoding/image_quraka/blob/main/6.jpg?raw=true"
	]	
	},	
	"app_lovin": {	
		
		"is_unlimited_ads": true,

		"id_unit_banner": "c69e3ae664d0fa76",
		"id_unit_intra": "dcd2874bece51327",
		"id_unit_native": "",
		"id_unit_native_multiple": 
		{
     			        "small":"83d9b6aa011456cf",
      		        	"medium":"9f12cb180ae01cbb",
    			        "manual":"370116a1a9acdb17"
  		},

		"rewared_ads_unit_id": "d46f32af1522f355",
		"is_banner_ads": true,
		"is_interstitial_ads": true,
		"is_native_ads": true,
		"is_rewared_ads": true
	},	
	"unity_ads": {	
		"game_id": "4737797",
		"is_intra_ads": true,
		"is_banner_ads": true,
		"is_rewared_ads": true
	}	
	}	
}		
