[
    {
        "id": "rs232.owner.current",
        "label": { "fallback": "RS232 current owner", "key": "rs232-current-owner" },
        "accessRights": { "admin": "readwrite"},
        "writable": false,
        "changeBehaviour": "eventually"
    },
    {
        "id": "rs232.owner.configured",
        "label": { "fallback": "RS232 configured owner", "key": "rs232-configured-owner" },
        "accessRights": { "admin": "readwrite"},
        "writable": true,
        "changeBehaviour": "eventually"
    }
]