[
    {
        "id": "networking.tcpip.dhcp.dnsserver.*.ipaddress",
        "label": {"fallback": "DNS Server IP Address",  "key": "dns-server-ip-address"},
        "accessRights": {
            "guest": "read", "user": "read", "admin": "read"
        },
        "changeBehaviour": "eventually",
        "writable": false
    },
    {
        "id": "networking.tcpip.dhcp.dnsserver.*.index",
        "label": {"fallback": "DNS Server IP Address",  "key": "dns-server-index"},
        "accessRights": {
            "guest": "read", "user": "read", "admin": "read"
        },
        "changeBehaviour": "eventually",
        "writable": false
    },
    {
        "id": "networking.tcpip.dhcp.dnsserver.noentry",
        "label": {"fallback": "Defines if an entry exists",  "key": "dhcp-dns-server-noentry"},
        "accessRights": {
            "guest": "read", "user": "read", "admin": "read"
        },
        "changeBehaviour": "eventually",
        "writable": false
    }
]