[{
    "command": "get_wbm_diaglist $limit",
    "executes": ["diagnostic.getlog"],
    "options": {
        "multiline": true
    },
    "mapping": {
        "limit": "limit"
    },
    "conversion": {
        "limit": [{"from": "0", "to" : ""}]
    }
}]