[
    {
        "id": "clock.time.local",
        "label": {"key": "local-time", "fallback": "Local Time"},
        "writable": true,
        "accessRights": {
            "admin": "readwrite", 
            "user": "readwrite"
        },
        "changeBehaviour": "permanently",
        "applyEvent": "immediately"
    },
    {
        "id": "clock.time.utc",
        "label": {"key": "utc-time", "fallback": "UTC Time"},
        "writable": true,
        "accessRights": {
            "admin": "readwrite", 
            "user": "readwrite"
        },
        "changeBehaviour": "permanently",
        "applyEvent": "immediately"
    },
    {
        "id": "clock.time.format",
        "label": {"key": "time-format", "fallback": "Time-Format"},
        "writable": true,
        "accessRights": {
            "admin": "readwrite", 
            "user": "readwrite"
        },
        "changeBehaviour": "eventually",
        "applyEvent": "immediately"
    },
    {
        "id": "clock.date.local",
        "label": {"key": "local-date", "fallback": "Local Date"},
        "writable": true,
        "accessRights": {
            "admin": "readwrite", 
            "user": "readwrite"
        },
        "changeBehaviour": "eventually",
        "applyEvent": "immediately"
    },
    {
        "id": "clock.date.utc",
        "label": {"key": "utc-date", "fallback": "UTC Date"},
        "writable": true,
        "accessRights": {
            "admin": "readwrite", 
            "user": "readwrite"
        },
        "changeBehaviour": "eventually",
        "applyEvent": "immediately"
    },
    {
        "id": "clock.timezone.tzstring",
        "label": {"key": "tz-string", "fallback": "TZ String"},
        "writable": true,
        "accessRights": {
            "admin": "readwrite", 
            "user": "readwrite"
        },
        "changeBehaviour": "eventually",
        "applyEvent": "immediately"
    }
]