[
    {
        "id": "runtime.version",
        "accessRights": {
            "admin": "read",
            "user": "read",
            "guest": "read"
        }
    },
    {
        "id": "runtime.availableversions.*.id",
        "accessRights": {
            "admin": "read",
            "user": "read",
            "guest": "read"
        }
    },
    {
        "id": "runtime.availableversions.*.name",
        "accessRights": {
            "admin": "read",
            "user": "read",
            "guest": "read"
        }
    },
    {
        "id": "runtime.codesys2.webserver.version",
        "accessRights": {
            "admin": "read",
            "user": "read",
            "guest": "read"
        }
    },
    {
        "id": "runtime.codesys2.state",
        "accessRights": {
            "admin": "read",
            "user": "read",
            "guest": "read"
        }
    },
    {
        "id": "runtime.codesys2.taskscount",
        "accessRights": {
            "admin": "read",
            "user": "read",
            "guest": "read"
        }
    },
    {
        "id": "runtime.codesys2.project.date",
        "accessRights": {
            "admin": "read",
            "user": "read",
            "guest": "read"
        }
    },
    {
        "id": "runtime.codesys2.project.title",
        "accessRights": {
            "admin": "read",
            "user": "read",
            "guest": "read"
        }
    },
    {
        "id": "runtime.codesys2.project.version",
        "accessRights": {
            "admin": "read",
            "user": "read",
            "guest": "read"
        }
    },
    {
        "id": "runtime.codesys2.project.author",
        "accessRights": {
            "admin": "read",
            "user": "read",
            "guest": "read"
        }
    },
    {
        "id": "runtime.codesys2.project.description",
        "accessRights": {
            "admin": "read",
            "user": "read",
            "guest": "read"
        }
    },
    {
        "id": "runtime.codesys2.project.checksum",
        "accessRights": {
            "admin": "read",
            "user": "read",
            "guest": "read"
        }
    },
    {
        "id": "runtime.codesys2.tasks.*.index",
        "accessRights": {
            "admin": "read",
            "user": "read",
            "guest": "read"
        }
    },
    {
        "id": "runtime.codesys2.tasks.*.name",
        "accessRights": {
            "admin": "read",
            "user": "read",
            "guest": "read"
        }
    },
    {
        "id": "runtime.codesys2.tasks.*.id",
        "accessRights": {
            "admin": "read",
            "user": "read",
            "guest": "read"
        }
    },
    {
        "id": "runtime.codesys2.tasks.*.cylecount",
        "accessRights": {
            "admin": "read",
            "user": "read",
            "guest": "read"
        }
    },
    {
        "id": "runtime.codesys2.tasks.*.cyletime",
        "accessRights": {
            "admin": "read",
            "user": "read",
            "guest": "read"
        }
    },
    {
        "id": "runtime.codesys2.tasks.*.minimumcyletime",
        "accessRights": {
            "admin": "read",
            "user": "read",
            "guest": "read"
        }
    },
    {
        "id": "runtime.codesys2.tasks.*.maximumcyletime",
        "accessRights": {
            "admin": "read",
            "user": "read",
            "guest": "read"
        }
    },
    {
        "id": "runtime.codesys2.tasks.*.averagecyletime",
        "accessRights": {
            "admin": "read",
            "user": "read",
            "guest": "read"
        }
    },
    {
        "id": "runtime.codesys2.tasks.*.state",
        "accessRights": {
            "admin": "read",
            "user": "read",
            "guest": "read"
        }
    },
    {
        "id": "runtime.codesys2.tasks.*.mode",
        "accessRights": {
            "admin": "read",
            "user": "read",
            "guest": "read"
        }
    },
    {
        "id": "runtime.codesys2.tasks.*.priority",
        "accessRights": {
            "admin": "read",
            "user": "read",
            "guest": "read"
        }
    },
    {
        "id": "runtime.codesys2.tasks.*.intervalunit",
        "accessRights": {
            "admin": "read",
            "user": "read",
            "guest": "read"
        }
    },
    {
        "id": "runtime.codesys2.tasks.*.interval",
        "accessRights": {
            "admin": "read",
            "user": "read",
            "guest": "read"
        }
    }
]