[
    {
        "command": "get_coupler_details actual-hostname",
        "reads": ["device.hostname"]
    },
    {
        "command": "get_coupler_details actual-domain-name",
        "reads":[
            "device.domainname"
        ]
    },
    {
        "command": "get_coupler_details hostname",
        "reads": ["device.configurable.hostname"]
    },
    {
        "command": "get_coupler_details domain-name",
        "reads":[
            "device.configurable.domainname"
        ]
    },
    {
        "command": "change_hostname hostname=$configuredhostname",
        "writes": ["device.configurable.hostname"],
        "type": "mapping",
        "mapping": {
            "device.configurable.hostname": "configuredhostname"
        }
    },
    {
        "command": "change_hostname dnsdomain=$configureddomainname",
        "writes":[ "device.configurable.domainname" ],
        "type": "mapping",
        "mapping": {
            "device.configurable.domainname": "configureddomainname"
        }
    },
    {
        "command": "change_hostname hostname=",
        "executes": ["device.configurable.reset.hostname"]
    },
    {
        "command": "edit_dns_server domain-name=",
        "executes": ["device.configurable.reset.domainname"]
    }
]