{
  "actions": [
    {
      "id": "action1",
      "type": "key",
      "parameters": {},
      "actions": [
        {
          "type": "keyDown",
          "value": ""
        },
        {
          "type": "pause",
          "duration": 10
        },
        {
          "type": "keyUp",
          "value": ""
        }
      ]
    }
  ]
}