{
  "actions": [
    {
      "id": "action2",
      "type": "wheel",
      "parameters": {},
      "actions": [
        {
          "type": "scroll",
          "x": -240,
          "y": 195,
          "deltaX": 0,
          "deltaY": 0,
          "duration": 0,
          "origin": {
            "element-6066-11e4-a52e-4f735466cecf": "f.9FC446821BD2E4DC992F9668437E6BE6.d.59C4AAA804AA1F29715A3EE77CEC8D76.e.225"
          }
        }
      ]
    }
  ]
}