<?xml version="1.0" encoding="UTF-8" standalone="no"?>
<svg:svg
   xmlns:dc="http://purl.org/dc/elements/1.1/"
   xmlns:cc="http://creativecommons.org/ns#"
   xmlns:rdf="http://www.w3.org/1999/02/22-rdf-syntax-ns#"
   xmlns:svg="http://www.w3.org/2000/svg"
   xmlns:xlink="http://www.w3.org/1999/xlink"
   xmlns:sodipodi="http://sodipodi.sourceforge.net/DTD/sodipodi-0.dtd"
   xmlns:inkscape="http://www.inkscape.org/namespaces/inkscape"
   version="1.1"
   id="Layer_1"
   x="0px"
   y="0px"
   width="54.701"
   height="63.160999"
   viewBox="0 0 54.701001 63.160998"
   enable-background="new 0 0 239.773 67.691"
   xml:space="preserve"
   sodipodi:docname="fel.svg"
   inkscape:version="1.0.2 (e86c870879, 2021-01-15)"><svg:metadata
   id="metadata27"><rdf:RDF><cc:Work
       rdf:about=""><dc:format>image/svg+xml</dc:format><dc:type
         rdf:resource="http://purl.org/dc/dcmitype/StillImage" /></cc:Work></rdf:RDF></svg:metadata><svg:defs
   id="defs25" /><sodipodi:namedview
   pagecolor="#ffffff"
   bordercolor="#666666"
   borderopacity="1"
   objecttolerance="10"
   gridtolerance="10"
   guidetolerance="10"
   inkscape:pageopacity="0"
   inkscape:pageshadow="2"
   inkscape:window-width="1920"
   inkscape:window-height="1051"
   id="namedview23"
   showgrid="false"
   inkscape:zoom="5.4343067"
   inkscape:cx="119.5705"
   inkscape:cy="33.522501"
   inkscape:window-x="1680"
   inkscape:window-y="100"
   inkscape:window-maximized="1"
   inkscape:current-layer="Layer_1" />
<svg:g
   id="g20"
   transform="translate(-0.316,-0.323)">
	<svg:polygon
   fill="#084390"
   points="55.017,31.903 42.39,24.615 42.39,39.201 "
   id="polygon2" />
	<svg:g
   id="g18">
		<svg:defs
   id="defs5">
			<svg:rect
   id="SVGID_1_"
   x="-37.563"
   y="-37.555"
   width="285.44901"
   height="138.686" />
		</svg:defs>
		<svg:clipPath
   id="SVGID_2_">
			<svg:use
   xlink:href="#SVGID_1_"
   overflow="visible"
   id="use7"
   x="0"
   y="0"
   width="100%"
   height="100%" />
		</svg:clipPath>
		<svg:path
   clip-path="url(#SVGID_2_)"
   fill="#c3c5c4"
   d="m 0.316,63.484 18.365,-10.6 C 13.548,51.17 9.858,47.354 9.794,40.759 v -21.82 h 9.44 V 40.29 c 0.145,4.341 2.414,7.083 6.856,7.083 1.256,0 2.33,-0.229 3.241,-0.64 l 0.991,-0.571 C 31.976,44.96 32.85,42.923 32.94,40.29 V 19.169 h 0.02 L 0.316,0.323 Z"
   id="path10" />
		
		
		
	</svg:g>
</svg:g>
<script /></svg:svg>
