%YAML 1.1
%TAG !u! tag:unity3d.com,2011:
--- !u!114 &11400000
MonoBehaviour:
  m_ObjectHideFlags: 0
  m_CorrespondingSourceObject: {fileID: 0}
  m_PrefabInstance: {fileID: 0}
  m_PrefabAsset: {fileID: 0}
  m_GameObject: {fileID: 0}
  m_Enabled: 1
  m_EditorHideFlags: 0
  m_Script: {fileID: 11500000, guid: ab278ffd189586948a9ffa4107dc5143, type: 3}
  m_Name: AttackSpecialTroop
  m_EditorClassIdentifier: 
  effectObjectHero: {fileID: 0}
  effectObjectHeroTile: 1
  effectObjectAllTileRange: 1
  levelAttackInfo:
  - typeTarget: 0
    typeAttack: 2
    rangeCell: 1
    damage: 4
    attackSpeed: 2.5
    attackWaiting: 2
    rangeAttack: 1
  condition: []
