{
  "project_info": {
    "project_number": "287798483444",
    "firebase_url": "https://officebing-13afb.firebaseio.com",
    "project_id": "officebing-13afb",
    "storage_bucket": "officebing-13afb.appspot.com"
  },
  "client": [
    {
      "client_info": {
        "mobilesdk_app_id": "1:287798483444:android:1b0aa0c90b75cf9d6b01a1",
        "android_client_info": {
          "package_name": "com.rm.office_bing"
        }
      },
      "oauth_client": [
        {
          "client_id": "287798483444-gl78hoa5m9uqi62evd40ohdj3qut0kk0.apps.googleusercontent.com",
          "client_type": 1,
          "android_info": {
            "package_name": "com.rm.office_bing",
            "certificate_hash": "409b56fade6f48e19636d1eb628f195b8a90f9a8"
          }
        },
        {
          "client_id": "287798483444-c4gf3bgtvecgaqfinth5f3idnqcg7kr1.apps.googleusercontent.com",
          "client_type": 3
        }
      ],
      "api_key": [
        {
          "current_key": "AIzaSyBbrPUH8gY7MW0kHp7uyb91mr0rpqkEPes"
        }
      ],
      "services": {
        "appinvite_service": {
          "other_platform_oauth_client": [
            {
              "client_id": "287798483444-c4gf3bgtvecgaqfinth5f3idnqcg7kr1.apps.googleusercontent.com",
              "client_type": 3
            }
          ]
        }
      }
    },
    {
      "client_info": {
        "mobilesdk_app_id": "1:287798483444:android:1571f2e84debe44f6b01a1",
        "android_client_info": {
          "package_name": "com.sp.officebing"
        }
      },
      "oauth_client": [
        {
          "client_id": "287798483444-29djk1ctqbof49uookl4d7d2i9vv92dg.apps.googleusercontent.com",
          "client_type": 1,
          "android_info": {
            "package_name": "com.sp.officebing",
            "certificate_hash": "409b56fade6f48e19636d1eb628f195b8a90f9a8"
          }
        },
        {
          "client_id": "287798483444-c4gf3bgtvecgaqfinth5f3idnqcg7kr1.apps.googleusercontent.com",
          "client_type": 3
        }
      ],
      "api_key": [
        {
          "current_key": "AIzaSyBbrPUH8gY7MW0kHp7uyb91mr0rpqkEPes"
        }
      ],
      "services": {
        "appinvite_service": {
          "other_platform_oauth_client": [
            {
              "client_id": "287798483444-c4gf3bgtvecgaqfinth5f3idnqcg7kr1.apps.googleusercontent.com",
              "client_type": 3
            }
          ]
        }
      }
    }
  ],
  "configuration_version": "1"
}