<svg id="Group_5" data-name="Group 5" xmlns="http://www.w3.org/2000/svg" width="42" height="40" viewBox="0 0 42 40">
  <path id="Fill_1" data-name="Fill 1" d="M6.753,1.27a.956.956,0,0,1-.035,1.319.9.9,0,0,1-1.286-.021c-.156-.161-1.6-1.54-4.011.128a.893.893,0,0,1-.508.161A.9.9,0,0,1,.155,2.44.961.961,0,0,1,.4,1.132C3.419-.957,5.872.3,6.753,1.27Z" transform="translate(23.8 21.429)" fill="#ffd100"/>
  <path id="Fill_2" data-name="Fill 2" d="M6.6,1.133A.963.963,0,0,1,6.846,2.44a.9.9,0,0,1-.758.417A.889.889,0,0,1,5.579,2.7C3.173,1.035,1.735,2.4,1.57,2.568A.9.9,0,0,1,.286,2.6.965.965,0,0,1,.248,1.269C1.122.3,3.58-.957,6.6,1.133Z" transform="translate(11.2 21.429)" fill="#ffd100"/>
  <path id="Fill_3" data-name="Fill 3" d="M8.044,28.57c2.065,2.766,4.624,4.612,7.353,4.612,5.911,0,11.045-8.6,12.007-16.649-1.634-.506-9.247,1-17.892-6.874,0,0-2.4,4.069-6.244,5.441A26.64,26.64,0,0,0,5.5,24.152a32.245,32.245,0,0,1-3.436-1.978c0-.01-.145-.5-.216-.736A26.859,26.859,0,0,1,.7,13.919C.7,5.072,6.061,0,15.4,0S30.1,5.072,30.1,13.919a27.25,27.25,0,0,1-1.369,8.224A45.648,45.648,0,0,0,30.8,33.6a48.857,48.857,0,0,1-8.385-.953A10.5,10.5,0,0,1,15.4,35.714,10.49,10.49,0,0,1,8.388,32.65,48.939,48.939,0,0,1,0,33.6a38.843,38.843,0,0,0,1.753-8.07,29.293,29.293,0,0,0,6.291,3.037Z" transform="translate(5.6 4.286)" fill="#ffd100"/>
  <path id="Fill_4" data-name="Fill 4" d="M39.109,13.422C37.932,5.75,30.413,0,21,0S4.072,5.75,2.894,13.422c-1.563.624-3.281,2.291-2.817,6.693.511,4.836,2.908,5.689,4.661,5.82,2.049,1.587,7.255,5.168,13.2,5.867a1.482,1.482,0,0,0,1.409,1.055h2.284a1.485,1.485,0,1,0,0-2.97H19.344a1.471,1.471,0,0,0-1.213.663c-5.5-.629-10.485-3.984-12.51-5.527a81.971,81.971,0,0,1-.714-9.5C4.907,8.036,11.976,2.174,21,2.174S37.094,8.036,37.094,15.52a90.487,90.487,0,0,1-.836,10.433c1.653.034,5.049.025,5.664-5.839.465-4.4-1.25-6.069-2.814-6.693Z" transform="translate(0)" fill="#ffd100"/>
</svg>
