<svg xmlns="http://www.w3.org/2000/svg" width="98" height="31" viewBox="0 0 98 31">
    <g fill="none" fill-rule="evenodd">
        <g fill="#F6D500" fill-rule="nonzero">
            <path d="M12.641 16.147c-.542-.64-.887-1.478-.985-2.464-.05-.591-.099-1.626 0-3.153.05-1.528.148-2.612.296-3.154.197-.986.59-1.725 1.182-2.365.986-.986 2.119-1.43 3.499-1.38 1.38.05 2.464.591 3.35 1.675.543.64.887 1.479.986 2.464.099.591.099 1.675.05 3.203-.05 1.528-.149 2.562-.296 3.154-.197.985-.592 1.724-1.183 2.365-.838.838-1.774 1.281-2.809 1.38l.099-2.513a1.71 1.71 0 0 0 .936-.592c.444-.493.69-1.774.789-3.893.098-2.118-.05-3.449-.444-3.942-.394-.492-.887-.788-1.577-.788-.69-.05-1.232.197-1.626.69-.443.493-.69 1.774-.788 3.893-.099 2.118.049 3.449.443 3.942.197.246.444.443.789.591l-.099 2.562c-1.035-.295-1.872-.837-2.612-1.675M71.773 1.413l4.434 13.7-3.203.147-3.203-11.038-1.034 6.012 1.921-.099.493 2.168-2.907.099-.64 3.104-2.859.148L67.93 1.561zM3.87 16.443l1.626-.099c.641-.05 2.02-.098 1.922-2.07-.05-1.231-.542-1.97-2.02-1.872l-1.676.099.148 3.942zm-.295-6.061l1.921-.099c.641-.05 1.479-.493 1.43-1.872-.05-1.035-.789-1.725-1.775-1.676l-1.773.099.197 3.548zm-2.513 8.327L.372 4.813l5.174-.246c2.217-.098 4.09.444 4.237 3.4.099 1.577-.64 2.809-2.217 3.203v.05c2.07.196 2.66 1.478 2.76 3.4.197 3.498-2.859 3.843-4.09 3.892l-5.174.197zM23.285 17.625l-.69-13.896 3.893-.197 4.188 9.412h.05l-.493-9.609 2.71-.148.69 13.896-3.794.197-4.337-9.953h-.049l.542 10.15zM40.63 5.257l-1.084 6.06 2.76-.147-1.676-5.913zm-5.026 11.53l3.154-14.092 3.843-.197 4.484 13.698-3.055.148-.936-3.055-3.942.197-.64 3.104-2.908.198zM49.056 16.344L48.366 2.4l4.682-.197 2.611 9.313h.05l1.872-9.56 4.484-.246.74 13.945-2.859.099-.542-10.693h-.049L57.236 15.9l-2.76.148-3.104-10.594h-.049l.542 10.742zM77.686 1.069l8.377-.395.147 2.513-5.42 9.56 6.012-.345.098 2.168-8.77.444-.149-2.563 5.371-9.51-5.568.296zM89.512 14.422l7.736-.394-.098-2.119-4.83.247-.197-4.09 4.287-.197-.098-2.12-4.287.198-.197-3.45 4.681-.197L96.41.132l-7.588.394z"/>
        </g>
        <path fill="#FFF" d="M16.935 25.832a1.508 1.508 0 0 0-.579-.457 1.725 1.725 0 0 0-.724-.16c-.305 0-.58.057-.826.171-.247.115-.458.27-.633.469-.175.198-.311.43-.407.697a2.5 2.5 0 0 0-.145.857c0 .285.045.554.137.808.091.254.223.477.396.67.173.193.384.346.632.457.25.112.531.168.846.168.31 0 .582-.063.815-.19a1.75 1.75 0 0 0 .595-.534l.617.465a2.145 2.145 0 0 1-.617.552c-.168.104-.37.196-.606.275a2.59 2.59 0 0 1-.82.118c-.426 0-.81-.082-1.153-.244a2.79 2.79 0 0 1-1.429-1.535 2.811 2.811 0 0 1-.19-1.01c0-.416.068-.801.205-1.154a2.73 2.73 0 0 1 .576-.914c.246-.257.542-.456.887-.598a2.974 2.974 0 0 1 2.19-.008c.344.137.624.348.843.632l-.61.465zm2.37-1.166h1.897c.345 0 .63.047.853.141.224.094.4.214.53.358.13.145.22.308.27.488.05.18.076.354.076.522a1.39 1.39 0 0 1-.354.933 1.501 1.501 0 0 1-.971.492l1.53 2.46h-.913l-1.372-2.377h-.815v2.378h-.731v-5.395zm.731 2.377h.96c.142 0 .283-.011.423-.034.14-.023.264-.065.373-.126a.688.688 0 0 0 .263-.262.884.884 0 0 0 .1-.446.884.884 0 0 0-.1-.446.688.688 0 0 0-.263-.263 1.136 1.136 0 0 0-.373-.125 2.614 2.614 0 0 0-.423-.035h-.96v1.737zm4.686-2.377h3.482v.686h-2.75v1.608h2.56v.685h-2.56v1.73h2.887v.686h-3.62v-5.395zm7.108 0h.663l2.309 5.395h-.854l-.54-1.334H30.84l-.534 1.334h-.853l2.377-5.395zm1.31 3.421l-1.005-2.476h-.015l-1.021 2.476h2.042zm3.551-2.735h-1.737v-.686h4.206v.686h-1.737v4.709h-.732v-4.709zm4.008-.686h.731v5.395H40.7v-5.395zm2.14 0h.847l1.584 4.389h.016l1.645-4.389h.8l-2.125 5.395h-.686l-2.08-5.395zm6.302 0h3.482v.686h-2.75v1.608h2.56v.685h-2.56v1.73h2.887v.686h-3.62v-5.395zm8.244 0h1.09l1.713 4.084h.03l1.7-4.084h1.09v5.395h-.732v-4.435h-.015l-1.821 4.435h-.488l-1.82-4.435h-.016v4.435h-.731v-5.395zm7.718 0h3.482v.686h-2.75v1.608h2.56v.685h-2.56v1.73h2.887v.686h-3.62v-5.395zm5.295 0h1.882c.38 0 .715.043 1.002.13.287.086.536.202.746.347.211.144.386.31.526.499.14.187.25.38.332.579a3.12 3.12 0 0 1 .229 1.143c0 .345-.064.679-.191 1.001-.127.323-.315.61-.564.861a2.777 2.777 0 0 1-.926.606 3.317 3.317 0 0 1-1.276.229h-1.76v-5.395zm.731 4.709h.922c.31 0 .603-.042.88-.126.277-.084.52-.21.728-.377.208-.168.373-.377.495-.629.122-.251.183-.544.183-.88 0-.172-.028-.374-.084-.605a1.813 1.813 0 0 0-.316-.66 1.875 1.875 0 0 0-.644-.529c-.274-.145-.63-.217-1.067-.217H71.13v4.023zm5.798-4.709h.732v5.395h-.732v-5.395zm4.572 0h.663l2.308 5.395h-.853l-.541-1.334h-2.568l-.533 1.334h-.853l2.377-5.395zm1.31 3.421l-1.005-2.476h-.016l-1.02 2.476h2.041z"/>
    </g>
</svg>
