<?xml version="1.0" encoding="UTF-8"?>
<svg width="128px" height="41px" viewBox="0 0 128 41" version="1.1" xmlns="http://www.w3.org/2000/svg" xmlns:xlink="http://www.w3.org/1999/xlink">
    <!-- Generator: Sketch 46.2 (44496) - http://www.bohemiancoding.com/sketch -->
    <title>logo_desktop</title>
    <desc>Created with Sketch.</desc>
    <defs></defs>
    <g id="Symbols" stroke="none" stroke-width="1" fill="none" fill-rule="evenodd">
        <g id="desktop/header" transform="translate(-40.000000, -19.000000)">
            <g id="logo_desktop" transform="translate(40.000000, 19.000000)">
                <g id="Group">
                    <g id="Group-2" fill-rule="nonzero" fill="#F6D500">
                        <path d="M16.591864,21.192878 C15.8804431,20.3521078 15.4277207,19.2526391 15.2983714,17.9591465 C15.2336968,17.1830509 15.1690222,15.8248837 15.2983714,13.8199701 C15.363046,11.8150566 15.4923953,10.3922147 15.6864192,9.68079381 C15.9451177,8.3873012 16.4625148,7.41718175 17.2386103,6.57641156 C18.5321029,5.28291895 20.0196194,4.70084728 21.8305091,4.76552191 C23.6413987,4.83019654 25.0642406,5.54161747 26.2283839,6.96445934 C26.9398048,7.80522953 27.3925273,8.90469824 27.5218765,10.1981908 C27.6512258,10.9742864 27.6512258,12.3971283 27.5865511,14.4020418 C27.5218765,16.4069553 27.3925273,17.7651226 27.1985034,18.5412181 C26.9398048,19.8347107 26.4224078,20.8048302 25.6463122,21.6456004 C24.5468435,22.7450691 23.3180256,23.3271408 21.9598583,23.45649 L22.0892076,20.1580839 C22.6066046,20.0287346 22.9946524,19.7700361 23.3180256,19.3819883 C23.9000972,18.735242 24.2234704,17.0537016 24.3528196,14.2726925 C24.4821689,11.4916835 24.288145,9.74546844 23.770748,9.09872213 C23.2533509,8.45197583 22.6066046,8.06392805 21.7011598,8.06392805 C20.795715,7.99925342 20.084294,8.32262657 19.566897,8.96937287 C18.9848253,9.61611917 18.6614522,11.2976596 18.5321029,14.0786687 C18.4027537,16.8596778 18.5967776,18.6058928 19.1141746,19.2526391 C19.3728731,19.5760122 19.6962463,19.8347107 20.1489687,20.0287346 L20.0196194,23.3918154 C18.6614522,23.0037676 17.5619835,22.2923467 16.591864,21.192878" id="Shape"></path>
                        <polygon id="Shape" points="94.2014202 1.85516355 100.022137 19.8347107 95.818286 20.0287346 91.614435 5.54161747 90.2562678 13.4319224 92.7785784 13.3025731 93.4253247 16.1482568 89.6095215 16.2776061 88.7687513 20.3521078 85.0176228 20.5461317 89.1567991 2.04918744"></polygon>
                        <path d="M5.07977985,21.5809258 L7.21404264,21.4515765 C8.05481283,21.3869019 9.86570248,21.3222272 9.73635322,18.735242 C9.67167859,17.1183763 9.02493229,16.1482568 7.08469338,16.2776061 L4.88575596,16.4069553 L5.07977985,21.5809258 Z M4.69173206,13.6259462 L7.21404264,13.496597 C8.05481283,13.4319224 9.15428155,12.8498507 9.08960692,11.038961 C9.02493229,9.68079381 8.05481283,8.77534898 6.76132023,8.84002361 L4.43303354,8.96937287 L4.69173206,13.6259462 Z M1.39332593,24.5559587 L0.487881103,6.31771304 L7.27871727,5.99433988 C10.1890756,5.86499062 12.6467116,6.57641156 12.8407355,10.4568894 C12.9700847,12.5264775 11.9999653,14.1433433 9.93037711,14.6607403 L9.93037711,14.725415 C12.6467116,14.9841135 13.4228071,16.6656539 13.5521564,19.1879644 C13.8108549,23.7798632 9.80102785,24.2325856 8.18416209,24.2972602 L1.39332593,24.5559587 Z" id="Shape"></path>
                        <polygon id="Shape" points="30.5615841 23.1331169 29.6561393 4.89487117 34.7654351 4.63617265 40.2627787 16.989027 40.3274533 16.989027 39.680707 4.37747413 43.2378117 4.18345024 44.1432565 22.421696 39.16331 22.6803945 33.4719425 9.61611917 33.4072679 9.61611917 34.1186888 22.939093"></polygon>
                        <path d="M53.327054,6.89978471 L53.327054,6.89978471 L51.9042121,14.8547642 L55.5259914,14.6607403 L53.327054,6.89978471 Z M46.7302417,22.0336482 L50.869418,3.53670394 L55.9140392,3.27800542 L61.7994305,21.2575526 L57.7896034,21.4515765 L56.5607855,17.4417494 L51.3868151,17.7004479 L50.5460449,21.7749496 L46.7302417,22.0336482 Z" id="Shape"></path>
                        <polygon id="Shape" points="64.3864157 21.4515765 63.4809709 3.14865616 69.6250608 2.88995764 73.0528162 15.1134627 73.1174908 15.1134627 75.5751267 2.56658449 81.4605181 2.24321133 82.4306375 20.5461317 78.679509 20.6754809 77.9680881 6.64108619 77.9034134 6.64108619 75.1224043 20.8695048 71.500625 21.0635287 67.4261233 7.15848323 67.3614487 7.15848323 68.0728696 21.2575526"></polygon>
                        <polygon id="Shape" points="101.962376 1.40244114 112.957063 0.8850441 113.151087 4.18345024 106.036878 16.7303285 113.927182 16.2776061 114.056532 19.1232898 102.544448 19.7053615 102.350424 16.3422807 109.399958 3.86007709 102.091725 4.24812487"></polygon>
                        <polygon id="Shape" points="117.484287 18.9292659 127.638204 18.4118689 127.508855 15.6308598 121.170741 15.9542329 120.912043 10.5862386 126.538735 10.3275401 126.409386 7.54653101 120.782693 7.80522953 120.523995 3.27800542 126.668085 3.0193069 126.538735 0.173623168 116.578842 0.69102021"></polygon>
                    </g>
                    <text id="Creative-Media" font-family="Avenir-Medium, Avenir" font-size="10" font-weight="400" line-spacing="10" letter-spacing="1" fill="#FFFFFF">
                        <tspan x="18.2172314" y="37.3245711">Creative Media</tspan>
                    </text>
                </g>
            </g>
        </g>
    </g>
</svg>