<?xml version="1.0" encoding="UTF-8"?>
<svg width="27px" height="23px" viewBox="0 0 27 23" version="1.1" xmlns="http://www.w3.org/2000/svg" xmlns:xlink="http://www.w3.org/1999/xlink">
    <!-- Generator: Sketch 46.2 (44496) - http://www.bohemiancoding.com/sketch -->
    <title>vimeo</title>
    <desc>Created with Sketch.</desc>
    <defs></defs>
    <g id="Symbols" stroke="none" stroke-width="1" fill="none" fill-rule="evenodd">
        <g id="desktop/footer" transform="translate(-1373.000000, -29.000000)" fill="#FFFFFF">
            <g id="footer">
                <g id="social" transform="translate(1183.000000, 28.000000)">
                    <path d="M216.55479,5.27991324 C216.753789,4.1634491 216.749482,3.01532596 216.05966,2.14696496 C215.097614,0.929278179 213.049471,0.884481778 211.646353,1.09941836 C210.505122,1.27386588 206.644447,2.97720595 205.330707,7.05497063 C207.658181,6.87815406 208.878022,7.22274176 208.65404,9.78518204 C208.56014,10.8572805 208.018706,12.0321092 207.41417,13.1580495 C206.715734,14.4560683 205.406731,17.0051558 203.690039,15.1678573 C202.143701,13.5140517 202.259784,10.3515981 201.906366,8.24552113 C201.709521,7.06380069 201.501261,5.59133438 201.11403,4.37601664 C200.780426,3.33083907 200.015226,2.07072493 199.079886,1.79763918 C198.074982,1.5023706 196.832528,1.96325664 196.102864,2.3931298 C193.779912,3.75834319 192.009592,5.70074097 190,7.30328914 L190,7.45318479 C190.398214,7.83373883 190.505467,8.45808866 191.091912,8.54315875 C192.475217,8.74689623 193.79348,7.25397002 194.713098,8.80719908 C195.272623,9.75632282 195.447501,10.7967623 195.805441,11.8199724 C196.284203,13.1826014 196.653558,14.6664822 197.045096,16.2332794 C197.707781,18.8876815 198.522515,22.8534551 200.816392,23.8247617 C201.986914,24.3218295 203.746249,23.6569906 204.636793,23.1286946 C207.049553,21.7010247 208.929494,19.6309141 210.538719,17.5246218 C214.218054,12.5403761 216.247891,6.89387588 216.55479,5.27991324" id="vimeo"></path>
                </g>
            </g>
        </g>
    </g>
</svg>