<?xml version="1.0" encoding="UTF-8"?>
<svg width="32px" height="32px" viewBox="0 0 32 32" version="1.1" xmlns="http://www.w3.org/2000/svg" xmlns:xlink="http://www.w3.org/1999/xlink">
    <!-- Generator: Sketch 46.2 (44496) - http://www.bohemiancoding.com/sketch -->
    <title>play_tablet</title>
    <desc>Created with Sketch.</desc>
    <defs></defs>
    <g id="Symbols" stroke="none" stroke-width="1" fill="none" fill-rule="evenodd">
        <g id="tablet/videos_portrait" transform="translate(-706.000000, -455.000000)" fill-rule="nonzero" fill="#E8C900">
            <g id="Group">
                <g id="3" transform="translate(384.000000, 300.000000)">
                    <g id="info" transform="translate(15.000000, 133.000000)">
                        <g id="play_tablet" transform="translate(307.000000, 22.000000)">
                            <path d="M16,1.5 C23.995,1.5 30.5,8.0045 30.5,16 C30.5,23.995 23.995,30.5 16,30.5 C8.0045,30.5 1.5,23.995 1.5,16 C1.5,8.0045 8.0045,1.5 16,1.5 L16,1.5 Z M16,0 C7.1635,0 0,7.163 0,16 C0,24.8365 7.1635,32 16,32 C24.837,32 32,24.8365 32,16 C32,7.163 24.837,0 16,0 L16,0 Z" id="Shape"></path>
                            <path d="M21.787,15.3595 L14.16,10.2735 C14.0645,10.21 13.9595,10.173 13.8525,10.158 C13.7815,10.136 13.7075,10.1205 13.6295,10.1205 C13.215,10.1205 12.8795,10.456 12.8795,10.8705 L12.8795,21.1305 C12.8795,21.5445 13.215,21.8805 13.6295,21.8805 C13.7625,21.8805 13.8855,21.843 13.994,21.7825 C14.051,21.762 14.1075,21.737 14.16,21.702 L21.787,16.615 C22.005,16.47 22.121,16.2305 22.12,15.987 C22.121,15.7435 22.005,15.5045 21.787,15.3595 Z M14.38,12.2225 L20.0255,15.987 L14.38,19.752 L14.38,12.2225 Z" id="Shape"></path>
                        </g>
                    </g>
                </g>
            </g>
        </g>
    </g>
</svg>