<?xml version="1.0" standalone="no"?>
<!DOCTYPE svg PUBLIC "-//W3C//DTD SVG 20010904//EN"
 "http://www.w3.org/TR/2001/REC-SVG-20010904/DTD/svg10.dtd">
<svg version="1.0" xmlns="http://www.w3.org/2000/svg"
 width="21.000000pt" height="12.000000pt" viewBox="0 0 21.000000 12.000000"
 preserveAspectRatio="xMidYMid meet">

<g transform="translate(0.000000,12.000000) scale(0.100000,-0.100000)"
fill="#000000" stroke="none">
<path d="M0 112 c0 -4 14 -13 30 -19 22 -8 36 -24 48 -52 18 -43 42 -55 42
-20 0 24 51 79 74 79 9 0 16 5 16 10 0 6 -42 10 -105 10 -58 0 -105 -4 -105
-8z"/>
</g>
</svg>
