<?xml version="1.0" encoding="UTF-8"?>
<svg width="15px" height="15px" viewBox="0 0 15 15" version="1.1" xmlns="http://www.w3.org/2000/svg" xmlns:xlink="http://www.w3.org/1999/xlink">
    <!-- Generator: Sketch 46.2 (44496) - http://www.bohemiancoding.com/sketch -->
    <title>close_mobile</title>
    <desc>Created with Sketch.</desc>
    <defs></defs>
    <g id="Symbols" stroke="none" stroke-width="1" fill="none" fill-rule="evenodd">
        <g id="mobile/video_landscape" transform="translate(-493.000000, -8.000000)" fill="#FFFFFF">
            <g id="Group">
                <polygon id="close_mobile" points="494.236198 8 493.215775 9.02116911 499.587284 15.3921097 493 21.9795526 494.020423 23 500.607707 16.4125571 506.979216 22.7842194 507.999639 21.763772 501.62813 15.3921097 507.783864 9.23694972 506.762719 8.21578061 500.607707 14.3709406"></polygon>
            </g>
        </g>
    </g>
</svg>