<svg xmlns="http://www.w3.org/2000/svg" xmlns:xlink="http://www.w3.org/1999/xlink" width="26" height="26" viewBox="0 0 26 26">
  <defs>
    <clipPath id="clip-path">
      <rect width="26" height="26" fill="none"/>
    </clipPath>
  </defs>
  <g id="icon_btn_click" data-name="icon/btn/click" transform="translate(0 0)" clip-path="url(#clip-path)">
    <path id="Fill_1" data-name="Fill 1" d="M4.1.024A.889.889,0,0,0,3.56.061C1.619.818.4,3.594.108,5.506c-.9,6.2,3.992,11.575,8.487,15.107,3.992,3.137,11.65,8.293,16.182,3.317A3.736,3.736,0,0,0,26,21.514c-.108-1.514-1.51-2.6-2.589-3.425-.827-.613-2.554-2.307-3.633-2.272-.971.037-1.582,1.045-2.194,1.659L16.5,18.558c-.18.18-2.481-1.334-2.733-1.514a18.351,18.351,0,0,1-2.625-2.055,16.97,16.97,0,0,1-2.121-2.452c-.18-.252-1.655-2.452-1.51-2.632,0,0,1.259-1.37,1.618-1.911.756-1.153,1.33-2.055.468-3.425A8.052,8.052,0,0,0,8.45,3.234,21.853,21.853,0,0,0,6.076,1.142,5.04,5.04,0,0,0,4.1.024Z" fill="#fff"/>
  </g>
</svg>
