<svg xmlns="http://www.w3.org/2000/svg" width="27" height="23" viewBox="0 0 27 23">
    <path fill="#FFF" fill-rule="evenodd" d="M26.555 4.28c.199-1.117.194-2.265-.495-3.133-.962-1.218-3.01-1.263-4.414-1.048-1.14.175-5.002 1.878-6.315 5.956 2.327-.177 3.547.168 3.323 2.73-.094 1.072-.635 2.247-1.24 3.373-.698 1.298-2.007 3.847-3.724 2.01-1.546-1.654-1.43-4.816-1.784-6.922-.196-1.182-.405-2.655-.792-3.87C10.78 2.331 10.015 1.071 9.08.798c-1.005-.296-2.247.165-2.977.595C3.78 2.758 2.01 4.701 0 6.303v.15c.398.38.505 1.005 1.092 1.09 1.383.204 2.701-1.289 3.621.264.56.95.735 1.99 1.092 3.013.48 1.363.849 2.846 1.24 4.413.663 2.655 1.478 6.62 3.771 7.592 1.17.497 2.93-.168 3.82-.696 2.414-1.428 4.293-3.498 5.903-5.604 3.68-4.985 5.709-10.631 6.016-12.245"/>
</svg>
