<?xml version="1.0" encoding="UTF-8"?>
<svg width="25px" height="25px" viewBox="0 0 25 25" version="1.1" xmlns="http://www.w3.org/2000/svg" xmlns:xlink="http://www.w3.org/1999/xlink">
    <!-- Generator: Sketch 46.2 (44496) - http://www.bohemiancoding.com/sketch -->
    <title>instagram</title>
    <desc>Created with Sketch.</desc>
    <defs></defs>
    <g id="Symbols" stroke="none" stroke-width="1" fill="none" fill-rule="evenodd">
        <g id="desktop/footer" transform="translate(-1235.000000, -28.000000)" fill="#FFFFFF">
            <g id="footer">
                <g id="social" transform="translate(1183.000000, 28.000000)">
                    <path d="M64.5011719,-1.77635684e-15 C61.1063449,-1.77635684e-15 60.6802988,0.0148439046 59.3469515,0.07552162 C58.0162085,0.136459755 57.1078657,0.347139033 56.3130658,0.656256836 C55.4909218,0.975530995 54.7935187,1.40261878 54.0987198,2.0976781 C53.4034,2.792477 52.9763123,3.4898801 52.6559964,4.31176366 C52.3460974,5.10682403 52.1351577,6.01542724 52.0752612,7.34564943 C52.0156252,8.67899666 52,9.10530318 52,12.5001302 C52,15.8949572 52.0151043,16.3197012 52.0755216,17.6530485 C52.1367202,18.9837915 52.3473995,19.8921343 52.6562568,20.6869342 C52.9757914,21.5090782 53.4028792,22.2064813 54.0979385,22.9012802 C54.792477,23.5966 55.4898801,24.0247294 56.3115032,24.3440036 C57.106824,24.6531214 58.0154272,24.8638007 59.3459099,24.9247388 C60.6792571,24.9854165 61.1050428,25.0002604 64.4996094,25.0002604 C67.8946968,25.0002604 68.3194408,24.9854165 69.652788,24.9247388 C70.9835311,24.8638007 71.8929156,24.6531214 72.6882363,24.3440036 C73.5101199,24.0247294 74.2064813,23.5966 74.9010198,22.9012802 C75.5963395,22.2064813 76.0234273,21.5090782 76.3437432,20.6871947 C76.651038,19.8921343 76.8619777,18.9835311 76.9244784,17.6533089 C76.9843748,16.3199617 77,15.8949572 77,12.5001302 C77,9.10530318 76.9843748,8.67925708 76.9244784,7.34590985 C76.8619777,6.01516682 76.651038,5.10682403 76.3437432,4.31202408 C76.0234273,3.4898801 75.5963395,2.792477 74.9010198,2.0976781 C74.2057001,1.40235836 73.5103803,0.975270576 72.6874551,0.656256836 C71.8905718,0.347139033 70.9817081,0.136459755 69.6509651,0.07552162 C68.3176179,0.0148439046 67.8931343,1.92442513e-15 64.4972656,1.92442513e-15 L64.5011719,-1.77635684e-15 Z M63.379806,2.25262763 C63.712622,2.25210679 64.08398,2.25262763 64.5011719,2.25262763 C67.8387067,2.25262763 68.2342837,2.26460692 69.5522662,2.32450338 C70.7710289,2.38023313 71.4324941,2.58388108 71.8731237,2.75497661 C72.4564631,2.98154147 72.8723528,3.25237763 73.309597,3.68988219 C73.7471015,4.12738674 74.0179377,4.54405775 74.2450234,5.12739716 C74.4161189,5.56750591 74.6200273,6.22897114 74.6754966,7.44773383 C74.7353931,8.76545589 74.748414,9.16129335 74.748414,12.4972656 C74.748414,15.8332378 74.7353931,16.2290753 74.6754966,17.5467974 C74.6197669,18.7655601 74.4161189,19.4270253 74.2450234,19.867134 C74.0184585,20.4504734 73.7471015,20.8658424 73.309597,21.3030865 C72.8720924,21.740591 72.4567235,22.0114272 71.8731237,22.2379921 C71.4330149,22.4098689 70.7710289,22.612996 69.5522662,22.6687257 C68.2345441,22.7286222 67.8387067,22.7416431 64.5011719,22.7416431 C61.1633767,22.7416431 60.7677997,22.7286222 59.4500776,22.6687257 C58.2313149,22.6124751 57.5698497,22.4088272 57.1289597,22.2377316 C56.5456203,22.0111668 56.1289493,21.7403306 55.6914447,21.3028261 C55.2539401,20.8653215 54.983104,20.4496922 54.7560183,19.8660924 C54.5849228,19.4259836 54.3810144,18.7645184 54.3255451,17.5457557 C54.2656486,16.2280336 54.2536693,15.8321962 54.2536693,12.4941406 C54.2536693,9.15608496 54.2656486,8.76233086 54.3255451,7.4446088 C54.3812748,6.2258461 54.5849228,5.56438088 54.7560183,5.12375129 C54.9825832,4.54041188 55.2539401,4.12374087 55.6914447,3.68623631 C56.1289493,3.24873176 56.5456203,2.9778956 57.1289597,2.7508099 C57.5695893,2.57893311 58.2313149,2.375806 59.4500776,2.31981583 C60.6032146,2.26773196 61.0500943,2.25210679 63.379806,2.2495026 L63.379806,2.25262763 Z M71.1736372,4.32817009 C70.3455036,4.32817009 69.6736216,4.99927083 69.6736216,5.82766487 C69.6736216,6.6557985 70.3455036,7.3276805 71.1736372,7.3276805 C72.0017709,7.3276805 72.6736529,6.6557985 72.6736529,5.82766487 C72.6736529,4.99953125 72.0017709,4.32764925 71.1736372,4.32764925 L71.1736372,4.32817009 Z M64.5011719,6.08079251 C60.9560829,6.08079251 58.0818342,8.9550412 58.0818342,12.5001302 C58.0818342,16.0452192 60.9560829,18.9181658 64.5011719,18.9181658 C68.0462609,18.9181658 70.9194679,16.0452192 70.9194679,12.5001302 C70.9194679,8.9550412 68.0460005,6.08079251 64.5009115,6.08079251 L64.5011719,6.08079251 Z M64.5011719,8.33342014 C66.8022375,8.33342014 68.667882,10.1988042 68.667882,12.5001302 C68.667882,14.8011958 66.8022375,16.6668403 64.5011719,16.6668403 C62.1998458,16.6668403 60.3344618,14.8011958 60.3344618,12.5001302 C60.3344618,10.1988042 62.1998458,8.33342014 64.5011719,8.33342014 L64.5011719,8.33342014 Z" id="instagram"></path>
                </g>
            </g>
        </g>
    </g>
</svg>