<?xml version="1.0" encoding="UTF-8"?>
<svg width="184.1" height="92.647" color-interpolation-filters="sRGB" data-v-0dd9719b="" preserveAspectRatio="xMidYMid" version="1.0" viewBox="0 0 184.1 92.647" xmlns="http://www.w3.org/2000/svg">
 <g fill="#674ea7">
  <g transform="translate(62.05)">
   <rect class="image-rect" width="60" height="58.567" fill="#674ea7" fill-opacity="0" stroke-width="2"/>
   <svg class="image-svg-svg primary" width="60" height="58.567" overflow="visible" filtersec="colorsb9205112020" version="1.1"/>
  </g>
  <path d="m0 66.387h16.72v4.63h-10.66v6.58h8.88v4.65h-8.88v10.11h-6.06zm20.03 7.49h5.53v18.48h-5.53zm6.17-5.07q0 0.66-0.27 1.24-0.26 0.58-0.73 1.02-0.46 0.43-1.07 0.69-0.62 0.26-1.31 0.26-0.68 0-1.27-0.26t-1.04-0.69q-0.46-0.44-0.72-1.02-0.25-0.58-0.25-1.24 0-0.67 0.25-1.26 0.26-0.59 0.72-1.04 0.45-0.44 1.04-0.69t1.27-0.25q0.69 0 1.31 0.25 0.61 0.25 1.07 0.69 0.47 0.45 0.73 1.04 0.27 0.59 0.27 1.26zm18.61 7.51-1.46 1.94q-0.25 0.3-0.48 0.48t-0.66 0.18q-0.41 0-0.74-0.2-0.33-0.19-0.74-0.43t-0.96-0.44q-0.56-0.2-1.38-0.2-1.01 0-1.75 0.38-0.74 0.37-1.22 1.07-0.48 0.69-0.72 1.7-0.23 1.01-0.23 2.27 0 2.66 1.03 4.09 1.02 1.42 2.82 1.42 0.97 0 1.53-0.24t0.95-0.53q0.39-0.3 0.72-0.55t0.83-0.25q0.66 0 1 0.48l1.6 1.98q-0.85 0.98-1.8 1.6-0.94 0.61-1.93 0.96t-1.99 0.48q-1 0.14-1.94 0.14-1.69 0-3.24-0.65-1.54-0.64-2.71-1.86-1.16-1.22-1.85-3-0.69-1.79-0.69-4.07 0-1.99 0.6-3.73t1.77-3.01q1.16-1.28 2.88-2.01t3.99-0.73q2.17 0 3.81 0.7 1.64 0.69 2.96 2.03zm9.02 16.33q-1.32 0-2.32-0.39-1.01-0.38-1.7-1.09-0.68-0.7-1.04-1.7t-0.36-2.23v-9.55h-1.57q-0.42 0-0.73-0.28-0.3-0.27-0.3-0.81v-2.15l2.94-0.57 1.09-4.51q0.21-0.86 1.21-0.86h2.89v5.4h4.49v3.78h-4.49v9.18q0 0.64 0.31 1.06t0.9 0.42q0.3 0 0.51-0.06 0.2-0.07 0.36-0.15 0.15-0.08 0.28-0.14t0.31-0.06q0.25 0 0.4 0.12 0.15 0.11 0.32 0.36l1.67 2.62q-1.07 0.8-2.41 1.2-1.33 0.41-2.76 0.41zm7.95-18.77h5.53v18.48h-5.53zm6.17-5.07q0 0.66-0.27 1.24t-0.73 1.02q-0.46 0.43-1.08 0.69-0.61 0.26-1.31 0.26-0.68 0-1.26-0.26-0.59-0.26-1.05-0.69-0.45-0.44-0.71-1.02t-0.26-1.24q0-0.67 0.26-1.26t0.71-1.04q0.46-0.44 1.05-0.69 0.58-0.25 1.26-0.25 0.7 0 1.31 0.25 0.62 0.25 1.08 0.69 0.46 0.45 0.73 1.04t0.27 1.26zm11.73 4.78q1.83 0 3.36 0.57 1.52 0.57 2.62 1.66 1.09 1.09 1.71 2.66 0.61 1.58 0.61 3.58 0 0.62-0.05 1.01-0.05 0.4-0.19 0.63-0.15 0.23-0.39 0.32t-0.61 0.09h-10.66q0.26 2.31 1.41 3.36 1.14 1.04 2.94 1.04 0.96 0 1.65-0.23 0.7-0.23 1.24-0.52 0.55-0.28 1-0.52 0.46-0.23 0.96-0.23 0.65 0 0.99 0.48l1.61 1.98q-0.86 0.98-1.85 1.6-0.99 0.61-2.03 0.96t-2.08 0.48q-1.05 0.14-1.99 0.14-1.95 0-3.65-0.64-1.7-0.63-2.97-1.88-1.28-1.25-2.02-3.1t-0.74-4.31q0-1.86 0.63-3.52 0.64-1.65 1.82-2.9 1.19-1.25 2.87-1.98 1.69-0.73 3.81-0.73zm0.11 3.81q-1.59 0-2.48 0.9t-1.18 2.6h6.9q0-0.66-0.17-1.29-0.17-0.62-0.55-1.11-0.39-0.49-1.01-0.79-0.62-0.31-1.51-0.31zm28.05-3.52-7.16 18.48h-5.03l-7.17-18.48h4.6q0.59 0 0.99 0.27 0.4 0.28 0.55 0.69l2.56 8.29q0.31 1.01 0.58 1.98 0.28 0.96 0.47 1.92 0.2-0.96 0.49-1.92 0.28-0.97 0.6-1.98l2.68-8.29q0.14-0.41 0.53-0.69 0.39-0.27 0.93-0.27zm9.52-0.29q1.84 0 3.36 0.57 1.53 0.57 2.62 1.66 1.1 1.09 1.71 2.66 0.62 1.58 0.62 3.58 0 0.62-0.06 1.01-0.05 0.4-0.19 0.63t-0.39 0.32q-0.24 0.09-0.61 0.09h-10.66q0.27 2.31 1.41 3.36 1.14 1.04 2.94 1.04 0.96 0 1.66-0.23 0.69-0.23 1.24-0.52 0.54-0.28 0.99-0.52 0.46-0.23 0.96-0.23 0.66 0 1 0.48l1.6 1.98q-0.86 0.98-1.84 1.6-0.99 0.61-2.04 0.96-1.04 0.35-2.08 0.48-1.04 0.14-1.99 0.14-1.94 0-3.64-0.64-1.71-0.63-2.98-1.88-1.28-1.25-2.02-3.1t-0.74-4.31q0-1.86 0.64-3.52 0.63-1.65 1.82-2.9 1.18-1.25 2.87-1.98 1.68-0.73 3.8-0.73zm0.11 3.81q-1.59 0-2.48 0.9t-1.18 2.6h6.9q0-0.66-0.17-1.29-0.17-0.62-0.55-1.11t-1.01-0.79q-0.62-0.31-1.51-0.31zm41.82 1.97q0 2.81-0.98 5.19-0.97 2.38-2.73 4.12-1.77 1.74-4.25 2.71-2.49 0.97-5.52 0.97h-10.09v-25.97h10.09q3.03 0 5.52 0.98 2.48 0.98 4.25 2.71 1.76 1.73 2.73 4.11 0.98 2.38 0.98 5.18zm-6.17 0q0-1.93-0.5-3.48t-1.44-2.63q-0.93-1.08-2.29-1.66-1.35-0.58-3.08-0.58h-4.03v16.71h4.03q1.73 0 3.08-0.58 1.36-0.58 2.29-1.66 0.94-1.08 1.44-2.63t0.5-3.49zm20.11-12.98v16.56q0 2.17-0.55 3.96-0.54 1.78-1.64 3.05-1.09 1.28-2.75 1.98-1.66 0.71-3.91 0.71-1.01 0-2-0.11t-2.06-0.36l0.32-3.51q0.04-0.46 0.37-0.75 0.33-0.28 0.91-0.28 0.31 0 0.75 0.09 0.45 0.1 1.07 0.1 0.88 0 1.53-0.24t1.07-0.8q0.43-0.56 0.65-1.47 0.21-0.91 0.21-2.25v-16.68zm10.87 0v25.97h-6.06v-25.97z"/>
  <g transform="matrix(.18378 0 0 .18378 62.05 0)">
   <path d="m0 0h326.47v318.68h-326.47z" fill="none" pointer-events="none"/>
   <g fill="#03bfd7">
    <path class="st1" d="m13.433 160.3c0 83.2 67.5 150.7 150.7 150.7s150.7-67.5 150.7-150.7-67.5-150.7-150.7-150.7c-83.2 0.1-150.7 67.5-150.7 150.7zm241.1 0c0 49.9-40.5 90.4-90.4 90.4s-90.4-40.5-90.4-90.4 40.5-90.4 90.4-90.4 90.4 40.5 90.4 90.4z"/>
    <path class="st1" d="m314.83 160.3c0-83.2-67.5-150.7-150.7-150.7s-150.7 67.5-150.7 150.7c0-74.9 60.7-135.6 135.6-135.6s135.6 60.7 135.6 135.6c0 58.3-47.2 105.5-105.5 105.5s-105.5-47.2-105.5-105.5c0 66.6 54 120.5 120.5 120.5 66.7 0.1 120.7-53.9 120.7-120.5z"/>
    <path class="st1" d="m13.433 160.3c0 83.2 67.5 150.7 150.7 150.7s150.7-67.4 150.7-150.7c0 74.9-60.7 135.6-135.6 135.6s-135.6-60.7-135.6-135.6c0-58.3 47.2-105.5 105.5-105.5s105.5 47.2 105.5 105.5c0-66.6-54-120.5-120.5-120.5-66.7 0-120.7 54-120.7 120.5z"/>
   </g>
   <path class="st2" d="m314.83 160.3c0-83.2-67.5-150.7-150.7-150.7s-150.7 67.5-150.7 150.7c0-74.9 60.7-135.6 135.6-135.6s135.6 60.7 135.6 135.6c0 58.3-47.2 105.5-105.5 105.5s-105.5-47.2-105.5-105.5c0 66.6 54 120.5 120.5 120.5 66.7 0.1 120.7-53.9 120.7-120.5z" fill="#78cfe1"/>
   <path class="st3" d="m13.433 160.3c0 83.2 67.5 150.7 150.7 150.7s150.7-67.4 150.7-150.7c0 74.9-60.7 135.6-135.6 135.6s-135.6-60.7-135.6-135.6c0-58.3 47.2-105.5 105.5-105.5s105.5 47.2 105.5 105.5c0-66.6-54-120.5-120.5-120.5-66.7 0-120.7 54-120.7 120.5z" fill="#08a7bc"/>
  </g>
 </g>
</svg>
