<?xml version="1.0" standalone="no"?>
<!DOCTYPE svg PUBLIC "-//W3C//DTD SVG 20010904//EN"
 "http://www.w3.org/TR/2001/REC-SVG-20010904/DTD/svg10.dtd">
<svg version="1.0" xmlns="http://www.w3.org/2000/svg"
 width="348.000000pt" height="348.000000pt" viewBox="0 0 348.000000 348.000000"
 preserveAspectRatio="xMidYMid meet">

<g transform="translate(0.000000,348.000000) scale(0.100000,-0.100000)"
fill="#000000" stroke="none">
<path d="M1645 2962 c-62 -22 -1506 -943 -1555 -993 -59 -58 -84 -121 -85
-209 0 -91 23 -148 85 -210 80 -80 198 -108 300 -73 33 11 305 179 695 428
352 225 647 409 655 409 9 0 303 -184 655 -409 352 -225 663 -417 690 -427
139 -49 296 16 361 149 24 48 29 70 29 133 -1 88 -26 152 -85 209 -49 50
-1493 971 -1555 993 -64 22 -126 22 -190 0z"/>
<path d="M1645 2002 c-27 -10 -295 -175 -595 -366 -300 -192 -630 -403 -735
-470 -208 -133 -250 -168 -285 -242 -33 -67 -34 -178 -3 -245 63 -138 225
-210 363 -162 34 11 303 178 690 425 350 224 643 410 651 413 9 3 105 -52 244
-141 975 -624 1085 -692 1136 -704 138 -33 282 38 343 169 15 34 21 66 21 121
-1 88 -26 151 -85 209 -49 50 -1493 971 -1555 993 -64 22 -127 22 -190 0z"/>
</g>
</svg>
