<?xml version="1.0" standalone="no"?>
<!DOCTYPE svg PUBLIC "-//W3C//DTD SVG 20010904//EN"
 "http://www.w3.org/TR/2001/REC-SVG-20010904/DTD/svg10.dtd">
<svg version="1.0" xmlns="http://www.w3.org/2000/svg"
 width="900.000000pt" height="969.000000pt" viewBox="0 0 900.000000 969.000000"
 preserveAspectRatio="xMidYMid meet">
<metadata>
Created by potrace 1.16, written by Peter Selinger 2001-2019
</metadata>
<g transform="translate(0.000000,969.000000) scale(0.100000,-0.100000)"
fill="#000000" stroke="none">
<path d="M2915 9262 c-92 -33 -524 -317 -755 -496 -121 -94 -349 -316 -407
-396 -146 -205 -198 -365 -197 -610 0 -219 25 -353 170 -916 120 -468 392
-1229 616 -1724 325 -719 732 -1291 1339 -1885 305 -298 492 -453 808 -673
1085 -755 1534 -997 1935 -1043 217 -24 431 36 669 188 149 95 313 228 715
578 156 135 174 154 194 205 33 82 30 234 -6 353 -51 170 -197 421 -367 632
-245 304 -595 633 -856 806 -129 85 -184 105 -253 90 -203 -44 -479 -305 -693
-657 -69 -113 -170 -316 -217 -434 -19 -47 -35 -86 -36 -88 -3 -6 -205 114
-339 203 -306 202 -516 375 -795 655 -440 440 -748 870 -1039 1450 -172 345
-295 656 -380 961 -59 214 -71 187 102 230 640 162 1064 381 1169 604 28 60
30 73 25 138 -4 62 -17 100 -90 272 -381 894 -695 1372 -1005 1527 -75 38 -92
42 -170 45 -66 3 -99 -1 -137 -15z"/>
<path d="M4237 9010 c-60 -5 -111 -11 -114 -14 -3 -2 22 -49 55 -103 32 -54
92 -158 132 -230 l72 -133 152 0 c1276 -1 2477 -736 3076 -1884 408 -780 509
-1700 278 -2530 -17 -61 -32 -120 -35 -131 -3 -14 25 -54 93 -135 53 -63 131
-164 175 -223 l78 -108 15 36 c9 20 32 81 51 136 264 732 301 1559 105 2324
-314 1226 -1201 2238 -2378 2714 -341 138 -694 226 -1062 267 -165 18 -546 26
-693 14z"/>
<path d="M1109 7130 c-260 -409 -457 -927 -543 -1425 -44 -253 -51 -345 -51
-680 0 -336 7 -426 51 -685 213 -1243 1018 -2321 2160 -2893 415 -208 893
-346 1384 -399 176 -19 642 -16 825 6 248 29 490 78 704 142 l85 26 -150 77
c-156 81 -242 129 -385 216 -83 52 -87 53 -134 44 -191 -36 -625 -50 -865 -29
-447 40 -876 164 -1277 369 -348 178 -615 373 -893 651 -575 574 -925 1310
-1011 2125 -16 153 -16 556 -1 700 40 357 126 693 259 1009 l46 109 -78 321
c-42 177 -81 332 -84 346 -7 23 -9 22 -42 -30z"/>
</g>
</svg>
