<?xml version="1.0" encoding="utf-8"?>
<svg version="1.1" id="logo" xmlns="http://www.w3.org/2000/svg" xmlns:xlink="http://www.w3.org/1999/xlink" x="0px" y="0px"
	 viewBox="0 0 210 42" enable-background="new 0 0 210 42" xml:space="preserve">
<polygon fill="#9EC42A" points="153.1,41.5 80.6,41.5 84.4,34.9 156.6,34.9 "/>
<path fill="#FFFFFF" d="M91.9,36.4l-1.2,3.8h-0.5l-0.9-3l-1,3h-0.5l-1.2-3.8h0.5l0.9,3.2l1-3.2h0.4l1,3.2l0.9-3.2H91.9z M92.9,40.2
	h-0.4v-3.8h0.4V40.2z M96.6,36.4v0.4h-1.3v3.3h-0.5v-3.3h-1.3v-0.4H96.6z M100.3,36.4v3.8h-0.5v-1.7h-2.2v1.7h-0.4v-3.8h0.4v1.7h2.2
	v-1.7H100.3z M104.3,36.4c0.4,0,0.7,0.1,1.1,0.3v0.5c-0.3-0.2-0.6-0.3-1-0.3c-0.8,0-1.6,0.5-1.6,1.5c0,1,0.8,1.5,1.6,1.5
	c0.4,0,0.7-0.1,1-0.3V40c-0.3,0.2-0.7,0.3-1.1,0.3c-0.9,0-2-0.7-2-1.9C102.4,37,103.4,36.4,104.3,36.4L104.3,36.4z M106.7,38.9h1.7
	l-0.8-1.8c0,0,0-0.1-0.1-0.1c0,0.1,0,0.1-0.1,0.1L106.7,38.9L106.7,38.9z M105.7,40.2l1.6-3.8h0.5l1.6,3.8h-0.5l-0.4-0.9h-2
	l-0.4,0.9H105.7z M110.4,38.3h1c0.5,0,0.9-0.2,0.9-0.7c0-0.6-0.5-0.7-0.9-0.7h-1V38.3z M110,40.2v-3.8h1.5c0.7,0,1.4,0.3,1.4,1.1
	c0,0.7-0.5,1-1,1.1l1.3,1.5h-0.6l-1.2-1.5h-0.9v1.5L110,40.2L110,40.2z M116.2,36.4v0.4h-2.1v1.2h1.9v0.4h-1.9v1.3h2.1v0.4h-2.6
	v-3.8H116.2z M120.9,36.4v0.4h-2.1v1.3h1.9v0.4h-1.9v1.6h-0.5v-3.8H120.9z M123.3,36.8c-1,0-1.5,0.7-1.5,1.5c0,0.8,0.5,1.5,1.5,1.5
	c1,0,1.5-0.7,1.5-1.5C124.8,37.5,124.3,36.8,123.3,36.8z M123.3,36.4c1.3,0,2,1,2,1.9c0,1-0.7,1.9-2,1.9c-1.3,0-2-1-2-1.9
	C121.3,37.3,121.9,36.4,123.3,36.4z M126.4,38.3h1c0.5,0,0.9-0.2,0.9-0.7c0-0.6-0.5-0.7-0.9-0.7h-1V38.3z M126,40.2v-3.8h1.5
	c0.7,0,1.4,0.3,1.4,1.1c0,0.7-0.5,1-1,1.1l1.3,1.5h-0.6l-1.2-1.5h-0.9v1.5L126,40.2L126,40.2z M131,40.2v-3.8h0.4l2.3,3v-0.3v-2.7
	h0.5v3.8h-0.4l-2.3-3v0.3v2.7H131z M135.7,38.9h1.7l-0.8-1.8c0,0,0-0.1-0.1-0.1c0,0.1,0,0.1-0.1,0.1L135.7,38.9L135.7,38.9z
	 M134.7,40.2l1.6-3.8h0.5l1.6,3.8H138l-0.4-0.9h-2l-0.4,0.9H134.7L134.7,40.2z M141.2,36.4v0.4h-1.3v3.3h-0.5v-3.3h-1.3v-0.4H141.2z
	 M144.9,36.4v2.4c0,1.1-0.7,1.4-1.6,1.4c-0.8,0-1.6-0.4-1.6-1.4v-2.4h0.5v2.4c0,0.8,0.5,1,1.1,1c0.6,0,1.1-0.3,1.1-1v-2.4H144.9z
	 M146.3,38.3h1c0.5,0,0.9-0.2,0.9-0.7c0-0.6-0.5-0.7-0.9-0.7h-1V38.3z M145.9,40.2v-3.8h1.5c0.7,0,1.4,0.3,1.4,1.1
	c0,0.7-0.5,1-1,1.1l1.3,1.5h-0.6l-1.2-1.5h-0.9v1.5L145.9,40.2L145.9,40.2z M152.1,36.4v0.4H150v1.2h1.9v0.4H150v1.3h2.1v0.4h-2.6
	v-3.8H152.1z"/>
<path fill="#454545" d="M16.5,1.1c3.2,0,6.3,0.7,9.1,1.9v6c-2.2-1.5-5.2-2.3-8.2-2.3C12,6.7,6.8,9.5,6.8,16.4
	c0,7.9,5.8,9.8,10.1,9.8c1.3,0,2.4-0.2,3.3-0.5V15.2h6v14.7c-3,1.3-6.3,2-9.6,2c-8.3,0-16.3-4.5-16.3-15.4C0.4,5.7,8.4,1.1,16.5,1.1
	L16.5,1.1z M42.1,10.5v5.7c-3.2-0.5-6.3,0.7-7.5,3.1v11.9h-5.9V10.9h5.2v3C35.3,11.7,38.3,10.1,42.1,10.5z M52.7,14.8
	c-2.5,0-4.7,1.6-4.8,4.3h9C57.2,17.8,56.4,14.8,52.7,14.8z M52.5,10.4c8.4,0,11.1,6.6,9.8,12.6H48c0.7,3,3.8,4.2,7.1,4.2
	c2.3,0,4.4-0.5,6.1-1.2v4.6c-1.9,0.8-4.4,1.3-7.4,1.3c-6.4,0-11.7-3.7-11.7-10.7C42.1,13.4,47.9,10.4,52.5,10.4L52.5,10.4z
	 M74.4,14.8c-2.5,0-4.7,1.6-4.8,4.3h9C78.8,17.8,78,14.8,74.4,14.8z M74.1,10.4c8.4,0,11.1,6.6,9.8,12.6H69.6c0.7,3,3.8,4.2,7.1,4.2
	c2.3,0,4.4-0.5,6.1-1.2v4.6c-1.9,0.8-4.4,1.3-7.4,1.3c-6.4,0-11.7-3.7-11.7-10.7C63.7,13.4,69.6,10.4,74.1,10.4L74.1,10.4z
	 M97.5,10.4c5.3,0,8.2,3.6,8.2,8.3v12.5h-5.9V19.4c0-2.7-1.6-4-3.9-4c-2.1,0-3.7,1.4-4.5,2.6v13.2h-5.9V10.9h5.2v2.6
	C92.3,11.7,94.6,10.4,97.5,10.4L97.5,10.4z M138.8,10.9l-6.5,20.3h-6.2L122,18l-4,13.2h-6.2l-6.5-20.3h6.3l3.7,13.9l4.1-13.9h5.6
	l4,13.9l3.7-13.9H138.8z M143.7,25.1c0,1.5,1.4,2.5,3.2,2.5c1.6,0,3.2-0.5,4.6-1.6v-3.2c-0.9-0.2-2.2-0.5-3.5-0.5
	C145.9,22.3,143.7,23.1,143.7,25.1z M158.8,27.3c0.3,0,0.7,0,1.1-0.2V31c-0.9,0.3-2.1,0.6-3.3,0.6c-2.1,0-3.6-0.8-4.5-2.3
	c-2,1.6-4.3,2.5-7.3,2.5c-3.8,0-7.1-2.2-7.1-6.2c0-5.2,4.9-6.8,8.9-6.8c1.6,0,3.4,0.2,4.8,0.5v-0.7c0-2-1.6-3.4-4.8-3.4
	c-2.8,0-5.3,0.8-7.2,1.5v-5.1c1.6-0.6,4.7-1.4,7.9-1.4c6.1,0,10,2.5,10,9.2V26C157.3,27,158,27.3,158.8,27.3L158.8,27.3z
	 M173.8,10.9h6.1l-9,22.7c-2.3,5.7-5.4,7.4-8.7,7.4c-1.1,0-2.1-0.2-3.2-0.5v-4.9c0.8,0.2,1.6,0.3,2.4,0.3c2.1,0,3.7-1.4,4.8-4.4
	l0-0.1l-9.6-20.6h6.2l5.9,13.7L173.8,10.9L173.8,10.9z M184,5.8l26.4,15.3L184,36.3V5.8z"/>
</svg>
